beam-commits mailing list archives

Site index · List index
Message view « Date » · « Thread »
Top « Date » · « Thread »
From Apache Jenkins Server <jenk...@builds.apache.org>
Subject Build failed in Jenkins: beam_PostCommit_Java_MavenInstall #3526
Date Sat, 29 Apr 2017 12:25:53 GMT
See <https://builds.apache.org/job/beam_PostCommit_Java_MavenInstall/3526/display/redirect>

------------------------------------------
[...truncated 1.82 MB...]
2017-04-29T12:25:15.672 [INFO] Excluding org.apache.beam:beam-sdks-java-extensions-gcp-core:jar:0.7.0-SNAPSHOT
from the shaded jar.
2017-04-29T12:25:15.672 [INFO] Excluding com.google.http-client:google-http-client-jackson2:jar:1.22.0
from the shaded jar.
2017-04-29T12:25:15.672 [INFO] Excluding com.google.auth:google-auth-library-oauth2-http:jar:0.6.1
from the shaded jar.
2017-04-29T12:25:15.672 [INFO] Excluding com.google.api-client:google-api-client:jar:1.22.0
from the shaded jar.
2017-04-29T12:25:15.672 [INFO] Excluding com.google.oauth-client:google-oauth-client:jar:1.22.0
from the shaded jar.
2017-04-29T12:25:15.672 [INFO] Excluding com.google.cloud.bigdataoss:gcsio:jar:1.4.5 from
the shaded jar.
2017-04-29T12:25:15.672 [INFO] Excluding com.google.api-client:google-api-client-java6:jar:1.22.0
from the shaded jar.
2017-04-29T12:25:15.672 [INFO] Excluding com.google.api-client:google-api-client-jackson2:jar:1.22.0
from the shaded jar.
2017-04-29T12:25:15.672 [INFO] Excluding com.google.oauth-client:google-oauth-client-java6:jar:1.22.0
from the shaded jar.
2017-04-29T12:25:15.672 [INFO] Excluding com.google.cloud.bigdataoss:util:jar:1.4.5 from the
shaded jar.
2017-04-29T12:25:15.672 [INFO] Excluding com.google.apis:google-api-services-cloudresourcemanager:jar:v1-rev6-1.22.0
from the shaded jar.
2017-04-29T12:25:15.672 [INFO] Excluding com.google.apis:google-api-services-storage:jar:v1-rev71-1.22.0
from the shaded jar.
2017-04-29T12:25:15.672 [INFO] Excluding com.google.auth:google-auth-library-credentials:jar:0.6.1
from the shaded jar.
2017-04-29T12:25:15.672 [INFO] Excluding org.apache.beam:beam-runners-core-java:jar:0.7.0-SNAPSHOT
from the shaded jar.
2017-04-29T12:25:15.672 [INFO] Excluding org.apache.beam:beam-sdks-common-runner-api:jar:0.7.0-SNAPSHOT
from the shaded jar.
2017-04-29T12:25:15.672 [INFO] Excluding org.apache.beam:beam-runners-core-construction-java:jar:0.7.0-SNAPSHOT
from the shaded jar.
2017-04-29T12:25:15.672 [INFO] Excluding org.apache.beam:beam-runners-google-cloud-dataflow-java:jar:0.7.0-SNAPSHOT
from the shaded jar.
2017-04-29T12:25:15.672 [INFO] Excluding org.apache.beam:beam-sdks-java-io-google-cloud-platform:jar:0.7.0-SNAPSHOT
from the shaded jar.
2017-04-29T12:25:15.672 [INFO] Excluding org.apache.beam:beam-sdks-java-extensions-protobuf:jar:0.7.0-SNAPSHOT
from the shaded jar.
2017-04-29T12:25:15.672 [INFO] Excluding com.google.apis:google-api-services-bigquery:jar:v2-rev295-1.22.0
from the shaded jar.
2017-04-29T12:25:15.672 [INFO] Excluding com.google.apis:google-api-services-pubsub:jar:v1-rev10-1.22.0
from the shaded jar.
2017-04-29T12:25:15.672 [INFO] Excluding com.google.api.grpc:grpc-google-pubsub-v1:jar:0.1.0
from the shaded jar.
2017-04-29T12:25:15.672 [INFO] Excluding com.google.api.grpc:grpc-google-iam-v1:jar:0.1.0
from the shaded jar.
2017-04-29T12:25:15.672 [INFO] Excluding com.google.cloud.datastore:datastore-v1-proto-client:jar:1.4.0
from the shaded jar.
2017-04-29T12:25:15.672 [INFO] Excluding com.google.http-client:google-http-client-jackson:jar:1.22.0
from the shaded jar.
2017-04-29T12:25:15.672 [INFO] Excluding com.google.cloud.datastore:datastore-v1-protos:jar:1.3.0
from the shaded jar.
2017-04-29T12:25:15.672 [INFO] Excluding io.grpc:grpc-auth:jar:1.2.0 from the shaded jar.
2017-04-29T12:25:15.672 [INFO] Excluding io.netty:netty-handler:jar:4.1.8.Final from the shaded
jar.
2017-04-29T12:25:15.672 [INFO] Excluding io.netty:netty-codec:jar:4.1.8.Final from the shaded
jar.
2017-04-29T12:25:15.672 [INFO] Excluding io.grpc:grpc-all:jar:1.2.0 from the shaded jar.
2017-04-29T12:25:15.672 [INFO] Excluding io.grpc:grpc-okhttp:jar:1.2.0 from the shaded jar.
2017-04-29T12:25:15.672 [INFO] Excluding com.squareup.okhttp:okhttp:jar:2.5.0 from the shaded
jar.
2017-04-29T12:25:15.672 [INFO] Excluding com.squareup.okio:okio:jar:1.6.0 from the shaded
jar.
2017-04-29T12:25:15.672 [INFO] Excluding io.grpc:grpc-protobuf-nano:jar:1.2.0 from the shaded
jar.
2017-04-29T12:25:15.672 [INFO] Excluding com.google.protobuf.nano:protobuf-javanano:jar:3.0.0-alpha-5
from the shaded jar.
2017-04-29T12:25:15.672 [INFO] Excluding com.google.cloud.bigtable:bigtable-protos:jar:0.9.6
from the shaded jar.
2017-04-29T12:25:15.672 [INFO] Excluding com.google.cloud.bigtable:bigtable-client-core:jar:0.9.6
from the shaded jar.
2017-04-29T12:25:15.672 [INFO] Excluding com.google.auth:google-auth-library-appengine:jar:0.6.0
from the shaded jar.
2017-04-29T12:25:15.672 [INFO] Excluding com.google.appengine:appengine-api-1.0-sdk:jar:1.9.34
from the shaded jar.
2017-04-29T12:25:15.672 [INFO] Excluding io.dropwizard.metrics:metrics-core:jar:3.1.2 from
the shaded jar.
2017-04-29T12:25:15.672 [INFO] Excluding com.google.api.grpc:grpc-google-common-protos:jar:0.1.0
from the shaded jar.
2017-04-29T12:25:15.672 [INFO] Excluding io.netty:netty-tcnative-boringssl-static:jar:1.1.33.Fork26
from the shaded jar.
2017-04-29T12:25:15.672 [INFO] Excluding com.google.http-client:google-http-client-protobuf:jar:1.22.0
from the shaded jar.
2017-04-29T12:25:15.672 [INFO] Excluding com.google.apis:google-api-services-dataflow:jar:v1b3-rev196-1.22.0
from the shaded jar.
2017-04-29T12:25:15.672 [INFO] Excluding com.google.apis:google-api-services-clouddebugger:jar:v2-rev8-1.22.0
from the shaded jar.
2017-04-29T12:25:15.672 [INFO] Excluding org.apache.beam:beam-sdks-common-fn-api:jar:0.7.0-SNAPSHOT
from the shaded jar.
2017-04-29T12:25:15.672 [INFO] Excluding io.grpc:grpc-protobuf:jar:1.2.0 from the shaded jar.
2017-04-29T12:25:15.672 [INFO] Excluding com.google.protobuf:protobuf-java-util:jar:3.2.0
from the shaded jar.
2017-04-29T12:25:15.672 [INFO] Excluding com.google.code.gson:gson:jar:2.7 from the shaded
jar.
2017-04-29T12:25:15.672 [INFO] Excluding io.grpc:grpc-protobuf-lite:jar:1.2.0 from the shaded
jar.
2017-04-29T12:25:15.672 [INFO] Excluding com.fasterxml.jackson.core:jackson-databind:jar:2.8.8
from the shaded jar.
2017-04-29T12:25:15.672 [INFO] Excluding com.google.code.findbugs:jsr305:jar:3.0.1 from the
shaded jar.
2017-04-29T12:25:15.672 [INFO] Including com.google.guava:guava:jar:20.0 in the shaded jar.
2017-04-29T12:25:15.672 [INFO] Excluding com.google.protobuf:protobuf-java:jar:3.2.0 from
the shaded jar.
2017-04-29T12:25:15.672 [INFO] Excluding io.grpc:grpc-core:jar:1.2.0 from the shaded jar.
2017-04-29T12:25:15.672 [INFO] Excluding io.grpc:grpc-context:jar:1.2.0 from the shaded jar.
2017-04-29T12:25:15.672 [INFO] Excluding com.google.instrumentation:instrumentation-api:jar:0.3.0
from the shaded jar.
2017-04-29T12:25:15.672 [INFO] Excluding io.grpc:grpc-netty:jar:1.2.0 from the shaded jar.
2017-04-29T12:25:15.672 [INFO] Excluding io.netty:netty-codec-http2:jar:4.1.8.Final from the
shaded jar.
2017-04-29T12:25:15.672 [INFO] Excluding io.netty:netty-codec-http:jar:4.1.8.Final from the
shaded jar.
2017-04-29T12:25:15.672 [INFO] Excluding io.netty:netty-handler-proxy:jar:4.1.8.Final from
the shaded jar.
2017-04-29T12:25:15.672 [INFO] Excluding io.netty:netty-codec-socks:jar:4.1.8.Final from the
shaded jar.
2017-04-29T12:25:15.673 [INFO] Excluding io.grpc:grpc-stub:jar:1.2.0 from the shaded jar.
2017-04-29T12:25:15.673 [INFO] Excluding io.netty:netty-transport-native-epoll:jar:linux-x86_64:4.1.8.Final
from the shaded jar.
2017-04-29T12:25:15.673 [INFO] Excluding io.netty:netty-common:jar:4.1.8.Final from the shaded
jar.
2017-04-29T12:25:15.673 [INFO] Excluding io.netty:netty-buffer:jar:4.1.8.Final from the shaded
jar.
2017-04-29T12:25:15.673 [INFO] Excluding io.netty:netty-transport:jar:4.1.8.Final from the
shaded jar.
2017-04-29T12:25:15.673 [INFO] Excluding io.netty:netty-resolver:jar:4.1.8.Final from the
shaded jar.
2017-04-29T12:25:15.673 [INFO] Excluding org.slf4j:slf4j-api:jar:1.7.14 from the shaded jar.
2017-04-29T12:25:16.686 [INFO] Replacing original artifact with shaded artifact.
2017-04-29T12:25:16.686 [INFO] Replacing <https://builds.apache.org/job/beam_PostCommit_Java_MavenInstall/ws/sdks/java/harness/target/beam-sdks-java-harness-0.7.0-SNAPSHOT.jar>
with <https://builds.apache.org/job/beam_PostCommit_Java_MavenInstall/ws/sdks/java/harness/target/beam-sdks-java-harness-0.7.0-SNAPSHOT-shaded.jar>
2017-04-29T12:25:16.687 [INFO] Dependency-reduced POM written at: <https://builds.apache.org/job/beam_PostCommit_Java_MavenInstall/ws/sdks/java/harness/dependency-reduced-pom.xml>
2017-04-29T12:25:16.772 [INFO] 
2017-04-29T12:25:16.772 [INFO] --- maven-javadoc-plugin:2.10.4:jar (attach-javadocs) @ beam-sdks-java-harness
---
2017-04-29T12:25:18.896 [INFO] Building jar: <https://builds.apache.org/job/beam_PostCommit_Java_MavenInstall/ws/sdks/java/harness/target/beam-sdks-java-harness-0.7.0-SNAPSHOT-javadoc.jar>
2017-04-29T12:25:18.910 [INFO] 
2017-04-29T12:25:18.911 [INFO] --- maven-source-plugin:3.0.1:jar-no-fork (attach-sources)
@ beam-sdks-java-harness ---
2017-04-29T12:25:18.913 [INFO] Building jar: <https://builds.apache.org/job/beam_PostCommit_Java_MavenInstall/ws/sdks/java/harness/target/beam-sdks-java-harness-0.7.0-SNAPSHOT-sources.jar>
2017-04-29T12:25:18.925 [INFO] 
2017-04-29T12:25:18.925 [INFO] --- maven-source-plugin:3.0.1:test-jar-no-fork (attach-test-sources)
@ beam-sdks-java-harness ---
2017-04-29T12:25:18.928 [INFO] Building jar: <https://builds.apache.org/job/beam_PostCommit_Java_MavenInstall/ws/sdks/java/harness/target/beam-sdks-java-harness-0.7.0-SNAPSHOT-test-sources.jar>
2017-04-29T12:25:18.938 [INFO] 
2017-04-29T12:25:18.938 [INFO] --- maven-jar-plugin:3.0.2:test-jar (default-test-jar) @ beam-sdks-java-harness
---
2017-04-29T12:25:18.947 [INFO] Building jar: <https://builds.apache.org/job/beam_PostCommit_Java_MavenInstall/ws/sdks/java/harness/target/beam-sdks-java-harness-0.7.0-SNAPSHOT-tests.jar>
2017-04-29T12:25:18.957 [INFO] 
2017-04-29T12:25:18.957 [INFO] --- maven-dependency-plugin:3.0.0:analyze-only (default) @
beam-sdks-java-harness ---
2017-04-29T12:25:19.044 [WARNING] Used undeclared dependencies found:
2017-04-29T12:25:19.044 [WARNING]    org.apache.beam:beam-runners-core-construction-java:jar:0.7.0-SNAPSHOT:compile
2017-04-29T12:25:19.044 [WARNING]    org.apache.beam:beam-sdks-common-runner-api:jar:0.7.0-SNAPSHOT:compile
2017-04-29T12:25:19.046 [INFO]                                                           
             
2017-04-29T12:25:19.046 [INFO] ------------------------------------------------------------------------
2017-04-29T12:25:19.046 [INFO] Skipping Apache Beam :: Parent
2017-04-29T12:25:19.046 [INFO] This project has been banned from the build due to previous
failures.
2017-04-29T12:25:19.046 [INFO] ------------------------------------------------------------------------
[JENKINS] Archiving disabled
[JENKINS] Archiving disabled
[JENKINS] Archiving disabled
[JENKINS] Archiving disabled
[JENKINS] Archiving disabled
[JENKINS] Archiving disabled
[JENKINS] Archiving disabled
[JENKINS] Archiving disabled
[JENKINS] Archiving disabled
[JENKINS] Archiving disabled
[JENKINS] Archiving disabled
[JENKINS] Archiving disabled
[JENKINS] Archiving disabled
[JENKINS] Archiving disabled
[JENKINS] Archiving disabled
[JENKINS] Archiving disabled
[JENKINS] Archiving disabled
[JENKINS] Archiving disabled
[JENKINS] Archiving disabled
[JENKINS] Archiving disabled
[JENKINS] Archiving disabled
[JENKINS] Archiving disabled
[JENKINS] Archiving disabled
[JENKINS] Archiving disabled
[JENKINS] Archiving disabled
[JENKINS] Archiving disabled
[JENKINS] Archiving disabled
[JENKINS] Archiving disabled
[JENKINS] Archiving disabled
[JENKINS] Archiving disabled
[JENKINS] Archiving disabled
[JENKINS] Archiving disabled
[JENKINS] Archiving disabled
[JENKINS] Archiving disabled
[JENKINS] Archiving disabled
[JENKINS] Archiving disabled
[JENKINS] Archiving disabled
[JENKINS] Archiving disabled
[JENKINS] Archiving disabled
[JENKINS] Archiving disabled
[JENKINS] Archiving disabled
[JENKINS] Archiving disabled
[JENKINS] Archiving disabled
[JENKINS] Archiving disabled
[JENKINS] Archiving disabled
[JENKINS] Archiving disabled
2017-04-29T12:25:37.991 [INFO] ------------------------------------------------------------------------
2017-04-29T12:25:37.991 [INFO] Reactor Summary:
2017-04-29T12:25:37.991 [INFO] 
2017-04-29T12:25:37.992 [INFO] Apache Beam :: Parent .............................. SUCCESS
[ 28.398 s]
2017-04-29T12:25:37.992 [INFO] Apache Beam :: SDKs :: Java :: Build Tools ......... SUCCESS
[ 12.138 s]
2017-04-29T12:25:37.992 [INFO] Apache Beam :: SDKs ................................ SUCCESS
[  5.836 s]
2017-04-29T12:25:37.992 [INFO] Apache Beam :: SDKs :: Common ...................... SUCCESS
[  2.091 s]
2017-04-29T12:25:37.992 [INFO] Apache Beam :: SDKs :: Common :: Fn API ............ SUCCESS
[ 22.157 s]
2017-04-29T12:25:37.992 [INFO] Apache Beam :: SDKs :: Common :: Runner API ........ SUCCESS
[ 16.571 s]
2017-04-29T12:25:37.992 [INFO] Apache Beam :: SDKs :: Java ........................ SUCCESS
[  4.008 s]
2017-04-29T12:25:37.992 [INFO] Apache Beam :: SDKs :: Java :: Core ................ SUCCESS
[02:54 min]
2017-04-29T12:25:37.992 [INFO] Apache Beam :: SDKs :: Java :: IO .................. SUCCESS
[  1.961 s]
2017-04-29T12:25:37.992 [INFO] Apache Beam :: SDKs :: Java :: IO :: Common ........ SUCCESS
[  4.517 s]
2017-04-29T12:25:37.992 [INFO] Apache Beam :: Runners ............................. SUCCESS
[  1.759 s]
2017-04-29T12:25:37.992 [INFO] Apache Beam :: Runners :: Core Construction Java ... SUCCESS
[ 18.123 s]
2017-04-29T12:25:37.992 [INFO] Apache Beam :: Runners :: Core Java ................ SUCCESS
[ 42.248 s]
2017-04-29T12:25:37.992 [INFO] Apache Beam :: Runners :: Direct Java .............. SUCCESS
[02:28 min]
2017-04-29T12:25:37.992 [INFO] Apache Beam :: SDKs :: Java :: IO :: Elasticsearch . SUCCESS
[ 32.697 s]
2017-04-29T12:25:37.992 [INFO] Apache Beam :: SDKs :: Java :: Extensions .......... SUCCESS
[  1.541 s]
2017-04-29T12:25:37.992 [INFO] Apache Beam :: SDKs :: Java :: Extensions :: Google Cloud Platform
Core SUCCESS [ 26.836 s]
2017-04-29T12:25:37.992 [INFO] Apache Beam :: SDKs :: Java :: Extensions :: Protobuf SUCCESS
[ 17.851 s]
2017-04-29T12:25:37.992 [INFO] Apache Beam :: SDKs :: Java :: IO :: Google Cloud Platform
SUCCESS [01:26 min]
2017-04-29T12:25:37.992 [INFO] Apache Beam :: SDKs :: Java :: IO :: Hadoop Common . SUCCESS
[ 18.619 s]
2017-04-29T12:25:37.992 [INFO] Apache Beam :: SDKs :: Java :: IO :: Hadoop ........ SUCCESS
[  3.510 s]
2017-04-29T12:25:37.992 [INFO] Apache Beam :: SDKs :: Java :: IO :: Hadoop :: input-format
SUCCESS [ 16.680 s]
2017-04-29T12:25:37.992 [INFO] Apache Beam :: Runners :: Google Cloud Dataflow .... SUCCESS
[ 30.186 s]
2017-04-29T12:25:37.992 [INFO] Apache Beam :: SDKs :: Java :: IO :: Hadoop :: jdk1.8-tests
SUCCESS [01:11 min]
2017-04-29T12:25:37.992 [INFO] Apache Beam :: SDKs :: Java :: IO :: HBase ......... SUCCESS
[01:02 min]
2017-04-29T12:25:37.992 [INFO] Apache Beam :: SDKs :: Java :: IO :: HDFS .......... SUCCESS
[ 19.334 s]
2017-04-29T12:25:37.992 [INFO] Apache Beam :: SDKs :: Java :: IO :: JDBC .......... SUCCESS
[ 21.466 s]
2017-04-29T12:25:37.992 [INFO] Apache Beam :: SDKs :: Java :: IO :: JMS ........... SUCCESS
[ 17.168 s]
2017-04-29T12:25:37.992 [INFO] Apache Beam :: SDKs :: Java :: IO :: Kafka ......... SUCCESS
[ 20.468 s]
2017-04-29T12:25:37.992 [INFO] Apache Beam :: SDKs :: Java :: IO :: Kinesis ....... SUCCESS
[ 20.144 s]
2017-04-29T12:25:37.992 [INFO] Apache Beam :: SDKs :: Java :: IO :: MongoDB ....... SUCCESS
[ 38.077 s]
2017-04-29T12:25:37.992 [INFO] Apache Beam :: SDKs :: Java :: IO :: MQTT .......... SUCCESS
[ 23.301 s]
2017-04-29T12:25:37.992 [INFO] Apache Beam :: SDKs :: Java :: IO :: XML ........... SUCCESS
[ 30.009 s]
2017-04-29T12:25:37.992 [INFO] Apache Beam :: SDKs :: Java :: Maven Archetypes .... SUCCESS
[  1.789 s]
2017-04-29T12:25:37.992 [INFO] Apache Beam :: SDKs :: Java :: Maven Archetypes :: Starter
SUCCESS [ 14.841 s]
2017-04-29T12:25:37.992 [INFO] Apache Beam :: SDKs :: Java :: Maven Archetypes :: Examples
SUCCESS [ 39.383 s]
2017-04-29T12:25:37.993 [INFO] Apache Beam :: SDKs :: Java :: Maven Archetypes :: Examples
- Java 8 SUCCESS [ 40.619 s]
2017-04-29T12:25:37.993 [INFO] Apache Beam :: SDKs :: Java :: Extensions :: Jackson SUCCESS
[ 18.181 s]
2017-04-29T12:25:37.993 [INFO] Apache Beam :: SDKs :: Java :: Extensions :: Join library SUCCESS
[ 20.166 s]
2017-04-29T12:25:37.993 [INFO] Apache Beam :: SDKs :: Java :: Extensions :: Sorter  SUCCESS
[ 45.351 s]
2017-04-29T12:25:37.993 [INFO] Apache Beam :: SDKs :: Java :: Harness ............. FAILURE
[ 38.487 s]
2017-04-29T12:25:37.993 [INFO] Apache Beam :: SDKs :: Java :: Java 8 Tests ........ SKIPPED
2017-04-29T12:25:37.993 [INFO] Apache Beam :: SDKs :: Python ...................... SKIPPED
2017-04-29T12:25:37.993 [INFO] Apache Beam :: Runners :: Flink .................... SKIPPED
2017-04-29T12:25:37.993 [INFO] Apache Beam :: Runners :: Spark .................... SKIPPED
2017-04-29T12:25:37.993 [INFO] Apache Beam :: Runners :: Apex ..................... SKIPPED
2017-04-29T12:25:37.993 [INFO] Apache Beam :: Examples ............................ SKIPPED
2017-04-29T12:25:37.993 [INFO] Apache Beam :: Examples :: Java .................... SKIPPED
2017-04-29T12:25:37.993 [INFO] Apache Beam :: Examples :: Java 8 .................. SKIPPED
2017-04-29T12:25:37.993 [INFO] Apache Beam :: SDKs :: Java :: Aggregated Javadoc .. SKIPPED
2017-04-29T12:25:37.993 [INFO] ------------------------------------------------------------------------
2017-04-29T12:25:37.993 [INFO] BUILD FAILURE
2017-04-29T12:25:37.993 [INFO] ------------------------------------------------------------------------
2017-04-29T12:25:37.993 [INFO] Total time: 22:02 min
2017-04-29T12:25:37.993 [INFO] Finished at: 2017-04-29T12:25:37+00:00
2017-04-29T12:25:38.897 [INFO] Final Memory: 272M/1832M
2017-04-29T12:25:38.897 [INFO] ------------------------------------------------------------------------
Waiting for Jenkins to finish collecting data
2017-04-29T12:25:43.685 [ERROR] Failed to execute goal org.apache.maven.plugins:maven-dependency-plugin:3.0.0:analyze-only
(default) on project beam-sdks-java-harness: Dependency problems found -> [Help 1]
org.apache.maven.lifecycle.LifecycleExecutionException: Failed to execute goal org.apache.maven.plugins:maven-dependency-plugin:3.0.0:analyze-only
(default) on project beam-sdks-java-harness: Dependency problems found
	at org.apache.maven.lifecycle.internal.MojoExecutor.execute(MojoExecutor.java:216)
	at org.apache.maven.lifecycle.internal.MojoExecutor.execute(MojoExecutor.java:153)
	at org.apache.maven.lifecycle.internal.MojoExecutor.execute(MojoExecutor.java:145)
	at org.apache.maven.lifecycle.internal.LifecycleModuleBuilder.buildProject(LifecycleModuleBuilder.java:116)
	at org.apache.maven.lifecycle.internal.LifecycleModuleBuilder.buildProject(LifecycleModuleBuilder.java:80)
	at org.apache.maven.lifecycle.internal.builder.singlethreaded.SingleThreadedBuilder.build(SingleThreadedBuilder.java:51)
	at org.apache.maven.lifecycle.internal.LifecycleStarter.execute(LifecycleStarter.java:128)
	at org.apache.maven.DefaultMaven.doExecute(DefaultMaven.java:307)
	at org.apache.maven.DefaultMaven.doExecute(DefaultMaven.java:193)
	at org.apache.maven.DefaultMaven.execute(DefaultMaven.java:106)
	at org.jvnet.hudson.maven3.launcher.Maven33Launcher.main(Maven33Launcher.java:129)
	at sun.reflect.NativeMethodAccessorImpl.invoke0(Native Method)
	at sun.reflect.NativeMethodAccessorImpl.invoke(NativeMethodAccessorImpl.java:62)
	at sun.reflect.DelegatingMethodAccessorImpl.invoke(DelegatingMethodAccessorImpl.java:43)
	at java.lang.reflect.Method.invoke(Method.java:498)
	at org.codehaus.plexus.classworlds.launcher.Launcher.launchStandard(Launcher.java:330)
	at org.codehaus.plexus.classworlds.launcher.Launcher.launch(Launcher.java:238)
	at jenkins.maven3.agent.Maven33Main.launch(Maven33Main.java:176)
	at sun.reflect.NativeMethodAccessorImpl.invoke0(Native Method)
	at sun.reflect.NativeMethodAccessorImpl.invoke(NativeMethodAccessorImpl.java:62)
	at sun.reflect.DelegatingMethodAccessorImpl.invoke(DelegatingMethodAccessorImpl.java:43)
	at java.lang.reflect.Method.invoke(Method.java:498)
	at hudson.maven.Maven3Builder.call(Maven3Builder.java:139)
	at hudson.maven.Maven3Builder.call(Maven3Builder.java:70)
	at hudson.remoting.UserRequest.perform(UserRequest.java:153)
	at hudson.remoting.UserRequest.perform(UserRequest.java:50)
	at hudson.remoting.Request$2.run(Request.java:336)
	at hudson.remoting.InterceptingExecutorService$1.call(InterceptingExecutorService.java:68)
	at java.util.concurrent.FutureTask.run(FutureTask.java:266)
	at java.util.concurrent.ThreadPoolExecutor.runWorker(ThreadPoolExecutor.java:1142)
	at java.util.concurrent.ThreadPoolExecutor$Worker.run(ThreadPoolExecutor.java:617)
	at java.lang.Thread.run(Thread.java:745)
Caused by: org.apache.maven.plugin.MojoExecutionException: Dependency problems found
	at org.apache.maven.plugins.dependency.analyze.AbstractAnalyzeMojo.execute(AbstractAnalyzeMojo.java:261)
	at org.apache.maven.plugin.DefaultBuildPluginManager.executeMojo(DefaultBuildPluginManager.java:134)
	at org.apache.maven.lifecycle.internal.MojoExecutor.execute(MojoExecutor.java:208)
	... 31 more
2017-04-29T12:25:43.686 [ERROR] 
2017-04-29T12:25:43.686 [ERROR] Re-run Maven using the -X switch to enable full debug logging.
2017-04-29T12:25:43.686 [ERROR] 
2017-04-29T12:25:43.686 [ERROR] For more information about the errors and possible solutions,
please read the following articles:
2017-04-29T12:25:43.686 [ERROR] [Help 1] http://cwiki.apache.org/confluence/display/MAVEN/MojoExecutionException
2017-04-29T12:25:43.686 [ERROR] 
2017-04-29T12:25:43.686 [ERROR] After correcting the problems, you can resume the build with
the command
2017-04-29T12:25:43.686 [ERROR]   mvn <goals> -rf :beam-sdks-java-harness
channel stopped

Mime
View raw message