beam-commits mailing list archives

Site index · List index
Message view « Date » · « Thread »
Top « Date » · « Thread »
From Apache Jenkins Server <jenk...@builds.apache.org>
Subject Build failed in Jenkins: beam_PostCommit_Java_ValidatesRunner_Flink #2426
Date Thu, 20 Apr 2017 18:45:29 GMT
See <https://builds.apache.org/job/beam_PostCommit_Java_ValidatesRunner_Flink/2426/display/redirect?page=changes>

Changes:

[dhalperi] Add javadoc to the Metric interfaces

------------------------------------------
[...truncated 594.49 KB...]
2017-04-20T18:44:13.859 [INFO] Downloaded: https://repo.maven.apache.org/maven2/org/codehaus/woodstox/stax2-api/3.1.4/stax2-api-3.1.4.jar
(159 KB at 280.8 KB/sec)
2017-04-20T18:44:13.859 [INFO] Downloading: https://repo.maven.apache.org/maven2/org/codehaus/woodstox/woodstox-core-asl/4.4.1/woodstox-core-asl-4.4.1.jar
2017-04-20T18:44:13.947 [INFO] Downloaded: https://repo.maven.apache.org/maven2/org/apache/commons/commons-lang3/3.5/commons-lang3-3.5.jar
(469 KB at 719.9 KB/sec)
2017-04-20T18:44:13.947 [INFO] Downloading: https://repo.maven.apache.org/maven2/com/google/auto/service/auto-service/1.0-rc2/auto-service-1.0-rc2.jar
2017-04-20T18:44:13.976 [INFO] Downloaded: https://repo.maven.apache.org/maven2/com/google/auto/service/auto-service/1.0-rc2/auto-service-1.0-rc2.jar
(11 KB at 14.9 KB/sec)
2017-04-20T18:44:13.976 [INFO] Downloading: https://repo.maven.apache.org/maven2/com/google/auto/auto-common/0.3/auto-common-0.3.jar
2017-04-20T18:44:13.995 [INFO] Downloaded: https://repo.maven.apache.org/maven2/org/xerial/snappy/snappy-java/1.1.4-M3/snappy-java-1.1.4-M3.jar
(1471 KB at 2103.6 KB/sec)
2017-04-20T18:44:13.995 [INFO] Downloading: https://repo.maven.apache.org/maven2/com/google/auto/value/auto-value/1.3/auto-value-1.3.jar
2017-04-20T18:44:13.999 [INFO] Downloaded: https://repo.maven.apache.org/maven2/org/codehaus/woodstox/woodstox-core-asl/4.4.1/woodstox-core-asl-4.4.1.jar
(475 KB at 675.1 KB/sec)
2017-04-20T18:44:13.999 [INFO] Downloading: https://repo.maven.apache.org/maven2/com/fasterxml/jackson/dataformat/jackson-dataformat-yaml/2.8.8/jackson-dataformat-yaml-2.8.8.jar
2017-04-20T18:44:13.999 [INFO] Downloaded: https://repo.maven.apache.org/maven2/joda-time/joda-time/2.4/joda-time-2.4.jar
(573 KB at 814.3 KB/sec)
2017-04-20T18:44:13.999 [INFO] Downloading: https://repo.maven.apache.org/maven2/org/yaml/snakeyaml/1.17/snakeyaml-1.17.jar
2017-04-20T18:44:14.007 [INFO] Downloaded: https://repo.maven.apache.org/maven2/com/google/auto/auto-common/0.3/auto-common-0.3.jar
(39 KB at 53.6 KB/sec)
2017-04-20T18:44:14.007 [INFO] Downloading: https://repo.maven.apache.org/maven2/org/hamcrest/hamcrest-all/1.3/hamcrest-all-1.3.jar
2017-04-20T18:44:14.029 [INFO] Downloaded: https://repo.maven.apache.org/maven2/com/fasterxml/jackson/dataformat/jackson-dataformat-yaml/2.8.8/jackson-dataformat-yaml-2.8.8.jar
(40 KB at 54.5 KB/sec)
2017-04-20T18:44:14.029 [INFO] Downloading: https://repo.maven.apache.org/maven2/org/slf4j/slf4j-jdk14/1.7.14/slf4j-jdk14-1.7.14.jar
2017-04-20T18:44:14.056 [INFO] Downloaded: https://repo.maven.apache.org/maven2/org/slf4j/slf4j-jdk14/1.7.14/slf4j-jdk14-1.7.14.jar
(8 KB at 10.0 KB/sec)
2017-04-20T18:44:14.056 [INFO] Downloading: https://repo.maven.apache.org/maven2/org/mockito/mockito-all/1.9.5/mockito-all-1.9.5.jar
2017-04-20T18:44:14.075 [INFO] Downloaded: https://repo.maven.apache.org/maven2/org/yaml/snakeyaml/1.17/snakeyaml-1.17.jar
(268 KB at 343.0 KB/sec)
2017-04-20T18:44:14.075 [INFO] Downloading: https://repo.maven.apache.org/maven2/com/google/cloud/dataflow/google-cloud-dataflow-java-proto-library-all/0.5.160304/google-cloud-dataflow-java-proto-library-all-0.5.160304.jar
2017-04-20T18:44:14.109 [INFO] Downloaded: https://repo.maven.apache.org/maven2/com/google/cloud/dataflow/google-cloud-dataflow-java-proto-library-all/0.5.160304/google-cloud-dataflow-java-proto-library-all-0.5.160304.jar
(53 KB at 64.8 KB/sec)
2017-04-20T18:44:14.109 [INFO] Downloading: https://repo.maven.apache.org/maven2/com/esotericsoftware/kryo/kryo/2.21/kryo-2.21.jar
2017-04-20T18:44:14.112 [INFO] Downloaded: https://repo.maven.apache.org/maven2/org/hamcrest/hamcrest-all/1.3/hamcrest-all-1.3.jar
(300 KB at 366.9 KB/sec)
2017-04-20T18:44:14.112 [INFO] Downloading: https://repo.maven.apache.org/maven2/com/esotericsoftware/reflectasm/reflectasm/1.07/reflectasm-1.07-shaded.jar
2017-04-20T18:44:14.157 [INFO] Downloaded: https://repo.maven.apache.org/maven2/com/esotericsoftware/reflectasm/reflectasm/1.07/reflectasm-1.07-shaded.jar
(65 KB at 74.4 KB/sec)
2017-04-20T18:44:14.157 [INFO] Downloading: https://repo.maven.apache.org/maven2/org/ow2/asm/asm/4.0/asm-4.0.jar
2017-04-20T18:44:14.189 [INFO] Downloaded: https://repo.maven.apache.org/maven2/org/ow2/asm/asm/4.0/asm-4.0.jar
(45 KB at 50.3 KB/sec)
2017-04-20T18:44:14.189 [INFO] Downloading: https://repo.maven.apache.org/maven2/com/esotericsoftware/minlog/minlog/1.2/minlog-1.2.jar
2017-04-20T18:44:14.216 [INFO] Downloaded: https://repo.maven.apache.org/maven2/com/esotericsoftware/minlog/minlog/1.2/minlog-1.2.jar
(5 KB at 5.3 KB/sec)
2017-04-20T18:44:14.216 [INFO] Downloading: https://repo.maven.apache.org/maven2/org/objenesis/objenesis/1.2/objenesis-1.2.jar
2017-04-20T18:44:14.219 [INFO] Downloaded: https://repo.maven.apache.org/maven2/net/bytebuddy/byte-buddy/1.6.8/byte-buddy-1.6.8.jar
(2706 KB at 2928.4 KB/sec)
2017-04-20T18:44:14.248 [INFO] Downloaded: https://repo.maven.apache.org/maven2/com/esotericsoftware/kryo/kryo/2.21/kryo-2.21.jar
(355 KB at 372.8 KB/sec)
2017-04-20T18:44:14.249 [INFO] Downloaded: https://repo.maven.apache.org/maven2/org/objenesis/objenesis/1.2/objenesis-1.2.jar
(36 KB at 36.9 KB/sec)
2017-04-20T18:44:14.255 [INFO] Downloaded: https://repo.maven.apache.org/maven2/com/google/auto/value/auto-value/1.3/auto-value-1.3.jar
(1380 KB at 1438.9 KB/sec)
2017-04-20T18:44:14.369 [INFO] Downloaded: https://repo.maven.apache.org/maven2/org/mockito/mockito-all/1.9.5/mockito-all-1.9.5.jar
(1545 KB at 1439.0 KB/sec)
2017-04-20T18:44:14.567 [INFO] 
2017-04-20T18:44:14.567 [INFO] --- maven-clean-plugin:3.0.0:clean (default-clean) @ beam-sdks-java-core
---
2017-04-20T18:44:14.569 [INFO] Deleting <https://builds.apache.org/job/beam_PostCommit_Java_ValidatesRunner_Flink/ws/sdks/java/core>
(includes = [**/*.pyc, **/*.egg-info/], excludes = [])
2017-04-20T18:44:14.868 [INFO] 
2017-04-20T18:44:14.868 [INFO] --- maven-enforcer-plugin:1.4.1:enforce (enforce) @ beam-sdks-java-core
---
2017-04-20T18:44:18.762 [INFO] 
2017-04-20T18:44:18.762 [INFO] --- jacoco-maven-plugin:0.7.8:prepare-agent (default) @ beam-sdks-java-core
---
2017-04-20T18:44:18.767 [INFO] Downloading: https://repo.maven.apache.org/maven2/junit/junit/4.8.2/junit-4.8.2.pom
2017-04-20T18:44:18.792 [INFO] Downloaded: https://repo.maven.apache.org/maven2/junit/junit/4.8.2/junit-4.8.2.pom
(2 KB at 57.9 KB/sec)
2017-04-20T18:44:18.794 [INFO] Downloading: https://repo.maven.apache.org/maven2/org/apache/maven/maven-artifact-manager/2.0.2/maven-artifact-manager-2.0.2.pom
2017-04-20T18:44:18.819 [INFO] Downloaded: https://repo.maven.apache.org/maven2/org/apache/maven/maven-artifact-manager/2.0.2/maven-artifact-manager-2.0.2.pom
(2 KB at 54.5 KB/sec)
2017-04-20T18:44:18.822 [INFO] Downloading: https://repo.maven.apache.org/maven2/org/apache/maven/maven-repository-metadata/2.0.2/maven-repository-metadata-2.0.2.pom
2017-04-20T18:44:18.848 [INFO] Downloaded: https://repo.maven.apache.org/maven2/org/apache/maven/maven-repository-metadata/2.0.2/maven-repository-metadata-2.0.2.pom
(2 KB at 49.1 KB/sec)
2017-04-20T18:44:18.854 [INFO] Downloading: https://repo.maven.apache.org/maven2/org/apache/maven/maven-plugin-api/2.0.10/maven-plugin-api-2.0.10.pom
2017-04-20T18:44:18.880 [INFO] Downloaded: https://repo.maven.apache.org/maven2/org/apache/maven/maven-plugin-api/2.0.10/maven-plugin-api-2.0.10.pom
(2 KB at 56.2 KB/sec)
2017-04-20T18:44:18.883 [INFO] Downloading: https://repo.maven.apache.org/maven2/org/jacoco/org.jacoco.agent/0.7.8/org.jacoco.agent-0.7.8.pom
2017-04-20T18:44:18.909 [INFO] Downloaded: https://repo.maven.apache.org/maven2/org/jacoco/org.jacoco.agent/0.7.8/org.jacoco.agent-0.7.8.pom
(3 KB at 108.0 KB/sec)
2017-04-20T18:44:18.913 [INFO] Downloading: https://repo.maven.apache.org/maven2/org/jacoco/org.jacoco.core/0.7.8/org.jacoco.core-0.7.8.pom
2017-04-20T18:44:18.940 [INFO] Downloaded: https://repo.maven.apache.org/maven2/org/jacoco/org.jacoco.core/0.7.8/org.jacoco.core-0.7.8.pom
(2 KB at 45.5 KB/sec)
2017-04-20T18:44:18.956 [INFO] Downloading: https://repo.maven.apache.org/maven2/org/ow2/asm/asm-debug-all/5.1/asm-debug-all-5.1.pom
2017-04-20T18:44:18.984 [INFO] Downloaded: https://repo.maven.apache.org/maven2/org/ow2/asm/asm-debug-all/5.1/asm-debug-all-5.1.pom
(2 KB at 69.1 KB/sec)
2017-04-20T18:44:18.986 [INFO] Downloading: https://repo.maven.apache.org/maven2/org/jacoco/org.jacoco.report/0.7.8/org.jacoco.report-0.7.8.pom
2017-04-20T18:44:19.016 [INFO] Downloaded: https://repo.maven.apache.org/maven2/org/jacoco/org.jacoco.report/0.7.8/org.jacoco.report-0.7.8.pom
(2 KB at 43.8 KB/sec)
2017-04-20T18:44:19.026 [INFO] Downloading: https://repo.maven.apache.org/maven2/junit/junit/4.8.2/junit-4.8.2.jar
2017-04-20T18:44:19.026 [INFO] Downloading: https://repo.maven.apache.org/maven2/org/apache/maven/doxia/doxia-core/1.1.2/doxia-core-1.1.2.jar
2017-04-20T18:44:19.026 [INFO] Downloading: https://repo.maven.apache.org/maven2/xerces/xercesImpl/2.8.1/xercesImpl-2.8.1.jar
2017-04-20T18:44:19.027 [INFO] Downloading: https://repo.maven.apache.org/maven2/commons-codec/commons-codec/1.2/commons-codec-1.2.jar
2017-04-20T18:44:19.027 [INFO] Downloading: https://repo.maven.apache.org/maven2/commons-httpclient/commons-httpclient/3.1/commons-httpclient-3.1.jar
2017-04-20T18:44:19.071 [INFO] Downloaded: https://repo.maven.apache.org/maven2/commons-codec/commons-codec/1.2/commons-codec-1.2.jar
(30 KB at 667.7 KB/sec)
2017-04-20T18:44:19.071 [INFO] Downloading: https://repo.maven.apache.org/maven2/org/apache/maven/doxia/doxia-site-renderer/1.1.2/doxia-site-renderer-1.1.2.jar
2017-04-20T18:44:19.074 [INFO] Downloaded: https://repo.maven.apache.org/maven2/org/apache/maven/doxia/doxia-core/1.1.2/doxia-core-1.1.2.jar
(155 KB at 3220.6 KB/sec)
2017-04-20T18:44:19.074 [INFO] Downloading: https://repo.maven.apache.org/maven2/org/apache/maven/doxia/doxia-decoration-model/1.1.2/doxia-decoration-model-1.1.2.jar
2017-04-20T18:44:19.114 [INFO] Downloaded: https://repo.maven.apache.org/maven2/org/apache/maven/doxia/doxia-decoration-model/1.1.2/doxia-decoration-model-1.1.2.jar
(52 KB at 587.1 KB/sec)
2017-04-20T18:44:19.115 [INFO] Downloading: https://repo.maven.apache.org/maven2/org/apache/maven/doxia/doxia-module-xhtml/1.1.2/doxia-module-xhtml-1.1.2.jar
2017-04-20T18:44:19.115 [INFO] Downloaded: https://repo.maven.apache.org/maven2/junit/junit/4.8.2/junit-4.8.2.jar
(232 KB at 2575.3 KB/sec)
2017-04-20T18:44:19.115 [INFO] Downloading: https://repo.maven.apache.org/maven2/org/apache/maven/doxia/doxia-module-fml/1.1.2/doxia-module-fml-1.1.2.jar
2017-04-20T18:44:19.115 [INFO] Downloaded: https://repo.maven.apache.org/maven2/commons-httpclient/commons-httpclient/3.1/commons-httpclient-3.1.jar
(298 KB at 3346.7 KB/sec)
2017-04-20T18:44:19.116 [INFO] Downloading: https://repo.maven.apache.org/maven2/commons-collections/commons-collections/3.2/commons-collections-3.2.jar
2017-04-20T18:44:19.116 [INFO] Downloaded: https://repo.maven.apache.org/maven2/org/apache/maven/doxia/doxia-site-renderer/1.1.2/doxia-site-renderer-1.1.2.jar
(50 KB at 553.5 KB/sec)
2017-04-20T18:44:19.116 [INFO] Downloading: https://repo.maven.apache.org/maven2/org/jacoco/org.jacoco.agent/0.7.8/org.jacoco.agent-0.7.8-runtime.jar
2017-04-20T18:44:19.143 [INFO] Downloaded: https://repo.maven.apache.org/maven2/org/apache/maven/doxia/doxia-module-xhtml/1.1.2/doxia-module-xhtml-1.1.2.jar
(15 KB at 126.3 KB/sec)
2017-04-20T18:44:19.143 [INFO] Downloading: https://repo.maven.apache.org/maven2/org/jacoco/org.jacoco.core/0.7.8/org.jacoco.core-0.7.8.jar
2017-04-20T18:44:19.159 [INFO] Downloaded: https://repo.maven.apache.org/maven2/org/apache/maven/doxia/doxia-module-fml/1.1.2/doxia-module-fml-1.1.2.jar
(37 KB at 276.7 KB/sec)
2017-04-20T18:44:19.159 [INFO] Downloading: https://repo.maven.apache.org/maven2/org/ow2/asm/asm-debug-all/5.1/asm-debug-all-5.1.jar
2017-04-20T18:44:19.193 [INFO] Downloaded: https://repo.maven.apache.org/maven2/org/jacoco/org.jacoco.core/0.7.8/org.jacoco.core-0.7.8.jar
(122 KB at 731.9 KB/sec)
2017-04-20T18:44:19.193 [INFO] Downloading: https://repo.maven.apache.org/maven2/org/jacoco/org.jacoco.report/0.7.8/org.jacoco.report-0.7.8.jar
2017-04-20T18:44:19.200 [INFO] Downloaded: https://repo.maven.apache.org/maven2/org/jacoco/org.jacoco.agent/0.7.8/org.jacoco.agent-0.7.8-runtime.jar
(252 KB at 1452.6 KB/sec)
2017-04-20T18:44:19.237 [INFO] Downloaded: https://repo.maven.apache.org/maven2/org/jacoco/org.jacoco.report/0.7.8/org.jacoco.report-0.7.8.jar
(125 KB at 592.4 KB/sec)
2017-04-20T18:44:19.247 [INFO] Downloaded: https://repo.maven.apache.org/maven2/commons-collections/commons-collections/3.2/commons-collections-3.2.jar
(558 KB at 2535.8 KB/sec)
2017-04-20T18:44:19.248 [INFO] Downloaded: https://repo.maven.apache.org/maven2/org/ow2/asm/asm-debug-all/5.1/asm-debug-all-5.1.jar
(379 KB at 1713.4 KB/sec)
2017-04-20T18:44:19.264 [INFO] Downloaded: https://repo.maven.apache.org/maven2/xerces/xercesImpl/2.8.1/xercesImpl-2.8.1.jar
(1185 KB at 4977.0 KB/sec)
2017-04-20T18:44:19.370 [INFO] argLine set to -javaagent:<https://builds.apache.org/job/beam_PostCommit_Java_ValidatesRunner_Flink/ws/.repository/org/jacoco/org.jacoco.agent/0.7.8/org.jacoco.agent-0.7.8-runtime.jar=destfile=/home/jenkins/jenkins-slave/workspace/beam_PostCommit_Java_ValidatesRunner_Flink/sdks/java/core/target/jacoco.exec,excludes=**/AutoValue_*.class,dumponexit=true,output=file>
2017-04-20T18:44:19.600 [INFO] 
2017-04-20T18:44:19.600 [INFO] --- avro-maven-plugin:1.8.1:schema (schemas) @ beam-sdks-java-core
---
2017-04-20T18:44:19.606 [INFO] Downloading: https://repo.maven.apache.org/maven2/org/apache/avro/avro-compiler/1.8.1/avro-compiler-1.8.1.pom
2017-04-20T18:44:19.728 [INFO] Downloaded: https://repo.maven.apache.org/maven2/org/apache/avro/avro-compiler/1.8.1/avro-compiler-1.8.1.pom
(5 KB at 39.8 KB/sec)
2017-04-20T18:44:19.743 [INFO] Downloading: https://repo.maven.apache.org/maven2/org/apache/commons/commons-compress/1.8.1/commons-compress-1.8.1.pom
2017-04-20T18:44:19.771 [INFO] Downloaded: https://repo.maven.apache.org/maven2/org/apache/commons/commons-compress/1.8.1/commons-compress-1.8.1.pom
(12 KB at 398.7 KB/sec)
2017-04-20T18:44:19.777 [INFO] Downloading: https://repo.maven.apache.org/maven2/org/slf4j/slf4j-api/1.7.7/slf4j-api-1.7.7.pom
2017-04-20T18:44:19.815 [INFO] Downloaded: https://repo.maven.apache.org/maven2/org/slf4j/slf4j-api/1.7.7/slf4j-api-1.7.7.pom
(3 KB at 69.1 KB/sec)
2017-04-20T18:44:19.818 [INFO] Downloading: https://repo.maven.apache.org/maven2/org/slf4j/slf4j-parent/1.7.7/slf4j-parent-1.7.7.pom
2017-04-20T18:44:19.848 [INFO] Downloaded: https://repo.maven.apache.org/maven2/org/slf4j/slf4j-parent/1.7.7/slf4j-parent-1.7.7.pom
(12 KB at 387.6 KB/sec)
2017-04-20T18:44:19.852 [INFO] Downloading: https://repo.maven.apache.org/maven2/joda-time/joda-time/2.7/joda-time-2.7.pom
2017-04-20T18:44:19.882 [INFO] Downloaded: https://repo.maven.apache.org/maven2/joda-time/joda-time/2.7/joda-time-2.7.pom
(28 KB at 930.8 KB/sec)
2017-04-20T18:44:19.887 [INFO] Downloading: https://repo.maven.apache.org/maven2/org/slf4j/slf4j-simple/1.7.7/slf4j-simple-1.7.7.pom
2017-04-20T18:44:19.915 [INFO] Downloaded: https://repo.maven.apache.org/maven2/org/slf4j/slf4j-simple/1.7.7/slf4j-simple-1.7.7.pom
(2 KB at 51.3 KB/sec)
2017-04-20T18:44:19.948 [INFO] Downloading: https://repo.maven.apache.org/maven2/org/apache/maven/maven-plugin-api/2.0.10/maven-plugin-api-2.0.10.jar
2017-04-20T18:44:19.948 [INFO] Downloading: https://repo.maven.apache.org/maven2/org/apache/maven/maven-model/2.0.10/maven-model-2.0.10.jar
2017-04-20T18:44:19.949 [INFO] Downloading: https://repo.maven.apache.org/maven2/org/apache/maven/maven-artifact-manager/2.0.10/maven-artifact-manager-2.0.10.jar
2017-04-20T18:44:19.950 [INFO] Downloading: https://repo.maven.apache.org/maven2/org/apache/maven/maven-repository-metadata/2.0.10/maven-repository-metadata-2.0.10.jar
2017-04-20T18:44:19.957 [INFO] Downloading: https://repo.maven.apache.org/maven2/org/codehaus/plexus/plexus-utils/1.5.5/plexus-utils-1.5.5.jar
2017-04-20T18:44:19.989 [INFO] Downloaded: https://repo.maven.apache.org/maven2/org/apache/maven/maven-artifact-manager/2.0.10/maven-artifact-manager-2.0.10.jar
(57 KB at 1384.6 KB/sec)
2017-04-20T18:44:19.990 [INFO] Downloading: https://repo.maven.apache.org/maven2/org/apache/maven/maven-artifact/2.0.10/maven-artifact-2.0.10.jar
2017-04-20T18:44:19.995 [INFO] Downloaded: https://repo.maven.apache.org/maven2/org/apache/maven/maven-plugin-api/2.0.10/maven-plugin-api-2.0.10.jar
(13 KB at 262.3 KB/sec)
2017-04-20T18:44:19.995 [INFO] Downloading: https://repo.maven.apache.org/maven2/org/apache/avro/avro-compiler/1.8.1/avro-compiler-1.8.1.jar
2017-04-20T18:44:19.995 [INFO] Downloaded: https://repo.maven.apache.org/maven2/org/apache/maven/maven-repository-metadata/2.0.10/maven-repository-metadata-2.0.10.jar
(26 KB at 552.4 KB/sec)
2017-04-20T18:44:19.995 [INFO] Downloading: https://repo.maven.apache.org/maven2/org/xerial/snappy/snappy-java/1.1.1.3/snappy-java-1.1.1.3.jar
2017-04-20T18:44:19.999 [INFO] Downloaded: https://repo.maven.apache.org/maven2/org/apache/maven/maven-model/2.0.10/maven-model-2.0.10.jar
(94 KB at 1806.5 KB/sec)
2017-04-20T18:44:19.999 [INFO] Downloading: https://repo.maven.apache.org/maven2/org/apache/commons/commons-compress/1.8.1/commons-compress-1.8.1.jar
2017-04-20T18:44:20.029 [INFO] Downloaded: https://repo.maven.apache.org/maven2/org/codehaus/plexus/plexus-utils/1.5.5/plexus-utils-1.5.5.jar
(246 KB at 3067.3 KB/sec)
2017-04-20T18:44:20.030 [INFO] Downloading: https://repo.maven.apache.org/maven2/joda-time/joda-time/2.7/joda-time-2.7.jar
2017-04-20T18:44:20.039 [INFO] Downloaded: https://repo.maven.apache.org/maven2/org/apache/maven/maven-artifact/2.0.10/maven-artifact-2.0.10.jar
(88 KB at 980.1 KB/sec)
2017-04-20T18:44:20.039 [INFO] Downloading: https://repo.maven.apache.org/maven2/org/slf4j/slf4j-api/1.7.7/slf4j-api-1.7.7.jar
2017-04-20T18:44:20.047 [INFO] Downloaded: https://repo.maven.apache.org/maven2/org/apache/avro/avro-compiler/1.8.1/avro-compiler-1.8.1.jar
(80 KB at 821.4 KB/sec)
2017-04-20T18:44:20.047 [INFO] Downloading: https://repo.maven.apache.org/maven2/org/slf4j/slf4j-simple/1.7.7/slf4j-simple-1.7.7.jar
2017-04-20T18:44:20.068 [INFO] Downloaded: https://repo.maven.apache.org/maven2/org/slf4j/slf4j-api/1.7.7/slf4j-api-1.7.7.jar
(29 KB at 242.1 KB/sec)
2017-04-20T18:44:20.075 [INFO] Downloaded: https://repo.maven.apache.org/maven2/org/slf4j/slf4j-simple/1.7.7/slf4j-simple-1.7.7.jar
(11 KB at 83.5 KB/sec)
2017-04-20T18:44:20.105 [INFO] Downloaded: https://repo.maven.apache.org/maven2/org/xerial/snappy/snappy-java/1.1.1.3/snappy-java-1.1.1.3.jar
(576 KB at 3711.3 KB/sec)
2017-04-20T18:44:20.112 [INFO] Downloaded: https://repo.maven.apache.org/maven2/org/apache/commons/commons-compress/1.8.1/commons-compress-1.8.1.jar
(357 KB at 2203.6 KB/sec)
2017-04-20T18:44:20.145 [INFO] Downloaded: https://repo.maven.apache.org/maven2/joda-time/joda-time/2.7/joda-time-2.7.jar
(576 KB at 2951.2 KB/sec)
2017-04-20T18:44:20.788 [INFO] 
2017-04-20T18:44:20.788 [INFO] --- maven-remote-resources-plugin:1.5:process (process-resource-bundles)
@ beam-sdks-java-core ---
2017-04-20T18:44:21.462 [INFO] 
2017-04-20T18:44:21.462 [INFO] --- maven-resources-plugin:2.7:resources (default-resources)
@ beam-sdks-java-core ---
2017-04-20T18:44:21.464 [INFO] Using 'UTF-8' encoding to copy filtered resources.
2017-04-20T18:44:21.464 [INFO] Copying 1 resource
2017-04-20T18:44:21.490 [INFO] Copying 3 resources
2017-04-20T18:44:21.558 [INFO] 
2017-04-20T18:44:21.558 [INFO] --- maven-compiler-plugin:3.6.1:compile (default-compile) @
beam-sdks-java-core ---
2017-04-20T18:44:21.679 [INFO] Changes detected - recompiling the module!
2017-04-20T18:44:21.681 [INFO] Compiling 405 source files to <https://builds.apache.org/job/beam_PostCommit_Java_ValidatesRunner_Flink/ws/sdks/java/core/target/classes>
2017-04-20T18:44:34.111 [WARNING] bootstrap class path not set in conjunction with -source
1.7
2017-04-20T18:44:34.112 [INFO] <https://builds.apache.org/job/beam_PostCommit_Java_ValidatesRunner_Flink/ws/sdks/java/core/src/main/java/org/apache/beam/sdk/io/FileBasedSink.java>:
Some input files use or override a deprecated API.
2017-04-20T18:44:34.112 [INFO] <https://builds.apache.org/job/beam_PostCommit_Java_ValidatesRunner_Flink/ws/sdks/java/core/src/main/java/org/apache/beam/sdk/io/FileBasedSink.java>:
Recompile with -Xlint:deprecation for details.
2017-04-20T18:44:34.112 [INFO] <https://builds.apache.org/job/beam_PostCommit_Java_ValidatesRunner_Flink/ws/sdks/java/core/src/main/java/org/apache/beam/sdk/runners/PTransformOverrideFactory.java>:
Some input files use unchecked or unsafe operations.
2017-04-20T18:44:34.112 [INFO] <https://builds.apache.org/job/beam_PostCommit_Java_ValidatesRunner_Flink/ws/sdks/java/core/src/main/java/org/apache/beam/sdk/runners/PTransformOverrideFactory.java>:
Recompile with -Xlint:unchecked for details.
2017-04-20T18:44:34.249 [INFO] 
2017-04-20T18:44:34.249 [INFO] --- build-helper-maven-plugin:3.0.0:add-test-source (add-test-source)
@ beam-sdks-java-core ---
2017-04-20T18:44:34.251 [INFO] Test Source directory: <https://builds.apache.org/job/beam_PostCommit_Java_ValidatesRunner_Flink/ws/sdks/java/core/target/generated-test-sources/java>
added.
2017-04-20T18:44:34.302 [INFO] 
2017-04-20T18:44:34.302 [INFO] --- maven-resources-plugin:2.7:testResources (default-testResources)
@ beam-sdks-java-core ---
2017-04-20T18:44:34.304 [INFO] Using 'UTF-8' encoding to copy filtered resources.
2017-04-20T18:44:34.304 [INFO] skip non existing resourceDirectory <https://builds.apache.org/job/beam_PostCommit_Java_ValidatesRunner_Flink/ws/sdks/java/core/src/test/resources>
2017-04-20T18:44:34.304 [INFO] Copying 3 resources
2017-04-20T18:44:34.355 [INFO] 
2017-04-20T18:44:34.355 [INFO] --- maven-compiler-plugin:3.6.1:testCompile (default-testCompile)
@ beam-sdks-java-core ---
2017-04-20T18:44:34.454 [INFO] Changes detected - recompiling the module!
2017-04-20T18:44:34.455 [INFO] Compiling 244 source files to <https://builds.apache.org/job/beam_PostCommit_Java_ValidatesRunner_Flink/ws/sdks/java/core/target/test-classes>
2017-04-20T18:44:40.180 [INFO] <https://builds.apache.org/job/beam_PostCommit_Java_ValidatesRunner_Flink/ws/sdks/java/core/src/test/java/org/apache/beam/sdk/io/FileBasedSourceTest.java>:
Some input files use or override a deprecated API.
2017-04-20T18:44:40.180 [INFO] <https://builds.apache.org/job/beam_PostCommit_Java_ValidatesRunner_Flink/ws/sdks/java/core/src/test/java/org/apache/beam/sdk/io/FileBasedSourceTest.java>:
Recompile with -Xlint:deprecation for details.
2017-04-20T18:44:40.180 [INFO] <https://builds.apache.org/job/beam_PostCommit_Java_ValidatesRunner_Flink/ws/sdks/java/core/src/test/java/org/apache/beam/sdk/transforms/CombineFnsTest.java>:
Some input files use unchecked or unsafe operations.
2017-04-20T18:44:40.180 [INFO] <https://builds.apache.org/job/beam_PostCommit_Java_ValidatesRunner_Flink/ws/sdks/java/core/src/test/java/org/apache/beam/sdk/transforms/CombineFnsTest.java>:
Recompile with -Xlint:unchecked for details.
2017-04-20T18:44:40.243 [INFO] 
2017-04-20T18:44:40.243 [INFO] --- maven-checkstyle-plugin:2.17:check (default) @ beam-sdks-java-core
---
2017-04-20T18:45:16.118 [INFO] Starting audit...
[ERROR] <https://builds.apache.org/job/beam_PostCommit_Java_ValidatesRunner_Flink/ws/sdks/java/core/src/main/java/org/apache/beam/sdk/metrics/MetricResults.java>:32:
Empty line should be followed by <p> tag on the next line. [JavadocParagraph]
Audit done.
2017-04-20T18:45:16.118 [INFO] There is 1 error reported by Checkstyle 6.19 with beam/checkstyle.xml
ruleset.
2017-04-20T18:45:16.121 [ERROR] src/main/java/org/apache/beam/sdk/metrics/MetricResults.java:[32]
(javadoc) JavadocParagraph: Empty line should be followed by <p> tag on the next line.
[JENKINS] Archiving disabled
[JENKINS] Archiving disabled
[JENKINS] Archiving disabled
[JENKINS] Archiving disabled
[JENKINS] Archiving disabled
[JENKINS] Archiving disabled
[JENKINS] Archiving disabled
[JENKINS] Archiving disabled
[JENKINS] Archiving disabled
[JENKINS] Archiving disabled
[JENKINS] Archiving disabled
[JENKINS] Archiving disabled
[JENKINS] Archiving disabled
2017-04-20T18:45:19.588 [INFO] ------------------------------------------------------------------------
2017-04-20T18:45:19.588 [INFO] Reactor Summary:
2017-04-20T18:45:19.588 [INFO] 
2017-04-20T18:45:19.588 [INFO] Apache Beam :: Parent .............................. SUCCESS
[ 26.071 s]
2017-04-20T18:45:19.588 [INFO] Apache Beam :: SDKs :: Java :: Build Tools ......... SUCCESS
[ 13.586 s]
2017-04-20T18:45:19.588 [INFO] Apache Beam :: SDKs ................................ SUCCESS
[  4.207 s]
2017-04-20T18:45:19.588 [INFO] Apache Beam :: SDKs :: Common ...................... SUCCESS
[  2.438 s]
2017-04-20T18:45:19.588 [INFO] Apache Beam :: SDKs :: Common :: Fn API ............ SUCCESS
[ 17.825 s]
2017-04-20T18:45:19.588 [INFO] Apache Beam :: SDKs :: Common :: Runner API ........ SUCCESS
[  6.949 s]
2017-04-20T18:45:19.588 [INFO] Apache Beam :: SDKs :: Java ........................ SUCCESS
[  2.642 s]
2017-04-20T18:45:19.589 [INFO] Apache Beam :: SDKs :: Java :: Core ................ FAILURE
[01:09 min]
2017-04-20T18:45:19.589 [INFO] Apache Beam :: Runners ............................. SKIPPED
2017-04-20T18:45:19.589 [INFO] Apache Beam :: Runners :: Core Construction Java ... SKIPPED
2017-04-20T18:45:19.589 [INFO] Apache Beam :: Runners :: Core Java ................ SKIPPED
2017-04-20T18:45:19.589 [INFO] Apache Beam :: Runners :: Flink .................... SKIPPED
2017-04-20T18:45:19.589 [INFO] ------------------------------------------------------------------------
2017-04-20T18:45:19.589 [INFO] BUILD FAILURE
2017-04-20T18:45:19.589 [INFO] ------------------------------------------------------------------------
2017-04-20T18:45:19.589 [INFO] Total time: 04:30 min
2017-04-20T18:45:19.589 [INFO] Finished at: 2017-04-20T18:45:19+00:00
2017-04-20T18:45:20.126 [INFO] Final Memory: 97M/1583M
2017-04-20T18:45:20.126 [INFO] ------------------------------------------------------------------------
2017-04-20T18:45:20.126 [WARNING] The requested profile "validates-runner-tests" could not
be activated because it does not exist.
Waiting for Jenkins to finish collecting data
2017-04-20T18:45:21.208 [ERROR] Failed to execute goal org.apache.maven.plugins:maven-checkstyle-plugin:2.17:check
(default) on project beam-sdks-java-core: You have 1 Checkstyle violation. -> [Help 1]
org.apache.maven.lifecycle.LifecycleExecutionException: Failed to execute goal org.apache.maven.plugins:maven-checkstyle-plugin:2.17:check
(default) on project beam-sdks-java-core: You have 1 Checkstyle violation.
	at org.apache.maven.lifecycle.internal.MojoExecutor.execute(MojoExecutor.java:212)
	at org.apache.maven.lifecycle.internal.MojoExecutor.execute(MojoExecutor.java:153)
	at org.apache.maven.lifecycle.internal.MojoExecutor.execute(MojoExecutor.java:145)
	at org.apache.maven.lifecycle.internal.LifecycleModuleBuilder.buildProject(LifecycleModuleBuilder.java:116)
	at org.apache.maven.lifecycle.internal.LifecycleModuleBuilder.buildProject(LifecycleModuleBuilder.java:80)
	at org.apache.maven.lifecycle.internal.builder.singlethreaded.SingleThreadedBuilder.build(SingleThreadedBuilder.java:51)
	at org.apache.maven.lifecycle.internal.LifecycleStarter.execute(LifecycleStarter.java:128)
	at org.apache.maven.DefaultMaven.doExecute(DefaultMaven.java:307)
	at org.apache.maven.DefaultMaven.doExecute(DefaultMaven.java:193)
	at org.apache.maven.DefaultMaven.execute(DefaultMaven.java:106)
	at org.jvnet.hudson.maven3.launcher.Maven33Launcher.main(Maven33Launcher.java:129)
	at sun.reflect.NativeMethodAccessorImpl.invoke0(Native Method)
	at sun.reflect.NativeMethodAccessorImpl.invoke(NativeMethodAccessorImpl.java:62)
	at sun.reflect.DelegatingMethodAccessorImpl.invoke(DelegatingMethodAccessorImpl.java:43)
	at java.lang.reflect.Method.invoke(Method.java:498)
	at org.codehaus.plexus.classworlds.launcher.Launcher.launchStandard(Launcher.java:330)
	at org.codehaus.plexus.classworlds.launcher.Launcher.launch(Launcher.java:238)
	at jenkins.maven3.agent.Maven33Main.launch(Maven33Main.java:176)
	at sun.reflect.NativeMethodAccessorImpl.invoke0(Native Method)
	at sun.reflect.NativeMethodAccessorImpl.invoke(NativeMethodAccessorImpl.java:62)
	at sun.reflect.DelegatingMethodAccessorImpl.invoke(DelegatingMethodAccessorImpl.java:43)
	at java.lang.reflect.Method.invoke(Method.java:498)
	at hudson.maven.Maven3Builder.call(Maven3Builder.java:139)
	at hudson.maven.Maven3Builder.call(Maven3Builder.java:70)
	at hudson.remoting.UserRequest.perform(UserRequest.java:153)
	at hudson.remoting.UserRequest.perform(UserRequest.java:50)
	at hudson.remoting.Request$2.run(Request.java:336)
	at hudson.remoting.InterceptingExecutorService$1.call(InterceptingExecutorService.java:68)
	at java.util.concurrent.FutureTask.run(FutureTask.java:266)
	at java.util.concurrent.ThreadPoolExecutor.runWorker(ThreadPoolExecutor.java:1142)
	at java.util.concurrent.ThreadPoolExecutor$Worker.run(ThreadPoolExecutor.java:617)
	at java.lang.Thread.run(Thread.java:745)
Caused by: org.apache.maven.plugin.MojoFailureException: You have 1 Checkstyle violation.
	at org.apache.maven.plugin.checkstyle.CheckstyleViolationCheckMojo.execute(CheckstyleViolationCheckMojo.java:588)
	at org.apache.maven.plugin.DefaultBuildPluginManager.executeMojo(DefaultBuildPluginManager.java:134)
	at org.apache.maven.lifecycle.internal.MojoExecutor.execute(MojoExecutor.java:208)
	... 31 more
2017-04-20T18:45:21.212 [ERROR] 
2017-04-20T18:45:21.212 [ERROR] Re-run Maven using the -X switch to enable full debug logging.
2017-04-20T18:45:21.212 [ERROR] 
2017-04-20T18:45:21.212 [ERROR] For more information about the errors and possible solutions,
please read the following articles:
2017-04-20T18:45:21.212 [ERROR] [Help 1] http://cwiki.apache.org/confluence/display/MAVEN/MojoFailureException
2017-04-20T18:45:21.213 [ERROR] 
2017-04-20T18:45:21.213 [ERROR] After correcting the problems, you can resume the build with
the command
2017-04-20T18:45:21.213 [ERROR]   mvn <goals> -rf :beam-sdks-java-core
channel stopped

Mime
View raw message