beam-commits mailing list archives

Site index · List index
Message view « Date » · « Thread »
Top « Date » · « Thread »
From Apache Jenkins Server <jenk...@builds.apache.org>
Subject Build failed in Jenkins: beam_PostCommit_Java_ValidatesRunner_Flink #2372
Date Tue, 18 Apr 2017 16:30:53 GMT
See <https://builds.apache.org/job/beam_PostCommit_Java_ValidatesRunner_Flink/2372/display/redirect>

------------------------------------------
[...truncated 300.30 KB...]
 * [new ref]         refs/pull/991/merge -> origin/pr/991/merge
 * [new ref]         refs/pull/992/head -> origin/pr/992/head
 * [new ref]         refs/pull/992/merge -> origin/pr/992/merge
 * [new ref]         refs/pull/993/head -> origin/pr/993/head
 * [new ref]         refs/pull/993/merge -> origin/pr/993/merge
 * [new ref]         refs/pull/994/head -> origin/pr/994/head
 * [new ref]         refs/pull/994/merge -> origin/pr/994/merge
 * [new ref]         refs/pull/995/head -> origin/pr/995/head
 * [new ref]         refs/pull/995/merge -> origin/pr/995/merge
 * [new ref]         refs/pull/996/head -> origin/pr/996/head
 * [new ref]         refs/pull/996/merge -> origin/pr/996/merge
 * [new ref]         refs/pull/997/head -> origin/pr/997/head
 * [new ref]         refs/pull/997/merge -> origin/pr/997/merge
 * [new ref]         refs/pull/998/head -> origin/pr/998/head
 * [new ref]         refs/pull/999/head -> origin/pr/999/head
 * [new ref]         refs/pull/999/merge -> origin/pr/999/merge
Auto packing the repository for optimum performance. You may also
run "git gc" manually. See "git help gc" for more information.
warning: There are too many unreachable loose objects; run 'git prune' to remove them.

	at org.jenkinsci.plugins.gitclient.CliGitAPIImpl.launchCommandIn(CliGitAPIImpl.java:1799)
	at org.jenkinsci.plugins.gitclient.CliGitAPIImpl.launchCommandWithCredentials(CliGitAPIImpl.java:1525)
	at org.jenkinsci.plugins.gitclient.CliGitAPIImpl.access$300(CliGitAPIImpl.java:65)
	at org.jenkinsci.plugins.gitclient.CliGitAPIImpl$1.execute(CliGitAPIImpl.java:316)
	at org.jenkinsci.plugins.gitclient.RemoteGitImpl$CommandInvocationHandler$1.call(RemoteGitImpl.java:153)
	at org.jenkinsci.plugins.gitclient.RemoteGitImpl$CommandInvocationHandler$1.call(RemoteGitImpl.java:146)
	at hudson.remoting.UserRequest.perform(UserRequest.java:153)
	at hudson.remoting.UserRequest.perform(UserRequest.java:50)
	at hudson.remoting.Request$2.run(Request.java:336)
	at hudson.remoting.InterceptingExecutorService$1.call(InterceptingExecutorService.java:68)
	at java.util.concurrent.FutureTask.run(FutureTask.java:262)
	at java.util.concurrent.ThreadPoolExecutor.runWorker(ThreadPoolExecutor.java:1145)
	at java.util.concurrent.ThreadPoolExecutor$Worker.run(ThreadPoolExecutor.java:615)
	at java.lang.Thread.run(Thread.java:745)
	at ......remote call to beam1(Native Method)
	at hudson.remoting.Channel.attachCallSiteStackTrace(Channel.java:1537)
	at hudson.remoting.UserResponse.retrieve(UserRequest.java:253)
	at hudson.remoting.Channel.call(Channel.java:822)
	at org.jenkinsci.plugins.gitclient.RemoteGitImpl$CommandInvocationHandler.execute(RemoteGitImpl.java:146)
	at sun.reflect.GeneratedMethodAccessor862.invoke(Unknown Source)
	at sun.reflect.DelegatingMethodAccessorImpl.invoke(DelegatingMethodAccessorImpl.java:43)
	at java.lang.reflect.Method.invoke(Method.java:498)
	at org.jenkinsci.plugins.gitclient.RemoteGitImpl$CommandInvocationHandler.invoke(RemoteGitImpl.java:132)
	at com.sun.proxy.$Proxy103.execute(Unknown Source)
	at hudson.plugins.git.GitSCM.fetchFrom(GitSCM.java:804)
	... 11 more
ERROR: null
Retrying after 10 seconds
 > git rev-parse --is-inside-work-tree # timeout=10
Fetching changes from the remote Git repository
 > git config remote.origin.url https://github.com/apache/beam.git # timeout=10
Pruning obsolete local branches
Fetching upstream changes from https://github.com/apache/beam.git
 > git --version # timeout=10
 > git fetch --tags --progress https://github.com/apache/beam.git +refs/heads/*:refs/remotes/origin/*
+refs/pull/*:refs/remotes/origin/pr/* --prune
 > git rev-parse refs/remotes/origin/pr/2576/merge^{commit} # timeout=10
 > git rev-parse refs/remotes/origin/origin/pr/2576/merge^{commit} # timeout=10
 > git rev-parse origin/pr/2576/merge^{commit} # timeout=10
ERROR: Couldn't find any revision to build. Verify the repository and branch configuration
for this job.
Retrying after 10 seconds
 > git rev-parse --is-inside-work-tree # timeout=10
Fetching changes from the remote Git repository
 > git config remote.origin.url https://github.com/apache/beam.git # timeout=10
Pruning obsolete local branches
Fetching upstream changes from https://github.com/apache/beam.git
 > git --version # timeout=10
 > git fetch --tags --progress https://github.com/apache/beam.git +refs/heads/*:refs/remotes/origin/*
+refs/pull/*:refs/remotes/origin/pr/* --prune
 > git rev-parse refs/remotes/origin/pr/2576/merge^{commit} # timeout=10
 > git rev-parse refs/remotes/origin/origin/pr/2576/merge^{commit} # timeout=10
Checking out Revision bfd22dca72869e1a9565270d9591aa34e31a8a50 (refs/remotes/origin/pr/2576/merge)
 > git config core.sparsecheckout # timeout=10
 > git checkout -f bfd22dca72869e1a9565270d9591aa34e31a8a50
First time build. Skipping changelog.
Cleaning workspace
 > git rev-parse --verify HEAD # timeout=10
Resetting working tree
 > git reset --hard # timeout=10
 > git clean -fdx # timeout=10
[EnvInject] - Executing scripts and injecting environment variables after the SCM step.
[EnvInject] - Injecting as environment variables the properties content 
SPARK_LOCAL_IP=127.0.0.1

[EnvInject] - Variables injected successfully.
Parsing POMs
Downloaded artifact http://repo.maven.apache.org/maven2/org/apache/apache/18/apache-18.pom
Modules changed, recalculating dependency graph
Established TCP socket on 40236
maven33-agent.jar already up to date
maven33-interceptor.jar already up to date
maven3-interceptor-commons.jar already up to date
[beam_PostCommit_Java_ValidatesRunner_Flink] $ /home/jenkins/tools/java/latest1.8/bin/java
-Dorg.slf4j.simpleLogger.showDateTime=true -Dorg.slf4j.simpleLogger.dateTimeFormat=yyyy-MM-dd'T'HH:mm:ss.SSS
-XX:+TieredCompilation -XX:TieredStopAtLevel=1 -cp /home/jenkins/jenkins-slave/maven33-agent.jar:/home/jenkins/tools/maven/apache-maven-3.3.3/boot/plexus-classworlds-2.5.2.jar:/home/jenkins/tools/maven/apache-maven-3.3.3/conf/logging
jenkins.maven3.agent.Maven33Main /home/jenkins/tools/maven/apache-maven-3.3.3 /home/jenkins/jenkins-slave/slave.jar
/home/jenkins/jenkins-slave/maven33-interceptor.jar /home/jenkins/jenkins-slave/maven3-interceptor-commons.jar
40236
<===[JENKINS REMOTING CAPACITY]===>   channel started
Executing Maven:  -B -f <https://builds.apache.org/job/beam_PostCommit_Java_ValidatesRunner_Flink/ws/pom.xml>
-Dmaven.repo.local=<https://builds.apache.org/job/beam_PostCommit_Java_ValidatesRunner_Flink/ws/.repository>
-B -e clean verify -am -pl runners/flink/runner -Plocal-validates-runner-tests -Pvalidates-runner-tests
2017-04-18T16:29:02.784 [INFO] Error stacktraces are turned on.
2017-04-18T16:29:02.989 [INFO] Scanning for projects...
2017-04-18T16:29:04.445 [INFO] Downloading: https://repo.maven.apache.org/maven2/kr/motd/maven/os-maven-plugin/1.5.0.Final/os-maven-plugin-1.5.0.Final.pom
2017-04-18T16:29:05.269 [INFO] Downloaded: https://repo.maven.apache.org/maven2/kr/motd/maven/os-maven-plugin/1.5.0.Final/os-maven-plugin-1.5.0.Final.pom
(7 KB at 7.5 KB/sec)
2017-04-18T16:29:05.276 [INFO] Downloading: https://repo.maven.apache.org/maven2/org/sonatype/oss/oss-parent/9/oss-parent-9.pom
2017-04-18T16:29:05.332 [INFO] Downloaded: https://repo.maven.apache.org/maven2/org/sonatype/oss/oss-parent/9/oss-parent-9.pom
(7 KB at 114.6 KB/sec)
2017-04-18T16:29:05.341 [INFO] Downloading: https://repo.maven.apache.org/maven2/org/apache/maven/maven-plugin-api/3.2.1/maven-plugin-api-3.2.1.pom
2017-04-18T16:29:05.374 [INFO] Downloaded: https://repo.maven.apache.org/maven2/org/apache/maven/maven-plugin-api/3.2.1/maven-plugin-api-3.2.1.pom
(4 KB at 97.1 KB/sec)
2017-04-18T16:29:05.376 [INFO] Downloading: https://repo.maven.apache.org/maven2/org/apache/maven/maven/3.2.1/maven-3.2.1.pom
2017-04-18T16:29:05.442 [INFO] Downloaded: https://repo.maven.apache.org/maven2/org/apache/maven/maven/3.2.1/maven-3.2.1.pom
(23 KB at 334.2 KB/sec)
2017-04-18T16:29:05.445 [INFO] Downloading: https://repo.maven.apache.org/maven2/org/apache/maven/maven-parent/23/maven-parent-23.pom
2017-04-18T16:29:05.488 [INFO] Downloaded: https://repo.maven.apache.org/maven2/org/apache/maven/maven-parent/23/maven-parent-23.pom
(32 KB at 723.2 KB/sec)
2017-04-18T16:29:05.492 [INFO] Downloading: https://repo.maven.apache.org/maven2/org/apache/apache/13/apache-13.pom
2017-04-18T16:29:05.523 [INFO] Downloaded: https://repo.maven.apache.org/maven2/org/apache/apache/13/apache-13.pom
(14 KB at 440.2 KB/sec)
2017-04-18T16:29:05.529 [INFO] Downloading: https://repo.maven.apache.org/maven2/org/apache/maven/maven-model/3.2.1/maven-model-3.2.1.pom
2017-04-18T16:29:05.556 [INFO] Downloaded: https://repo.maven.apache.org/maven2/org/apache/maven/maven-model/3.2.1/maven-model-3.2.1.pom
(5 KB at 149.8 KB/sec)
2017-04-18T16:29:05.560 [INFO] Downloading: https://repo.maven.apache.org/maven2/org/codehaus/plexus/plexus-utils/3.0.17/plexus-utils-3.0.17.pom
2017-04-18T16:29:05.587 [INFO] Downloaded: https://repo.maven.apache.org/maven2/org/codehaus/plexus/plexus-utils/3.0.17/plexus-utils-3.0.17.pom
(4 KB at 122.8 KB/sec)
2017-04-18T16:29:05.589 [INFO] Downloading: https://repo.maven.apache.org/maven2/org/codehaus/plexus/plexus/3.3.1/plexus-3.3.1.pom
2017-04-18T16:29:05.620 [INFO] Downloaded: https://repo.maven.apache.org/maven2/org/codehaus/plexus/plexus/3.3.1/plexus-3.3.1.pom
(20 KB at 644.1 KB/sec)
2017-04-18T16:29:05.622 [INFO] Downloading: https://repo.maven.apache.org/maven2/org/sonatype/spice/spice-parent/17/spice-parent-17.pom
2017-04-18T16:29:05.649 [INFO] Downloaded: https://repo.maven.apache.org/maven2/org/sonatype/spice/spice-parent/17/spice-parent-17.pom
(7 KB at 244.5 KB/sec)
2017-04-18T16:29:05.651 [INFO] Downloading: https://repo.maven.apache.org/maven2/org/sonatype/forge/forge-parent/10/forge-parent-10.pom
2017-04-18T16:29:05.681 [INFO] Downloaded: https://repo.maven.apache.org/maven2/org/sonatype/forge/forge-parent/10/forge-parent-10.pom
(14 KB at 441.4 KB/sec)
2017-04-18T16:29:05.684 [INFO] Downloading: https://repo.maven.apache.org/maven2/org/apache/maven/maven-artifact/3.2.1/maven-artifact-3.2.1.pom
2017-04-18T16:29:05.711 [INFO] Downloaded: https://repo.maven.apache.org/maven2/org/apache/maven/maven-artifact/3.2.1/maven-artifact-3.2.1.pom
(2 KB at 71.3 KB/sec)
2017-04-18T16:29:05.716 [INFO] Downloading: https://repo.maven.apache.org/maven2/org/eclipse/sisu/org.eclipse.sisu.plexus/0.0.0.M5/org.eclipse.sisu.plexus-0.0.0.M5.pom
2017-04-18T16:29:05.743 [INFO] Downloaded: https://repo.maven.apache.org/maven2/org/eclipse/sisu/org.eclipse.sisu.plexus/0.0.0.M5/org.eclipse.sisu.plexus-0.0.0.M5.pom
(5 KB at 174.7 KB/sec)
2017-04-18T16:29:05.744 [INFO] Downloading: https://repo.maven.apache.org/maven2/org/eclipse/sisu/sisu-plexus/0.0.0.M5/sisu-plexus-0.0.0.M5.pom
2017-04-18T16:29:05.773 [INFO] Downloaded: https://repo.maven.apache.org/maven2/org/eclipse/sisu/sisu-plexus/0.0.0.M5/sisu-plexus-0.0.0.M5.pom
(13 KB at 444.6 KB/sec)
2017-04-18T16:29:05.775 [INFO] Downloading: https://repo.maven.apache.org/maven2/org/sonatype/oss/oss-parent/7/oss-parent-7.pom
2017-04-18T16:29:05.802 [INFO] Downloaded: https://repo.maven.apache.org/maven2/org/sonatype/oss/oss-parent/7/oss-parent-7.pom
(5 KB at 174.5 KB/sec)
2017-04-18T16:29:05.805 [INFO] Downloading: https://repo.maven.apache.org/maven2/javax/enterprise/cdi-api/1.0/cdi-api-1.0.pom
2017-04-18T16:29:05.831 [INFO] Downloaded: https://repo.maven.apache.org/maven2/javax/enterprise/cdi-api/1.0/cdi-api-1.0.pom
(2 KB at 53.9 KB/sec)
2017-04-18T16:29:05.832 [INFO] Downloading: https://repo.maven.apache.org/maven2/org/jboss/weld/weld-api-parent/1.0/weld-api-parent-1.0.pom
2017-04-18T16:29:05.859 [INFO] Downloaded: https://repo.maven.apache.org/maven2/org/jboss/weld/weld-api-parent/1.0/weld-api-parent-1.0.pom
(3 KB at 85.2 KB/sec)
2017-04-18T16:29:05.861 [INFO] Downloading: https://repo.maven.apache.org/maven2/org/jboss/weld/weld-api-bom/1.0/weld-api-bom-1.0.pom
2017-04-18T16:29:05.888 [INFO] Downloaded: https://repo.maven.apache.org/maven2/org/jboss/weld/weld-api-bom/1.0/weld-api-bom-1.0.pom
(8 KB at 286.0 KB/sec)
2017-04-18T16:29:05.889 [INFO] Downloading: https://repo.maven.apache.org/maven2/org/jboss/weld/weld-parent/6/weld-parent-6.pom
2017-04-18T16:29:05.922 [INFO] Downloaded: https://repo.maven.apache.org/maven2/org/jboss/weld/weld-parent/6/weld-parent-6.pom
(21 KB at 612.3 KB/sec)
2017-04-18T16:29:05.926 [INFO] Downloading: https://repo.maven.apache.org/maven2/javax/annotation/jsr250-api/1.0/jsr250-api-1.0.pom
2017-04-18T16:29:05.951 [INFO] Downloaded: https://repo.maven.apache.org/maven2/javax/annotation/jsr250-api/1.0/jsr250-api-1.0.pom
(1023 B at 40.0 KB/sec)
2017-04-18T16:29:05.953 [INFO] Downloading: https://repo.maven.apache.org/maven2/javax/inject/javax.inject/1/javax.inject-1.pom
2017-04-18T16:29:05.980 [INFO] Downloaded: https://repo.maven.apache.org/maven2/javax/inject/javax.inject/1/javax.inject-1.pom
(612 B at 22.1 KB/sec)
2017-04-18T16:29:05.982 [INFO] Downloading: https://repo.maven.apache.org/maven2/com/google/guava/guava/10.0.1/guava-10.0.1.pom
2017-04-18T16:29:06.011 [INFO] Downloaded: https://repo.maven.apache.org/maven2/com/google/guava/guava/10.0.1/guava-10.0.1.pom
(6 KB at 181.3 KB/sec)
2017-04-18T16:29:06.012 [INFO] Downloading: https://repo.maven.apache.org/maven2/com/google/guava/guava-parent/10.0.1/guava-parent-10.0.1.pom
2017-04-18T16:29:06.038 [INFO] Downloaded: https://repo.maven.apache.org/maven2/com/google/guava/guava-parent/10.0.1/guava-parent-10.0.1.pom
(2 KB at 73.6 KB/sec)
2017-04-18T16:29:06.040 [INFO] Downloading: https://repo.maven.apache.org/maven2/com/google/code/findbugs/jsr305/1.3.9/jsr305-1.3.9.pom
2017-04-18T16:29:06.066 [INFO] Downloaded: https://repo.maven.apache.org/maven2/com/google/code/findbugs/jsr305/1.3.9/jsr305-1.3.9.pom
(965 B at 36.2 KB/sec)
2017-04-18T16:29:06.067 [INFO] Downloading: https://repo.maven.apache.org/maven2/org/sonatype/sisu/sisu-guice/3.1.0/sisu-guice-3.1.0.pom
2017-04-18T16:29:06.097 [INFO] Downloaded: https://repo.maven.apache.org/maven2/org/sonatype/sisu/sisu-guice/3.1.0/sisu-guice-3.1.0.pom
(10 KB at 330.4 KB/sec)
2017-04-18T16:29:06.099 [INFO] Downloading: https://repo.maven.apache.org/maven2/org/sonatype/sisu/inject/guice-parent/3.1.0/guice-parent-3.1.0.pom
2017-04-18T16:29:06.127 [INFO] Downloaded: https://repo.maven.apache.org/maven2/org/sonatype/sisu/inject/guice-parent/3.1.0/guice-parent-3.1.0.pom
(11 KB at 381.1 KB/sec)
2017-04-18T16:29:06.130 [INFO] Downloading: https://repo.maven.apache.org/maven2/aopalliance/aopalliance/1.0/aopalliance-1.0.pom
2017-04-18T16:29:06.156 [INFO] Downloaded: https://repo.maven.apache.org/maven2/aopalliance/aopalliance/1.0/aopalliance-1.0.pom
(363 B at 13.6 KB/sec)
2017-04-18T16:29:06.158 [INFO] Downloading: https://repo.maven.apache.org/maven2/org/eclipse/sisu/org.eclipse.sisu.inject/0.0.0.M5/org.eclipse.sisu.inject-0.0.0.M5.pom
2017-04-18T16:29:06.184 [INFO] Downloaded: https://repo.maven.apache.org/maven2/org/eclipse/sisu/org.eclipse.sisu.inject/0.0.0.M5/org.eclipse.sisu.inject-0.0.0.M5.pom
(3 KB at 98.4 KB/sec)
2017-04-18T16:29:06.185 [INFO] Downloading: https://repo.maven.apache.org/maven2/org/eclipse/sisu/sisu-inject/0.0.0.M5/sisu-inject-0.0.0.M5.pom
2017-04-18T16:29:06.216 [INFO] Downloaded: https://repo.maven.apache.org/maven2/org/eclipse/sisu/sisu-inject/0.0.0.M5/sisu-inject-0.0.0.M5.pom
(14 KB at 440.9 KB/sec)
2017-04-18T16:29:06.219 [INFO] Downloading: https://repo.maven.apache.org/maven2/org/codehaus/plexus/plexus-component-annotations/1.5.5/plexus-component-annotations-1.5.5.pom
2017-04-18T16:29:06.247 [INFO] Downloaded: https://repo.maven.apache.org/maven2/org/codehaus/plexus/plexus-component-annotations/1.5.5/plexus-component-annotations-1.5.5.pom
(815 B at 28.4 KB/sec)
2017-04-18T16:29:06.248 [INFO] Downloading: https://repo.maven.apache.org/maven2/org/codehaus/plexus/plexus-containers/1.5.5/plexus-containers-1.5.5.pom
2017-04-18T16:29:06.274 [INFO] Downloaded: https://repo.maven.apache.org/maven2/org/codehaus/plexus/plexus-containers/1.5.5/plexus-containers-1.5.5.pom
(5 KB at 159.3 KB/sec)
2017-04-18T16:29:06.276 [INFO] Downloading: https://repo.maven.apache.org/maven2/org/codehaus/plexus/plexus/2.0.7/plexus-2.0.7.pom
2017-04-18T16:29:06.306 [INFO] Downloaded: https://repo.maven.apache.org/maven2/org/codehaus/plexus/plexus/2.0.7/plexus-2.0.7.pom
(17 KB at 563.0 KB/sec)
2017-04-18T16:29:06.309 [INFO] Downloading: https://repo.maven.apache.org/maven2/org/codehaus/plexus/plexus-classworlds/2.4/plexus-classworlds-2.4.pom
2017-04-18T16:29:06.335 [INFO] Downloaded: https://repo.maven.apache.org/maven2/org/codehaus/plexus/plexus-classworlds/2.4/plexus-classworlds-2.4.pom
(4 KB at 145.8 KB/sec)
2017-04-18T16:29:06.337 [INFO] Downloading: https://repo.maven.apache.org/maven2/org/codehaus/plexus/plexus-utils/2.1/plexus-utils-2.1.pom
2017-04-18T16:29:06.364 [INFO] Downloaded: https://repo.maven.apache.org/maven2/org/codehaus/plexus/plexus-utils/2.1/plexus-utils-2.1.pom
(4 KB at 145.9 KB/sec)
2017-04-18T16:29:06.366 [INFO] Downloading: https://repo.maven.apache.org/maven2/org/sonatype/spice/spice-parent/16/spice-parent-16.pom
2017-04-18T16:29:06.394 [INFO] Downloaded: https://repo.maven.apache.org/maven2/org/sonatype/spice/spice-parent/16/spice-parent-16.pom
(9 KB at 291.5 KB/sec)
2017-04-18T16:29:06.395 [INFO] Downloading: https://repo.maven.apache.org/maven2/org/sonatype/forge/forge-parent/5/forge-parent-5.pom
2017-04-18T16:29:06.422 [INFO] Downloaded: https://repo.maven.apache.org/maven2/org/sonatype/forge/forge-parent/5/forge-parent-5.pom
(9 KB at 302.5 KB/sec)
2017-04-18T16:29:06.436 [INFO] Downloading: https://repo.maven.apache.org/maven2/kr/motd/maven/os-maven-plugin/1.5.0.Final/os-maven-plugin-1.5.0.Final.jar
2017-04-18T16:29:06.437 [INFO] Downloading: https://repo.maven.apache.org/maven2/org/apache/maven/maven-model/3.2.1/maven-model-3.2.1.jar
2017-04-18T16:29:06.437 [INFO] Downloading: https://repo.maven.apache.org/maven2/org/apache/maven/maven-plugin-api/3.2.1/maven-plugin-api-3.2.1.jar
2017-04-18T16:29:06.438 [INFO] Downloading: https://repo.maven.apache.org/maven2/org/eclipse/sisu/org.eclipse.sisu.plexus/0.0.0.M5/org.eclipse.sisu.plexus-0.0.0.M5.jar
2017-04-18T16:29:06.438 [INFO] Downloading: https://repo.maven.apache.org/maven2/org/apache/maven/maven-artifact/3.2.1/maven-artifact-3.2.1.jar
2017-04-18T16:29:06.479 [INFO] Downloaded: https://repo.maven.apache.org/maven2/kr/motd/maven/os-maven-plugin/1.5.0.Final/os-maven-plugin-1.5.0.Final.jar
(29 KB at 662.7 KB/sec)
2017-04-18T16:29:06.479 [INFO] Downloading: https://repo.maven.apache.org/maven2/javax/enterprise/cdi-api/1.0/cdi-api-1.0.jar
2017-04-18T16:29:06.519 [INFO] Downloaded: https://repo.maven.apache.org/maven2/javax/enterprise/cdi-api/1.0/cdi-api-1.0.jar
(44 KB at 541.4 KB/sec)
2017-04-18T16:29:06.519 [INFO] Downloading: https://repo.maven.apache.org/maven2/javax/annotation/jsr250-api/1.0/jsr250-api-1.0.jar
2017-04-18T16:29:06.525 [INFO] Downloaded: https://repo.maven.apache.org/maven2/org/apache/maven/maven-artifact/3.2.1/maven-artifact-3.2.1.jar
(53 KB at 595.4 KB/sec)
2017-04-18T16:29:06.525 [INFO] Downloaded: https://repo.maven.apache.org/maven2/org/apache/maven/maven-plugin-api/3.2.1/maven-plugin-api-3.2.1.jar
(45 KB at 502.9 KB/sec)
2017-04-18T16:29:06.525 [INFO] Downloading: https://repo.maven.apache.org/maven2/javax/inject/javax.inject/1/javax.inject-1.jar
2017-04-18T16:29:06.525 [INFO] Downloading: https://repo.maven.apache.org/maven2/com/google/guava/guava/10.0.1/guava-10.0.1.jar
2017-04-18T16:29:06.551 [INFO] Downloaded: https://repo.maven.apache.org/maven2/org/apache/maven/maven-model/3.2.1/maven-model-3.2.1.jar
(157 KB at 1369.4 KB/sec)
2017-04-18T16:29:06.552 [INFO] Downloading: https://repo.maven.apache.org/maven2/com/google/code/findbugs/jsr305/1.3.9/jsr305-1.3.9.jar
2017-04-18T16:29:06.552 [INFO] Downloaded: https://repo.maven.apache.org/maven2/javax/annotation/jsr250-api/1.0/jsr250-api-1.0.jar
(6 KB at 50.1 KB/sec)
2017-04-18T16:29:06.552 [INFO] Downloading: https://repo.maven.apache.org/maven2/org/sonatype/sisu/sisu-guice/3.1.0/sisu-guice-3.1.0-no_aop.jar
2017-04-18T16:29:06.561 [INFO] Downloaded: https://repo.maven.apache.org/maven2/org/eclipse/sisu/org.eclipse.sisu.plexus/0.0.0.M5/org.eclipse.sisu.plexus-0.0.0.M5.jar
(192 KB at 1547.9 KB/sec)
2017-04-18T16:29:06.561 [INFO] Downloading: https://repo.maven.apache.org/maven2/aopalliance/aopalliance/1.0/aopalliance-1.0.jar
2017-04-18T16:29:06.565 [INFO] Downloaded: https://repo.maven.apache.org/maven2/javax/inject/javax.inject/1/javax.inject-1.jar
(3 KB at 19.4 KB/sec)
2017-04-18T16:29:06.565 [INFO] Downloading: https://repo.maven.apache.org/maven2/org/eclipse/sisu/org.eclipse.sisu.inject/0.0.0.M5/org.eclipse.sisu.inject-0.0.0.M5.jar
2017-04-18T16:29:06.586 [INFO] Downloaded: https://repo.maven.apache.org/maven2/com/google/code/findbugs/jsr305/1.3.9/jsr305-1.3.9.jar
(33 KB at 217.8 KB/sec)
2017-04-18T16:29:06.586 [INFO] Downloading: https://repo.maven.apache.org/maven2/org/codehaus/plexus/plexus-component-annotations/1.5.5/plexus-component-annotations-1.5.5.jar
2017-04-18T16:29:06.586 [INFO] Downloaded: https://repo.maven.apache.org/maven2/aopalliance/aopalliance/1.0/aopalliance-1.0.jar
(5 KB at 29.5 KB/sec)
2017-04-18T16:29:06.586 [INFO] Downloading: https://repo.maven.apache.org/maven2/org/codehaus/plexus/plexus-classworlds/2.4/plexus-classworlds-2.4.jar
2017-04-18T16:29:06.615 [INFO] Downloaded: https://repo.maven.apache.org/maven2/org/codehaus/plexus/plexus-component-annotations/1.5.5/plexus-component-annotations-1.5.5.jar
(5 KB at 23.4 KB/sec)
2017-04-18T16:29:06.615 [INFO] Downloading: https://repo.maven.apache.org/maven2/org/codehaus/plexus/plexus-utils/3.0.17/plexus-utils-3.0.17.jar
2017-04-18T16:29:06.629 [INFO] Downloaded: https://repo.maven.apache.org/maven2/org/codehaus/plexus/plexus-classworlds/2.4/plexus-classworlds-2.4.jar
(46 KB at 248.4 KB/sec)
2017-04-18T16:29:06.649 [INFO] Downloaded: https://repo.maven.apache.org/maven2/org/eclipse/sisu/org.eclipse.sisu.inject/0.0.0.M5/org.eclipse.sisu.inject-0.0.0.M5.jar
(285 KB at 1348.7 KB/sec)
2017-04-18T16:29:06.659 [INFO] Downloaded: https://repo.maven.apache.org/maven2/org/sonatype/sisu/sisu-guice/3.1.0/sisu-guice-3.1.0-no_aop.jar
(350 KB at 1579.4 KB/sec)
2017-04-18T16:29:06.702 [INFO] Downloaded: https://repo.maven.apache.org/maven2/org/codehaus/plexus/plexus-utils/3.0.17/plexus-utils-3.0.17.jar
(246 KB at 960.5 KB/sec)
2017-04-18T16:29:06.762 [INFO] Downloaded: https://repo.maven.apache.org/maven2/com/google/guava/guava/10.0.1/guava-10.0.1.jar
(1467 KB at 4525.9 KB/sec)
2017-04-18T16:29:06.887 [INFO] Downloading: https://repo.maven.apache.org/maven2/org/apache/maven/archetype/archetype-packaging/2.4/archetype-packaging-2.4.pom
2017-04-18T16:29:06.917 [INFO] Downloaded: https://repo.maven.apache.org/maven2/org/apache/maven/archetype/archetype-packaging/2.4/archetype-packaging-2.4.pom
(2 KB at 51.0 KB/sec)
2017-04-18T16:29:06.919 [INFO] Downloading: https://repo.maven.apache.org/maven2/org/apache/maven/archetype/maven-archetype/2.4/maven-archetype-2.4.pom
2017-04-18T16:29:06.948 [INFO] Downloaded: https://repo.maven.apache.org/maven2/org/apache/maven/archetype/maven-archetype/2.4/maven-archetype-2.4.pom
(13 KB at 444.5 KB/sec)
2017-04-18T16:29:06.951 [INFO] Downloading: https://repo.maven.apache.org/maven2/org/apache/maven/maven-parent/26/maven-parent-26.pom
2017-04-18T16:29:06.981 [INFO] Downloaded: https://repo.maven.apache.org/maven2/org/apache/maven/maven-parent/26/maven-parent-26.pom
(39 KB at 1253.3 KB/sec)
2017-04-18T16:29:06.984 [INFO] Downloading: https://repo.maven.apache.org/maven2/org/apache/apache/16/apache-16.pom
2017-04-18T16:29:07.013 [INFO] Downloaded: https://repo.maven.apache.org/maven2/org/apache/apache/16/apache-16.pom
(16 KB at 518.5 KB/sec)
2017-04-18T16:29:07.017 [INFO] Downloading: https://repo.maven.apache.org/maven2/org/apache/maven/archetype/archetype-packaging/2.4/archetype-packaging-2.4.jar
2017-04-18T16:29:07.019 [INFO] Downloading: https://repo.maven.apache.org/maven2/org/codehaus/plexus/plexus-utils/1.1/plexus-utils-1.1.jar
2017-04-18T16:29:07.048 [INFO] Downloaded: https://repo.maven.apache.org/maven2/org/apache/maven/archetype/archetype-packaging/2.4/archetype-packaging-2.4.jar
(8 KB at 237.3 KB/sec)
2017-04-18T16:29:07.082 [INFO] Downloaded: https://repo.maven.apache.org/maven2/org/codehaus/plexus/plexus-utils/1.1/plexus-utils-1.1.jar
(165 KB at 2532.6 KB/sec)
2017-04-18T16:29:07.184 [ERROR] [ERROR] Could not find the selected project in the reactor:
runners/flink/runner @ 
2017-04-18T16:29:07.186 [ERROR] Could not find the selected project in the reactor: runners/flink/runner
-> [Help 1]
org.apache.maven.MavenExecutionException: Could not find the selected project in the reactor:
runners/flink/runner
	at org.apache.maven.graph.DefaultGraphBuilder.trimSelectedProjects(DefaultGraphBuilder.java:182)
	at org.apache.maven.graph.DefaultGraphBuilder.dependencyGraph(DefaultGraphBuilder.java:115)
	at org.apache.maven.graph.DefaultGraphBuilder.build(DefaultGraphBuilder.java:92)
	at org.apache.maven.DefaultMaven.buildGraph(DefaultMaven.java:491)
	at org.apache.maven.DefaultMaven.doExecute(DefaultMaven.java:219)
	at org.apache.maven.DefaultMaven.doExecute(DefaultMaven.java:193)
	at org.apache.maven.DefaultMaven.execute(DefaultMaven.java:106)
	at org.jvnet.hudson.maven3.launcher.Maven33Launcher.main(Maven33Launcher.java:129)
	at sun.reflect.NativeMethodAccessorImpl.invoke0(Native Method)
	at sun.reflect.NativeMethodAccessorImpl.invoke(NativeMethodAccessorImpl.java:62)
	at sun.reflect.DelegatingMethodAccessorImpl.invoke(DelegatingMethodAccessorImpl.java:43)
	at java.lang.reflect.Method.invoke(Method.java:498)
	at org.codehaus.plexus.classworlds.launcher.Launcher.launchStandard(Launcher.java:330)
	at org.codehaus.plexus.classworlds.launcher.Launcher.launch(Launcher.java:238)
	at jenkins.maven3.agent.Maven33Main.launch(Maven33Main.java:176)
	at sun.reflect.NativeMethodAccessorImpl.invoke0(Native Method)
	at sun.reflect.NativeMethodAccessorImpl.invoke(NativeMethodAccessorImpl.java:62)
	at sun.reflect.DelegatingMethodAccessorImpl.invoke(DelegatingMethodAccessorImpl.java:43)
	at java.lang.reflect.Method.invoke(Method.java:498)
	at hudson.maven.Maven3Builder.call(Maven3Builder.java:139)
	at hudson.maven.Maven3Builder.call(Maven3Builder.java:70)
	at hudson.remoting.UserRequest.perform(UserRequest.java:153)
	at hudson.remoting.UserRequest.perform(UserRequest.java:50)
	at hudson.remoting.Request$2.run(Request.java:336)
	at hudson.remoting.InterceptingExecutorService$1.call(InterceptingExecutorService.java:68)
	at java.util.concurrent.FutureTask.run(FutureTask.java:266)
	at java.util.concurrent.ThreadPoolExecutor.runWorker(ThreadPoolExecutor.java:1142)
	at java.util.concurrent.ThreadPoolExecutor$Worker.run(ThreadPoolExecutor.java:617)
	at java.lang.Thread.run(Thread.java:745)
2017-04-18T16:29:07.187 [ERROR] 
2017-04-18T16:29:07.187 [ERROR] Re-run Maven using the -X switch to enable full debug logging.
2017-04-18T16:29:07.187 [ERROR] 
2017-04-18T16:29:07.187 [ERROR] For more information about the errors and possible solutions,
please read the following articles:
2017-04-18T16:29:07.187 [ERROR] [Help 1] http://cwiki.apache.org/confluence/display/MAVEN/MavenExecutionException
channel stopped

Mime
View raw message