beam-commits mailing list archives

Site index · List index
Message view « Date » · « Thread »
Top « Date » · « Thread »
From Apache Jenkins Server <jenk...@builds.apache.org>
Subject Build failed in Jenkins: beam_PostCommit_Java_MavenInstall #2951
Date Mon, 20 Mar 2017 00:24:06 GMT
See <https://builds.apache.org/job/beam_PostCommit_Java_MavenInstall/2951/display/redirect>

------------------------------------------
[...truncated 1.12 MB...]
2017-03-20T00:23:30.838 [INFO] 2017-03-20\T\00:23:30.838 [INFO] Finished at: 2017-03-20T00:23:30+00:00
2017-03-20T00:23:30.980 [INFO] 2017-03-20\T\00:23:30.980 [INFO] Final Memory: 33M/304M
2017-03-20T00:23:30.980 [INFO] 2017-03-20\T\00:23:30.980 [INFO] ------------------------------------------------------------------------
2017-03-20T00:23:30.984 [INFO] 2017-03-20\T\00:23:30.984 [ERROR] Failed to execute goal org.apache.maven.plugins:maven-shade-plugin:2.4.1:shade
(default) on project basic: Execution default of goal org.apache.maven.plugins:maven-shade-plugin:2.4.1:shade
failed: Plugin org.apache.maven.plugins:maven-shade-plugin:2.4.1 or one of its dependencies
could not be resolved: Could not transfer artifact org.ow2.asm:asm-analysis:jar:5.0.3 from/to
central (https://repo.maven.apache.org/maven2): Connect to repo.maven.apache.org:443 [repo.maven.apache.org/151.101.44.215]
failed: Connection timed out (Connection timed out) -> [Help 1]
2017-03-20T00:23:30.986 [INFO] org.apache.maven.lifecycle.LifecycleExecutionException: Failed
to execute goal org.apache.maven.plugins:maven-shade-plugin:2.4.1:shade (default) on project
basic: Execution default of goal org.apache.maven.plugins:maven-shade-plugin:2.4.1:shade failed:
Plugin org.apache.maven.plugins:maven-shade-plugin:2.4.1 or one of its dependencies could
not be resolved: Could not transfer artifact org.ow2.asm:asm-analysis:jar:5.0.3 from/to central
(https://repo.maven.apache.org/maven2): Connect to repo.maven.apache.org:443 [repo.maven.apache.org/151.101.44.215]
failed: Connection timed out (Connection timed out)
2017-03-20T00:23:30.986 [INFO] 	at org.apache.maven.lifecycle.internal.MojoExecutor.execute(MojoExecutor.java:224)
2017-03-20T00:23:30.986 [INFO] 	at org.apache.maven.lifecycle.internal.MojoExecutor.execute(MojoExecutor.java:153)
2017-03-20T00:23:30.986 [INFO] 	at org.apache.maven.lifecycle.internal.MojoExecutor.execute(MojoExecutor.java:145)
2017-03-20T00:23:30.986 [INFO] 	at org.apache.maven.lifecycle.internal.LifecycleModuleBuilder.buildProject(LifecycleModuleBuilder.java:116)
2017-03-20T00:23:30.986 [INFO] 	at org.apache.maven.lifecycle.internal.LifecycleModuleBuilder.buildProject(LifecycleModuleBuilder.java:80)
2017-03-20T00:23:30.986 [INFO] 	at org.apache.maven.lifecycle.internal.builder.singlethreaded.SingleThreadedBuilder.build(SingleThreadedBuilder.java:51)
2017-03-20T00:23:30.986 [INFO] 	at org.apache.maven.lifecycle.internal.LifecycleStarter.execute(LifecycleStarter.java:128)
2017-03-20T00:23:30.986 [INFO] 	at org.apache.maven.DefaultMaven.doExecute(DefaultMaven.java:307)
2017-03-20T00:23:30.986 [INFO] 	at org.apache.maven.DefaultMaven.doExecute(DefaultMaven.java:193)
2017-03-20T00:23:30.986 [INFO] 	at org.apache.maven.DefaultMaven.execute(DefaultMaven.java:106)
2017-03-20T00:23:30.986 [INFO] 	at org.apache.maven.cli.MavenCli.execute(MavenCli.java:862)
2017-03-20T00:23:30.986 [INFO] 	at org.apache.maven.cli.MavenCli.doMain(MavenCli.java:286)
2017-03-20T00:23:30.986 [INFO] 	at org.apache.maven.cli.MavenCli.main(MavenCli.java:197)
2017-03-20T00:23:30.986 [INFO] 	at sun.reflect.NativeMethodAccessorImpl.invoke0(Native Method)
2017-03-20T00:23:30.986 [INFO] 	at sun.reflect.NativeMethodAccessorImpl.invoke(NativeMethodAccessorImpl.java:62)
2017-03-20T00:23:30.986 [INFO] 	at sun.reflect.DelegatingMethodAccessorImpl.invoke(DelegatingMethodAccessorImpl.java:43)
2017-03-20T00:23:30.986 [INFO] 	at java.lang.reflect.Method.invoke(Method.java:498)
2017-03-20T00:23:30.986 [INFO] 	at org.codehaus.plexus.classworlds.launcher.Launcher.launchEnhanced(Launcher.java:289)
2017-03-20T00:23:30.986 [INFO] 	at org.codehaus.plexus.classworlds.launcher.Launcher.launch(Launcher.java:229)
2017-03-20T00:23:30.986 [INFO] 	at org.codehaus.plexus.classworlds.launcher.Launcher.mainWithExitCode(Launcher.java:415)
2017-03-20T00:23:30.986 [INFO] 	at org.codehaus.plexus.classworlds.launcher.Launcher.main(Launcher.java:356)
2017-03-20T00:23:30.986 [INFO] Caused by: org.apache.maven.plugin.PluginExecutionException:
Execution default of goal org.apache.maven.plugins:maven-shade-plugin:2.4.1:shade failed:
Plugin org.apache.maven.plugins:maven-shade-plugin:2.4.1 or one of its dependencies could
not be resolved: Could not transfer artifact org.ow2.asm:asm-analysis:jar:5.0.3 from/to central
(https://repo.maven.apache.org/maven2): Connect to repo.maven.apache.org:443 [repo.maven.apache.org/151.101.44.215]
failed: Connection timed out (Connection timed out)
2017-03-20T00:23:30.986 [INFO] 	at org.apache.maven.plugin.DefaultBuildPluginManager.executeMojo(DefaultBuildPluginManager.java:106)
2017-03-20T00:23:30.986 [INFO] 	at org.apache.maven.lifecycle.internal.MojoExecutor.execute(MojoExecutor.java:208)
2017-03-20T00:23:30.986 [INFO] 	... 20 more
2017-03-20T00:23:30.986 [INFO] Caused by: org.apache.maven.plugin.PluginResolutionException:
Plugin org.apache.maven.plugins:maven-shade-plugin:2.4.1 or one of its dependencies could
not be resolved: Could not transfer artifact org.ow2.asm:asm-analysis:jar:5.0.3 from/to central
(https://repo.maven.apache.org/maven2): Connect to repo.maven.apache.org:443 [repo.maven.apache.org/151.101.44.215]
failed: Connection timed out (Connection timed out)
2017-03-20T00:23:30.986 [INFO] 	at org.apache.maven.plugin.internal.DefaultPluginDependenciesResolver.resolveInternal(DefaultPluginDependenciesResolver.java:218)
2017-03-20T00:23:30.986 [INFO] 	at org.apache.maven.plugin.internal.DefaultPluginDependenciesResolver.resolve(DefaultPluginDependenciesResolver.java:149)
2017-03-20T00:23:30.986 [INFO] 	at org.apache.maven.plugin.internal.DefaultMavenPluginManager.createPluginRealm(DefaultMavenPluginManager.java:422)
2017-03-20T00:23:30.986 [INFO] 	at org.apache.maven.plugin.internal.DefaultMavenPluginManager.setupPluginRealm(DefaultMavenPluginManager.java:385)
2017-03-20T00:23:30.986 [INFO] 	at org.apache.maven.plugin.DefaultBuildPluginManager.getPluginRealm(DefaultBuildPluginManager.java:231)
2017-03-20T00:23:30.986 [INFO] 	at org.apache.maven.plugin.DefaultBuildPluginManager.executeMojo(DefaultBuildPluginManager.java:102)
2017-03-20T00:23:30.986 [INFO] 	... 21 more
2017-03-20T00:23:30.986 [INFO] Caused by: org.eclipse.aether.resolution.ArtifactResolutionException:
Could not transfer artifact org.ow2.asm:asm-analysis:jar:5.0.3 from/to central (https://repo.maven.apache.org/maven2):
Connect to repo.maven.apache.org:443 [repo.maven.apache.org/151.101.44.215] failed: Connection
timed out (Connection timed out)
2017-03-20T00:23:30.986 [INFO] 	at org.eclipse.aether.internal.impl.DefaultArtifactResolver.resolve(DefaultArtifactResolver.java:444)
2017-03-20T00:23:30.986 [INFO] 	at org.eclipse.aether.internal.impl.DefaultArtifactResolver.resolveArtifacts(DefaultArtifactResolver.java:246)
2017-03-20T00:23:30.986 [INFO] 	at org.eclipse.aether.internal.impl.DefaultRepositorySystem.resolveDependencies(DefaultRepositorySystem.java:367)
2017-03-20T00:23:30.986 [INFO] 	at org.apache.maven.plugin.internal.DefaultPluginDependenciesResolver.resolveInternal(DefaultPluginDependenciesResolver.java:210)
2017-03-20T00:23:30.986 [INFO] 	... 26 more
2017-03-20T00:23:30.986 [INFO] Caused by: org.eclipse.aether.transfer.ArtifactTransferException:
Could not transfer artifact org.ow2.asm:asm-analysis:jar:5.0.3 from/to central (https://repo.maven.apache.org/maven2):
Connect to repo.maven.apache.org:443 [repo.maven.apache.org/151.101.44.215] failed: Connection
timed out (Connection timed out)
2017-03-20T00:23:30.986 [INFO] 	at org.eclipse.aether.connector.basic.ArtifactTransportListener.transferFailed(ArtifactTransportListener.java:43)
2017-03-20T00:23:30.986 [INFO] 	at org.eclipse.aether.connector.basic.BasicRepositoryConnector$TaskRunner.run(BasicRepositoryConnector.java:355)
2017-03-20T00:23:30.986 [INFO] 	at org.eclipse.aether.util.concurrency.RunnableErrorForwarder$1.run(RunnableErrorForwarder.java:67)
2017-03-20T00:23:30.986 [INFO] 	at java.util.concurrent.ThreadPoolExecutor.runWorker(ThreadPoolExecutor.java:1142)
2017-03-20T00:23:30.986 [INFO] 	at java.util.concurrent.ThreadPoolExecutor$Worker.run(ThreadPoolExecutor.java:617)
2017-03-20T00:23:30.986 [INFO] 	at java.lang.Thread.run(Thread.java:745)
2017-03-20T00:23:30.987 [INFO] Caused by: org.apache.maven.wagon.TransferFailedException:
Connect to repo.maven.apache.org:443 [repo.maven.apache.org/151.101.44.215] failed: Connection
timed out (Connection timed out)
2017-03-20T00:23:30.987 [INFO] 	at org.apache.maven.wagon.providers.http.AbstractHttpClientWagon.fillInputData(AbstractHttpClientWagon.java:1066)
2017-03-20T00:23:30.987 [INFO] 	at org.apache.maven.wagon.providers.http.AbstractHttpClientWagon.fillInputData(AbstractHttpClientWagon.java:960)
2017-03-20T00:23:30.987 [INFO] 	at org.apache.maven.wagon.StreamWagon.getInputStream(StreamWagon.java:116)
2017-03-20T00:23:30.987 [INFO] 	at org.apache.maven.wagon.StreamWagon.getIfNewer(StreamWagon.java:88)
2017-03-20T00:23:30.987 [INFO] 	at org.apache.maven.wagon.StreamWagon.get(StreamWagon.java:61)
2017-03-20T00:23:30.987 [INFO] 	at org.eclipse.aether.transport.wagon.WagonTransporter$GetTaskRunner.run(WagonTransporter.java:560)
2017-03-20T00:23:30.987 [INFO] 	at org.eclipse.aether.transport.wagon.WagonTransporter.execute(WagonTransporter.java:427)
2017-03-20T00:23:30.987 [INFO] 	at org.eclipse.aether.transport.wagon.WagonTransporter.get(WagonTransporter.java:404)
2017-03-20T00:23:30.987 [INFO] 	at org.eclipse.aether.connector.basic.BasicRepositoryConnector$GetTaskRunner.runTask(BasicRepositoryConnector.java:447)
2017-03-20T00:23:30.987 [INFO] 	at org.eclipse.aether.connector.basic.BasicRepositoryConnector$TaskRunner.run(BasicRepositoryConnector.java:350)
2017-03-20T00:23:30.987 [INFO] 	... 4 more
2017-03-20T00:23:30.987 [INFO] Caused by: org.apache.maven.wagon.providers.http.httpclient.conn.HttpHostConnectException:
Connect to repo.maven.apache.org:443 [repo.maven.apache.org/151.101.44.215] failed: Connection
timed out (Connection timed out)
2017-03-20T00:23:30.987 [INFO] 	at org.apache.maven.wagon.providers.http.httpclient.impl.conn.HttpClientConnectionOperator.connect(HttpClientConnectionOperator.java:140)
2017-03-20T00:23:30.987 [INFO] 	at org.apache.maven.wagon.providers.http.httpclient.impl.conn.PoolingHttpClientConnectionManager.connect(PoolingHttpClientConnectionManager.java:318)
2017-03-20T00:23:30.987 [INFO] 	at org.apache.maven.wagon.providers.http.httpclient.impl.execchain.MainClientExec.establishRoute(MainClientExec.java:363)
2017-03-20T00:23:30.987 [INFO] 	at org.apache.maven.wagon.providers.http.httpclient.impl.execchain.MainClientExec.execute(MainClientExec.java:219)
2017-03-20T00:23:30.987 [INFO] 	at org.apache.maven.wagon.providers.http.httpclient.impl.execchain.ProtocolExec.execute(ProtocolExec.java:195)
2017-03-20T00:23:30.987 [INFO] 	at org.apache.maven.wagon.providers.http.httpclient.impl.execchain.RetryExec.execute(RetryExec.java:86)
2017-03-20T00:23:30.987 [INFO] 	at org.apache.maven.wagon.providers.http.httpclient.impl.execchain.RedirectExec.execute(RedirectExec.java:108)
2017-03-20T00:23:30.987 [INFO] 	at org.apache.maven.wagon.providers.http.httpclient.impl.client.InternalHttpClient.doExecute(InternalHttpClient.java:184)
2017-03-20T00:23:30.987 [INFO] 	at org.apache.maven.wagon.providers.http.httpclient.impl.client.CloseableHttpClient.execute(CloseableHttpClient.java:82)
2017-03-20T00:23:30.987 [INFO] 	at org.apache.maven.wagon.providers.http.AbstractHttpClientWagon.execute(AbstractHttpClientWagon.java:832)
2017-03-20T00:23:30.988 [INFO] 	at org.apache.maven.wagon.providers.http.AbstractHttpClientWagon.fillInputData(AbstractHttpClientWagon.java:983)
2017-03-20T00:23:30.988 [INFO] 	... 13 more
2017-03-20T00:23:30.988 [INFO] Caused by: java.net.ConnectException: Connection timed out
(Connection timed out)
2017-03-20T00:23:30.988 [INFO] 	at java.net.PlainSocketImpl.socketConnect(Native Method)
2017-03-20T00:23:30.988 [INFO] 	at java.net.AbstractPlainSocketImpl.doConnect(AbstractPlainSocketImpl.java:350)
2017-03-20T00:23:30.988 [INFO] 	at java.net.AbstractPlainSocketImpl.connectToAddress(AbstractPlainSocketImpl.java:206)
2017-03-20T00:23:30.988 [INFO] 	at java.net.AbstractPlainSocketImpl.connect(AbstractPlainSocketImpl.java:188)
2017-03-20T00:23:30.988 [INFO] 	at java.net.SocksSocketImpl.connect(SocksSocketImpl.java:392)
2017-03-20T00:23:30.988 [INFO] 	at java.net.Socket.connect(Socket.java:589)
2017-03-20T00:23:30.988 [INFO] 	at org.apache.maven.wagon.providers.http.httpclient.conn.ssl.SSLConnectionSocketFactory.connectSocket(SSLConnectionSocketFactory.java:239)
2017-03-20T00:23:30.988 [INFO] 	at org.apache.maven.wagon.providers.http.httpclient.impl.conn.HttpClientConnectionOperator.connect(HttpClientConnectionOperator.java:123)
2017-03-20T00:23:30.988 [INFO] 	... 23 more
2017-03-20T00:23:30.988 [INFO] 2017-03-20\T\00:23:30.987 [ERROR] 
2017-03-20T00:23:30.988 [INFO] 2017-03-20\T\00:23:30.987 [ERROR] Re-run Maven using the -X
switch to enable full debug logging.
2017-03-20T00:23:30.988 [INFO] 2017-03-20\T\00:23:30.987 [ERROR] 
2017-03-20T00:23:30.988 [INFO] 2017-03-20\T\00:23:30.987 [ERROR] For more information about
the errors and possible solutions, please read the following articles:
2017-03-20T00:23:30.988 [INFO] 2017-03-20\T\00:23:30.987 [ERROR] [Help 1] http://cwiki.apache.org/confluence/display/MAVEN/PluginResolutionException
2017-03-20T00:23:31.012 [INFO] Post-archetype-generation invoker exit code: 1
[JENKINS] Recording test results
[JENKINS] Archiving disabled
2017-03-20T00:23:31.829 [INFO]                                                           
             
2017-03-20T00:23:31.829 [INFO] ------------------------------------------------------------------------
2017-03-20T00:23:31.829 [INFO] Skipping Apache Beam :: Parent
2017-03-20T00:23:31.829 [INFO] This project has been banned from the build due to previous
failures.
2017-03-20T00:23:31.829 [INFO] ------------------------------------------------------------------------
[JENKINS] Archiving disabled
[JENKINS] Archiving disabled
[JENKINS] Archiving disabled
[JENKINS] Archiving disabled
[JENKINS] Archiving disabled
[JENKINS] Archiving disabled
[JENKINS] Archiving disabled
[JENKINS] Archiving disabled
[JENKINS] Archiving disabled
[JENKINS] Archiving disabled
[JENKINS] Archiving disabled
[JENKINS] Archiving disabled
[JENKINS] Archiving disabled
[JENKINS] Archiving disabled
[JENKINS] Archiving disabled
[JENKINS] Archiving disabled
[JENKINS] Archiving disabled
[JENKINS] Archiving disabled
[JENKINS] Archiving disabled
[JENKINS] Archiving disabled
[JENKINS] Archiving disabled
[JENKINS] Archiving disabled
[JENKINS] Archiving disabled
[JENKINS] Archiving disabled
[JENKINS] Archiving disabled
[JENKINS] Archiving disabled
[JENKINS] Archiving disabled
[JENKINS] Archiving disabled
[JENKINS] Archiving disabled
[JENKINS] Archiving disabled
[JENKINS] Archiving disabled
[JENKINS] Archiving disabled
[JENKINS] Archiving disabled
[JENKINS] Archiving disabled
[JENKINS] Archiving disabled
[JENKINS] Archiving disabled
[JENKINS] Archiving disabled
[JENKINS] Archiving disabled
[JENKINS] Archiving disabled
[JENKINS] Archiving disabled
[JENKINS] Archiving disabled
[JENKINS] Archiving disabled
2017-03-20T00:23:49.038 [INFO] ------------------------------------------------------------------------
2017-03-20T00:23:49.038 [INFO] Reactor Summary:
2017-03-20T00:23:49.038 [INFO] 
2017-03-20T00:23:49.038 [INFO] Apache Beam :: Parent .............................. SUCCESS
[ 29.451 s]
2017-03-20T00:23:49.038 [INFO] Apache Beam :: SDKs :: Java :: Build Tools ......... SUCCESS
[  9.261 s]
2017-03-20T00:23:49.038 [INFO] Apache Beam :: SDKs ................................ SUCCESS
[  5.867 s]
2017-03-20T00:23:49.038 [INFO] Apache Beam :: SDKs :: Common ...................... SUCCESS
[  1.571 s]
2017-03-20T00:23:49.038 [INFO] Apache Beam :: SDKs :: Common :: Fn API ............ SUCCESS
[ 17.516 s]
2017-03-20T00:23:49.039 [INFO] Apache Beam :: SDKs :: Common :: Runner API ........ SUCCESS
[ 18.187 s]
2017-03-20T00:23:49.039 [INFO] Apache Beam :: SDKs :: Java ........................ SUCCESS
[  1.783 s]
2017-03-20T00:23:49.039 [INFO] Apache Beam :: SDKs :: Java :: Core ................ SUCCESS
[02:34 min]
2017-03-20T00:23:49.039 [INFO] Apache Beam :: Runners ............................. SUCCESS
[  1.996 s]
2017-03-20T00:23:49.039 [INFO] Apache Beam :: Runners :: Core Java Construction ... SUCCESS
[ 14.472 s]
2017-03-20T00:23:49.039 [INFO] Apache Beam :: Runners :: Core Java ................ SUCCESS
[ 48.261 s]
2017-03-20T00:23:49.039 [INFO] Apache Beam :: Runners :: Direct Java .............. SUCCESS
[02:27 min]
2017-03-20T00:23:49.039 [INFO] Apache Beam :: SDKs :: Java :: IO .................. SUCCESS
[  1.747 s]
2017-03-20T00:23:49.039 [INFO] Apache Beam :: SDKs :: Java :: IO :: Elasticsearch . SUCCESS
[ 31.109 s]
2017-03-20T00:23:49.039 [INFO] Apache Beam :: Runners :: Google Cloud Dataflow .... SUCCESS
[ 30.457 s]
2017-03-20T00:23:49.039 [INFO] Apache Beam :: SDKs :: Java :: IO :: Google Cloud Platform
SUCCESS [05:58 min]
2017-03-20T00:23:49.039 [INFO] Apache Beam :: SDKs :: Java :: IO :: Hadoop Common . SUCCESS
[ 19.961 s]
2017-03-20T00:23:49.039 [INFO] Apache Beam :: SDKs :: Java :: IO :: HBase ......... SUCCESS
[ 25.807 s]
2017-03-20T00:23:49.039 [INFO] Apache Beam :: SDKs :: Java :: IO :: HDFS .......... SUCCESS
[ 23.116 s]
2017-03-20T00:23:49.039 [INFO] Apache Beam :: SDKs :: Java :: IO :: JDBC .......... SUCCESS
[ 21.404 s]
2017-03-20T00:23:49.039 [INFO] Apache Beam :: SDKs :: Java :: IO :: JMS ........... SUCCESS
[ 19.469 s]
2017-03-20T00:23:49.039 [INFO] Apache Beam :: SDKs :: Java :: IO :: Kafka ......... SUCCESS
[ 22.417 s]
2017-03-20T00:23:49.039 [INFO] Apache Beam :: SDKs :: Java :: IO :: Kinesis ....... SUCCESS
[ 24.281 s]
2017-03-20T00:23:49.039 [INFO] Apache Beam :: SDKs :: Java :: IO :: MongoDB ....... SUCCESS
[ 30.531 s]
2017-03-20T00:23:49.039 [INFO] Apache Beam :: SDKs :: Java :: IO :: MQTT .......... SUCCESS
[ 17.770 s]
2017-03-20T00:23:49.039 [INFO] Apache Beam :: SDKs :: Java :: Maven Archetypes .... SUCCESS
[  1.561 s]
2017-03-20T00:23:49.039 [INFO] Apache Beam :: SDKs :: Java :: Maven Archetypes :: Starter
SUCCESS [ 14.364 s]
2017-03-20T00:23:49.039 [INFO] Apache Beam :: SDKs :: Java :: Maven Archetypes :: Examples
FAILURE [02:20 min]
2017-03-20T00:23:49.039 [INFO] Apache Beam :: SDKs :: Java :: Maven Archetypes :: Examples
- Java 8 SKIPPED
2017-03-20T00:23:49.039 [INFO] Apache Beam :: SDKs :: Java :: Extensions .......... SKIPPED
2017-03-20T00:23:49.039 [INFO] Apache Beam :: SDKs :: Java :: Extensions :: Jackson SKIPPED
2017-03-20T00:23:49.039 [INFO] Apache Beam :: SDKs :: Java :: Extensions :: Join library SKIPPED
2017-03-20T00:23:49.039 [INFO] Apache Beam :: SDKs :: Java :: Extensions :: Sorter  SKIPPED
2017-03-20T00:23:49.039 [INFO] Apache Beam :: SDKs :: Java :: Harness ............. SKIPPED
2017-03-20T00:23:49.039 [INFO] Apache Beam :: SDKs :: Java :: Java 8 Tests ........ SKIPPED
2017-03-20T00:23:49.039 [INFO] Apache Beam :: SDKs :: Python ...................... SKIPPED
2017-03-20T00:23:49.039 [INFO] Apache Beam :: Runners :: Flink .................... SKIPPED
2017-03-20T00:23:49.039 [INFO] Apache Beam :: Runners :: Flink :: Core ............ SKIPPED
2017-03-20T00:23:49.039 [INFO] Apache Beam :: Runners :: Flink :: Examples ........ SKIPPED
2017-03-20T00:23:49.039 [INFO] Apache Beam :: Runners :: Spark .................... SKIPPED
2017-03-20T00:23:49.039 [INFO] Apache Beam :: Runners :: Apex ..................... SKIPPED
2017-03-20T00:23:49.039 [INFO] Apache Beam :: Examples ............................ SKIPPED
2017-03-20T00:23:49.039 [INFO] Apache Beam :: Examples :: Java .................... SKIPPED
2017-03-20T00:23:49.039 [INFO] Apache Beam :: Examples :: Java 8 .................. SKIPPED
2017-03-20T00:23:49.039 [INFO] Apache Beam :: SDKs :: Java :: Aggregated Javadoc .. SKIPPED
2017-03-20T00:23:49.039 [INFO] ------------------------------------------------------------------------
2017-03-20T00:23:49.039 [INFO] BUILD FAILURE
2017-03-20T00:23:49.039 [INFO] ------------------------------------------------------------------------
2017-03-20T00:23:49.039 [INFO] Total time: 21:37 min
2017-03-20T00:23:49.039 [INFO] Finished at: 2017-03-20T00:23:49+00:00
2017-03-20T00:23:49.761 [INFO] Final Memory: 205M/1550M
2017-03-20T00:23:49.761 [INFO] ------------------------------------------------------------------------
Waiting for Jenkins to finish collecting data
2017-03-20T00:24:00.497 [ERROR] Failed to execute goal org.apache.maven.plugins:maven-archetype-plugin:2.4:integration-test
(default-integration-test) on project beam-sdks-java-maven-archetypes-examples:
2017-03-20T00:24:00.498 [ERROR] Archetype IT 'basic' failed: Execution failure: exit code
= 1
2017-03-20T00:24:00.498 [ERROR] -> [Help 1]
org.apache.maven.lifecycle.LifecycleExecutionException: Failed to execute goal org.apache.maven.plugins:maven-archetype-plugin:2.4:integration-test
(default-integration-test) on project beam-sdks-java-maven-archetypes-examples: 
Archetype IT 'basic' failed: Execution failure: exit code = 1
	at org.apache.maven.lifecycle.internal.MojoExecutor.execute(MojoExecutor.java:216)
	at org.apache.maven.lifecycle.internal.MojoExecutor.execute(MojoExecutor.java:153)
	at org.apache.maven.lifecycle.internal.MojoExecutor.execute(MojoExecutor.java:145)
	at org.apache.maven.lifecycle.internal.LifecycleModuleBuilder.buildProject(LifecycleModuleBuilder.java:116)
	at org.apache.maven.lifecycle.internal.LifecycleModuleBuilder.buildProject(LifecycleModuleBuilder.java:80)
	at org.apache.maven.lifecycle.internal.builder.singlethreaded.SingleThreadedBuilder.build(SingleThreadedBuilder.java:51)
	at org.apache.maven.lifecycle.internal.LifecycleStarter.execute(LifecycleStarter.java:128)
	at org.apache.maven.DefaultMaven.doExecute(DefaultMaven.java:307)
	at org.apache.maven.DefaultMaven.doExecute(DefaultMaven.java:193)
	at org.apache.maven.DefaultMaven.execute(DefaultMaven.java:106)
	at org.jvnet.hudson.maven3.launcher.Maven33Launcher.main(Maven33Launcher.java:129)
	at sun.reflect.NativeMethodAccessorImpl.invoke0(Native Method)
	at sun.reflect.NativeMethodAccessorImpl.invoke(NativeMethodAccessorImpl.java:62)
	at sun.reflect.DelegatingMethodAccessorImpl.invoke(DelegatingMethodAccessorImpl.java:43)
	at java.lang.reflect.Method.invoke(Method.java:498)
	at org.codehaus.plexus.classworlds.launcher.Launcher.launchStandard(Launcher.java:330)
	at org.codehaus.plexus.classworlds.launcher.Launcher.launch(Launcher.java:238)
	at jenkins.maven3.agent.Maven33Main.launch(Maven33Main.java:176)
	at sun.reflect.NativeMethodAccessorImpl.invoke0(Native Method)
	at sun.reflect.NativeMethodAccessorImpl.invoke(NativeMethodAccessorImpl.java:62)
	at sun.reflect.DelegatingMethodAccessorImpl.invoke(DelegatingMethodAccessorImpl.java:43)
	at java.lang.reflect.Method.invoke(Method.java:498)
	at hudson.maven.Maven3Builder.call(Maven3Builder.java:139)
	at hudson.maven.Maven3Builder.call(Maven3Builder.java:70)
	at hudson.remoting.UserRequest.perform(UserRequest.java:153)
	at hudson.remoting.UserRequest.perform(UserRequest.java:50)
	at hudson.remoting.Request$2.run(Request.java:336)
	at hudson.remoting.InterceptingExecutorService$1.call(InterceptingExecutorService.java:68)
	at java.util.concurrent.FutureTask.run(FutureTask.java:266)
	at java.util.concurrent.ThreadPoolExecutor.runWorker(ThreadPoolExecutor.java:1142)
	at java.util.concurrent.ThreadPoolExecutor$Worker.run(ThreadPoolExecutor.java:617)
	at java.lang.Thread.run(Thread.java:745)
Caused by: org.apache.maven.plugin.MojoExecutionException: 
Archetype IT 'basic' failed: Execution failure: exit code = 1
	at org.apache.maven.archetype.mojos.IntegrationTestMojo.execute(IntegrationTestMojo.java:269)
	at org.apache.maven.plugin.DefaultBuildPluginManager.executeMojo(DefaultBuildPluginManager.java:134)
	at org.apache.maven.lifecycle.internal.MojoExecutor.execute(MojoExecutor.java:208)
	... 31 more
2017-03-20T00:24:00.499 [ERROR] 
2017-03-20T00:24:00.499 [ERROR] Re-run Maven using the -X switch to enable full debug logging.
2017-03-20T00:24:00.499 [ERROR] 
2017-03-20T00:24:00.499 [ERROR] For more information about the errors and possible solutions,
please read the following articles:
2017-03-20T00:24:00.499 [ERROR] [Help 1] http://cwiki.apache.org/confluence/display/MAVEN/MojoExecutionException
2017-03-20T00:24:00.499 [ERROR] 
2017-03-20T00:24:00.499 [ERROR] After correcting the problems, you can resume the build with
the command
2017-03-20T00:24:00.499 [ERROR]   mvn <goals> -rf :beam-sdks-java-maven-archetypes-examples
channel stopped

Mime
View raw message