beam-commits mailing list archives

Site index · List index
Message view « Date » · « Thread »
Top « Date » · « Thread »
From Apache Jenkins Server <jenk...@builds.apache.org>
Subject Build failed in Jenkins: beam_PostCommit_Python_Verify #1543
Date Sat, 18 Mar 2017 03:20:39 GMT
See <https://builds.apache.org/job/beam_PostCommit_Python_Verify/1543/display/redirect>

------------------------------------------
[...truncated 425.66 KB...]
root: INFO: Starting GCS upload to gs://temp-storage-for-end-to-end-tests/staging-validatesrunner-test/beamapp-jenkins-0318030552-455859.1489806352.456037/pyparsing-2.2.0.tar.gz...
root: INFO: Completed GCS upload to gs://temp-storage-for-end-to-end-tests/staging-validatesrunner-test/beamapp-jenkins-0318030552-455859.1489806352.456037/pyparsing-2.2.0.tar.gz
root: INFO: Starting GCS upload to gs://temp-storage-for-end-to-end-tests/staging-validatesrunner-test/beamapp-jenkins-0318030552-455859.1489806352.456037/setuptools-34.1.0.zip...
root: INFO: Completed GCS upload to gs://temp-storage-for-end-to-end-tests/staging-validatesrunner-test/beamapp-jenkins-0318030552-455859.1489806352.456037/setuptools-34.1.0.zip
root: INFO: Starting GCS upload to gs://temp-storage-for-end-to-end-tests/staging-validatesrunner-test/beamapp-jenkins-0318030552-455859.1489806352.456037/setuptools-34.2.0.zip...
root: INFO: Completed GCS upload to gs://temp-storage-for-end-to-end-tests/staging-validatesrunner-test/beamapp-jenkins-0318030552-455859.1489806352.456037/setuptools-34.2.0.zip
root: INFO: Starting GCS upload to gs://temp-storage-for-end-to-end-tests/staging-validatesrunner-test/beamapp-jenkins-0318030552-455859.1489806352.456037/pbr-2.0.0.tar.gz...
root: INFO: Completed GCS upload to gs://temp-storage-for-end-to-end-tests/staging-validatesrunner-test/beamapp-jenkins-0318030552-455859.1489806352.456037/pbr-2.0.0.tar.gz
root: INFO: Starting GCS upload to gs://temp-storage-for-end-to-end-tests/staging-validatesrunner-test/beamapp-jenkins-0318030552-455859.1489806352.456037/packaging-16.8.tar.gz...
root: INFO: Completed GCS upload to gs://temp-storage-for-end-to-end-tests/staging-validatesrunner-test/beamapp-jenkins-0318030552-455859.1489806352.456037/packaging-16.8.tar.gz
root: INFO: Starting GCS upload to gs://temp-storage-for-end-to-end-tests/staging-validatesrunner-test/beamapp-jenkins-0318030552-455859.1489806352.456037/mock-2.0.0.tar.gz...
root: INFO: Completed GCS upload to gs://temp-storage-for-end-to-end-tests/staging-validatesrunner-test/beamapp-jenkins-0318030552-455859.1489806352.456037/mock-2.0.0.tar.gz
root: INFO: Starting GCS upload to gs://temp-storage-for-end-to-end-tests/staging-validatesrunner-test/beamapp-jenkins-0318030552-455859.1489806352.456037/funcsigs-1.0.2.tar.gz...
root: INFO: Completed GCS upload to gs://temp-storage-for-end-to-end-tests/staging-validatesrunner-test/beamapp-jenkins-0318030552-455859.1489806352.456037/funcsigs-1.0.2.tar.gz
root: INFO: Starting GCS upload to gs://temp-storage-for-end-to-end-tests/staging-validatesrunner-test/beamapp-jenkins-0318030552-455859.1489806352.456037/PyHamcrest-1.9.0.tar.gz...
root: INFO: Completed GCS upload to gs://temp-storage-for-end-to-end-tests/staging-validatesrunner-test/beamapp-jenkins-0318030552-455859.1489806352.456037/PyHamcrest-1.9.0.tar.gz
root: INFO: Starting GCS upload to gs://temp-storage-for-end-to-end-tests/staging-validatesrunner-test/beamapp-jenkins-0318030552-455859.1489806352.456037/pbr-1.10.0.tar.gz...
root: INFO: Completed GCS upload to gs://temp-storage-for-end-to-end-tests/staging-validatesrunner-test/beamapp-jenkins-0318030552-455859.1489806352.456037/pbr-1.10.0.tar.gz
root: INFO: Starting GCS upload to gs://temp-storage-for-end-to-end-tests/staging-validatesrunner-test/beamapp-jenkins-0318030552-455859.1489806352.456037/setuptools-34.3.1.zip...
root: INFO: Completed GCS upload to gs://temp-storage-for-end-to-end-tests/staging-validatesrunner-test/beamapp-jenkins-0318030552-455859.1489806352.456037/setuptools-34.3.1.zip
root: INFO: Starting GCS upload to gs://temp-storage-for-end-to-end-tests/staging-validatesrunner-test/beamapp-jenkins-0318030552-455859.1489806352.456037/setuptools-34.3.2.zip...
root: INFO: Completed GCS upload to gs://temp-storage-for-end-to-end-tests/staging-validatesrunner-test/beamapp-jenkins-0318030552-455859.1489806352.456037/setuptools-34.3.2.zip
root: INFO: Starting GCS upload to gs://temp-storage-for-end-to-end-tests/staging-validatesrunner-test/beamapp-jenkins-0318030552-455859.1489806352.456037/setuptools-34.1.1.zip...
root: INFO: Completed GCS upload to gs://temp-storage-for-end-to-end-tests/staging-validatesrunner-test/beamapp-jenkins-0318030552-455859.1489806352.456037/setuptools-34.1.1.zip
root: INFO: Starting GCS upload to gs://temp-storage-for-end-to-end-tests/staging-validatesrunner-test/beamapp-jenkins-0318030552-455859.1489806352.456037/pyparsing-2.1.10.zip...
root: INFO: Completed GCS upload to gs://temp-storage-for-end-to-end-tests/staging-validatesrunner-test/beamapp-jenkins-0318030552-455859.1489806352.456037/pyparsing-2.1.10.zip
root: INFO: Starting GCS upload to gs://temp-storage-for-end-to-end-tests/staging-validatesrunner-test/beamapp-jenkins-0318030552-455859.1489806352.456037/setuptools-34.0.2.zip...
root: INFO: Completed GCS upload to gs://temp-storage-for-end-to-end-tests/staging-validatesrunner-test/beamapp-jenkins-0318030552-455859.1489806352.456037/setuptools-34.0.2.zip
root: INFO: Copying Beam SDK "dist/apache-beam-0.7.0.dev0.tar.gz" to staging location.
root: INFO: Starting GCS upload to gs://temp-storage-for-end-to-end-tests/staging-validatesrunner-test/beamapp-jenkins-0318030552-455859.1489806352.456037/dataflow_python_sdk.tar...
root: INFO: Completed GCS upload to gs://temp-storage-for-end-to-end-tests/staging-validatesrunner-test/beamapp-jenkins-0318030552-455859.1489806352.456037/dataflow_python_sdk.tar
--------------------- >> end captured logging << ---------------------

======================================================================
ERROR: test_par_do_with_multiple_outputs_and_using_return (apache_beam.transforms.ptransform_test.PTransformTest)
----------------------------------------------------------------------
Traceback (most recent call last):
  File "<https://builds.apache.org/job/beam_PostCommit_Python_Verify/ws/sdks/python/apache_beam/transforms/ptransform_test.py",>
line 207, in test_par_do_with_multiple_outputs_and_using_return
    pipeline.run()
  File "<https://builds.apache.org/job/beam_PostCommit_Python_Verify/ws/sdks/python/apache_beam/test_pipeline.py",>
line 91, in run
    result = super(TestPipeline, self).run()
  File "<https://builds.apache.org/job/beam_PostCommit_Python_Verify/ws/sdks/python/apache_beam/pipeline.py",>
line 163, in run
    return self.runner.run(self)
  File "<https://builds.apache.org/job/beam_PostCommit_Python_Verify/ws/sdks/python/apache_beam/runners/dataflow/test_dataflow_runner.py",>
line 32, in run
    self.result = super(TestDataflowRunner, self).run(pipeline)
  File "<https://builds.apache.org/job/beam_PostCommit_Python_Verify/ws/sdks/python/apache_beam/runners/dataflow/dataflow_runner.py",>
line 175, in run
    self.dataflow_client.create_job(self.job), self)
  File "<https://builds.apache.org/job/beam_PostCommit_Python_Verify/ws/sdks/python/apache_beam/utils/retry.py",>
line 174, in wrapper
    return fun(*args, **kwargs)
  File "<https://builds.apache.org/job/beam_PostCommit_Python_Verify/ws/sdks/python/apache_beam/runners/dataflow/internal/apiclient.py",>
line 411, in create_job
    self.create_job_description(job)
  File "<https://builds.apache.org/job/beam_PostCommit_Python_Verify/ws/sdks/python/apache_beam/runners/dataflow/internal/apiclient.py",>
line 432, in create_job_description
    job.options, file_copy=self._gcs_file_copy)
  File "<https://builds.apache.org/job/beam_PostCommit_Python_Verify/ws/sdks/python/apache_beam/runners/dataflow/internal/dependency.py",>
line 395, in stage_job_resources
    shutil.rmtree(temp_dir)
  File "/usr/lib/python2.7/shutil.py", line 239, in rmtree
    onerror(os.listdir, path, sys.exc_info())
  File "/usr/lib/python2.7/shutil.py", line 237, in rmtree
    names = os.listdir(path)
OSError: [Errno 2] No such file or directory: '/tmp/tmpcbAfPl'
-------------------- >> begin captured logging << --------------------
root: DEBUG: PValue computed by Some Numbers (tag 1): refcount: 1 => 0
root: DEBUG: PValue computed by ClassifyNumbers/FlatMap(some_fn) (tag 1): refcount: 1 =>
0
root: DEBUG: PValue computed by assert_that/WindowInto(WindowIntoFn) (tag 1): refcount: 1
=> 0
root: DEBUG: PValue computed by assert_that/ToVoidKey (tag 1): refcount: 1 => 0
root: DEBUG: PValue computed by assert_that/Group (tag 1): refcount: 1 => 0
root: DEBUG: PValue computed by assert_that/UnKey (tag 1): refcount: 1 => 0
root: DEBUG: PValue computed by ClassifyNumbers/FlatMap(some_fn) (tag 1): refcount: 1 =>
0
root: DEBUG: PValue computed by assert:odd/WindowInto(WindowIntoFn) (tag 1): refcount: 1 =>
0
root: DEBUG: PValue computed by assert:odd/ToVoidKey (tag 1): refcount: 1 => 0
root: DEBUG: PValue computed by assert:odd/Group (tag 1): refcount: 1 => 0
root: DEBUG: PValue computed by assert:odd/UnKey (tag 1): refcount: 1 => 0
root: DEBUG: PValue computed by ClassifyNumbers/FlatMap(some_fn) (tag 1): refcount: 1 =>
0
root: DEBUG: PValue computed by assert:even/WindowInto(WindowIntoFn) (tag 1): refcount: 1
=> 0
root: DEBUG: PValue computed by assert:even/ToVoidKey (tag 1): refcount: 1 => 0
root: DEBUG: PValue computed by assert:even/Group (tag 1): refcount: 1 => 0
root: DEBUG: PValue computed by assert:even/UnKey (tag 1): refcount: 1 => 0
root: INFO: Starting GCS upload to gs://temp-storage-for-end-to-end-tests/staging-validatesrunner-test/beamapp-jenkins-0318030552-426845.1489806352.427039/requirements.txt...
root: INFO: Completed GCS upload to gs://temp-storage-for-end-to-end-tests/staging-validatesrunner-test/beamapp-jenkins-0318030552-426845.1489806352.427039/requirements.txt
root: INFO: Executing command: ['<https://builds.apache.org/job/beam_PostCommit_Python_Verify/ws/sdks/python/bin/python',>
'-m', 'pip', 'install', '--download', '/tmp/dataflow-requirements-cache', '-r', 'postcommit_requirements.txt',
'--no-binary', ':all:']
root: INFO: Starting GCS upload to gs://temp-storage-for-end-to-end-tests/staging-validatesrunner-test/beamapp-jenkins-0318030552-426845.1489806352.427039/def.txt...
root: INFO: Completed GCS upload to gs://temp-storage-for-end-to-end-tests/staging-validatesrunner-test/beamapp-jenkins-0318030552-426845.1489806352.427039/def.txt
root: INFO: Starting GCS upload to gs://temp-storage-for-end-to-end-tests/staging-validatesrunner-test/beamapp-jenkins-0318030552-426845.1489806352.427039/setuptools-34.3.0.zip...
root: INFO: Completed GCS upload to gs://temp-storage-for-end-to-end-tests/staging-validatesrunner-test/beamapp-jenkins-0318030552-426845.1489806352.427039/setuptools-34.3.0.zip
root: INFO: Starting GCS upload to gs://temp-storage-for-end-to-end-tests/staging-validatesrunner-test/beamapp-jenkins-0318030552-426845.1489806352.427039/appdirs-1.4.0.tar.gz...
root: INFO: Completed GCS upload to gs://temp-storage-for-end-to-end-tests/staging-validatesrunner-test/beamapp-jenkins-0318030552-426845.1489806352.427039/appdirs-1.4.0.tar.gz
root: INFO: Starting GCS upload to gs://temp-storage-for-end-to-end-tests/staging-validatesrunner-test/beamapp-jenkins-0318030552-426845.1489806352.427039/abc.txt...
root: INFO: Completed GCS upload to gs://temp-storage-for-end-to-end-tests/staging-validatesrunner-test/beamapp-jenkins-0318030552-426845.1489806352.427039/abc.txt
root: INFO: Starting GCS upload to gs://temp-storage-for-end-to-end-tests/staging-validatesrunner-test/beamapp-jenkins-0318030552-426845.1489806352.427039/appdirs-1.4.1.tar.gz...
root: INFO: Completed GCS upload to gs://temp-storage-for-end-to-end-tests/staging-validatesrunner-test/beamapp-jenkins-0318030552-426845.1489806352.427039/appdirs-1.4.1.tar.gz
root: INFO: Starting GCS upload to gs://temp-storage-for-end-to-end-tests/staging-validatesrunner-test/beamapp-jenkins-0318030552-426845.1489806352.427039/setuptools-34.0.3.zip...
root: INFO: Completed GCS upload to gs://temp-storage-for-end-to-end-tests/staging-validatesrunner-test/beamapp-jenkins-0318030552-426845.1489806352.427039/setuptools-34.0.3.zip
root: INFO: Starting GCS upload to gs://temp-storage-for-end-to-end-tests/staging-validatesrunner-test/beamapp-jenkins-0318030552-426845.1489806352.427039/appdirs-1.4.2.tar.gz...
root: INFO: Completed GCS upload to gs://temp-storage-for-end-to-end-tests/staging-validatesrunner-test/beamapp-jenkins-0318030552-426845.1489806352.427039/appdirs-1.4.2.tar.gz
root: INFO: Starting GCS upload to gs://temp-storage-for-end-to-end-tests/staging-validatesrunner-test/beamapp-jenkins-0318030552-426845.1489806352.427039/appdirs-1.4.3.tar.gz...
root: INFO: Completed GCS upload to gs://temp-storage-for-end-to-end-tests/staging-validatesrunner-test/beamapp-jenkins-0318030552-426845.1489806352.427039/appdirs-1.4.3.tar.gz
root: INFO: Starting GCS upload to gs://temp-storage-for-end-to-end-tests/staging-validatesrunner-test/beamapp-jenkins-0318030552-426845.1489806352.427039/six-1.10.0.tar.gz...
root: INFO: Completed GCS upload to gs://temp-storage-for-end-to-end-tests/staging-validatesrunner-test/beamapp-jenkins-0318030552-426845.1489806352.427039/six-1.10.0.tar.gz
root: INFO: Starting GCS upload to gs://temp-storage-for-end-to-end-tests/staging-validatesrunner-test/beamapp-jenkins-0318030552-426845.1489806352.427039/pyparsing-2.2.0.tar.gz...
root: INFO: Completed GCS upload to gs://temp-storage-for-end-to-end-tests/staging-validatesrunner-test/beamapp-jenkins-0318030552-426845.1489806352.427039/pyparsing-2.2.0.tar.gz
root: INFO: Starting GCS upload to gs://temp-storage-for-end-to-end-tests/staging-validatesrunner-test/beamapp-jenkins-0318030552-426845.1489806352.427039/setuptools-34.1.0.zip...
root: INFO: Completed GCS upload to gs://temp-storage-for-end-to-end-tests/staging-validatesrunner-test/beamapp-jenkins-0318030552-426845.1489806352.427039/setuptools-34.1.0.zip
root: INFO: Starting GCS upload to gs://temp-storage-for-end-to-end-tests/staging-validatesrunner-test/beamapp-jenkins-0318030552-426845.1489806352.427039/setuptools-34.2.0.zip...
root: INFO: Completed GCS upload to gs://temp-storage-for-end-to-end-tests/staging-validatesrunner-test/beamapp-jenkins-0318030552-426845.1489806352.427039/setuptools-34.2.0.zip
root: INFO: Starting GCS upload to gs://temp-storage-for-end-to-end-tests/staging-validatesrunner-test/beamapp-jenkins-0318030552-426845.1489806352.427039/pbr-2.0.0.tar.gz...
root: INFO: Completed GCS upload to gs://temp-storage-for-end-to-end-tests/staging-validatesrunner-test/beamapp-jenkins-0318030552-426845.1489806352.427039/pbr-2.0.0.tar.gz
root: INFO: Starting GCS upload to gs://temp-storage-for-end-to-end-tests/staging-validatesrunner-test/beamapp-jenkins-0318030552-426845.1489806352.427039/packaging-16.8.tar.gz...
root: INFO: Completed GCS upload to gs://temp-storage-for-end-to-end-tests/staging-validatesrunner-test/beamapp-jenkins-0318030552-426845.1489806352.427039/packaging-16.8.tar.gz
root: INFO: Starting GCS upload to gs://temp-storage-for-end-to-end-tests/staging-validatesrunner-test/beamapp-jenkins-0318030552-426845.1489806352.427039/mock-2.0.0.tar.gz...
root: INFO: Completed GCS upload to gs://temp-storage-for-end-to-end-tests/staging-validatesrunner-test/beamapp-jenkins-0318030552-426845.1489806352.427039/mock-2.0.0.tar.gz
root: INFO: Starting GCS upload to gs://temp-storage-for-end-to-end-tests/staging-validatesrunner-test/beamapp-jenkins-0318030552-426845.1489806352.427039/funcsigs-1.0.2.tar.gz...
root: INFO: Completed GCS upload to gs://temp-storage-for-end-to-end-tests/staging-validatesrunner-test/beamapp-jenkins-0318030552-426845.1489806352.427039/funcsigs-1.0.2.tar.gz
root: INFO: Starting GCS upload to gs://temp-storage-for-end-to-end-tests/staging-validatesrunner-test/beamapp-jenkins-0318030552-426845.1489806352.427039/PyHamcrest-1.9.0.tar.gz...
root: INFO: Completed GCS upload to gs://temp-storage-for-end-to-end-tests/staging-validatesrunner-test/beamapp-jenkins-0318030552-426845.1489806352.427039/PyHamcrest-1.9.0.tar.gz
root: INFO: Starting GCS upload to gs://temp-storage-for-end-to-end-tests/staging-validatesrunner-test/beamapp-jenkins-0318030552-426845.1489806352.427039/pbr-1.10.0.tar.gz...
root: INFO: Completed GCS upload to gs://temp-storage-for-end-to-end-tests/staging-validatesrunner-test/beamapp-jenkins-0318030552-426845.1489806352.427039/pbr-1.10.0.tar.gz
root: INFO: Starting GCS upload to gs://temp-storage-for-end-to-end-tests/staging-validatesrunner-test/beamapp-jenkins-0318030552-426845.1489806352.427039/setuptools-34.3.1.zip...
root: INFO: Completed GCS upload to gs://temp-storage-for-end-to-end-tests/staging-validatesrunner-test/beamapp-jenkins-0318030552-426845.1489806352.427039/setuptools-34.3.1.zip
root: INFO: Starting GCS upload to gs://temp-storage-for-end-to-end-tests/staging-validatesrunner-test/beamapp-jenkins-0318030552-426845.1489806352.427039/setuptools-34.3.2.zip...
root: INFO: Completed GCS upload to gs://temp-storage-for-end-to-end-tests/staging-validatesrunner-test/beamapp-jenkins-0318030552-426845.1489806352.427039/setuptools-34.3.2.zip
root: INFO: Starting GCS upload to gs://temp-storage-for-end-to-end-tests/staging-validatesrunner-test/beamapp-jenkins-0318030552-426845.1489806352.427039/setuptools-34.1.1.zip...
root: INFO: Completed GCS upload to gs://temp-storage-for-end-to-end-tests/staging-validatesrunner-test/beamapp-jenkins-0318030552-426845.1489806352.427039/setuptools-34.1.1.zip
root: INFO: Starting GCS upload to gs://temp-storage-for-end-to-end-tests/staging-validatesrunner-test/beamapp-jenkins-0318030552-426845.1489806352.427039/pyparsing-2.1.10.zip...
root: INFO: Completed GCS upload to gs://temp-storage-for-end-to-end-tests/staging-validatesrunner-test/beamapp-jenkins-0318030552-426845.1489806352.427039/pyparsing-2.1.10.zip
root: INFO: Starting GCS upload to gs://temp-storage-for-end-to-end-tests/staging-validatesrunner-test/beamapp-jenkins-0318030552-426845.1489806352.427039/setuptools-34.0.2.zip...
root: INFO: Completed GCS upload to gs://temp-storage-for-end-to-end-tests/staging-validatesrunner-test/beamapp-jenkins-0318030552-426845.1489806352.427039/setuptools-34.0.2.zip
root: INFO: Copying Beam SDK "dist/apache-beam-0.7.0.dev0.tar.gz" to staging location.
root: INFO: Starting GCS upload to gs://temp-storage-for-end-to-end-tests/staging-validatesrunner-test/beamapp-jenkins-0318030552-426845.1489806352.427039/dataflow_python_sdk.tar...
root: INFO: Completed GCS upload to gs://temp-storage-for-end-to-end-tests/staging-validatesrunner-test/beamapp-jenkins-0318030552-426845.1489806352.427039/dataflow_python_sdk.tar
--------------------- >> end captured logging << ---------------------

======================================================================
ERROR: test_undeclared_side_outputs (apache_beam.transforms.ptransform_test.PTransformTest)
----------------------------------------------------------------------
Traceback (most recent call last):
  File "<https://builds.apache.org/job/beam_PostCommit_Python_Verify/ws/sdks/python/apache_beam/transforms/ptransform_test.py",>
line 220, in test_undeclared_side_outputs
    pipeline.run()
  File "<https://builds.apache.org/job/beam_PostCommit_Python_Verify/ws/sdks/python/apache_beam/test_pipeline.py",>
line 91, in run
    result = super(TestPipeline, self).run()
  File "<https://builds.apache.org/job/beam_PostCommit_Python_Verify/ws/sdks/python/apache_beam/pipeline.py",>
line 163, in run
    return self.runner.run(self)
  File "<https://builds.apache.org/job/beam_PostCommit_Python_Verify/ws/sdks/python/apache_beam/runners/dataflow/test_dataflow_runner.py",>
line 32, in run
    self.result = super(TestDataflowRunner, self).run(pipeline)
  File "<https://builds.apache.org/job/beam_PostCommit_Python_Verify/ws/sdks/python/apache_beam/runners/dataflow/dataflow_runner.py",>
line 175, in run
    self.dataflow_client.create_job(self.job), self)
  File "<https://builds.apache.org/job/beam_PostCommit_Python_Verify/ws/sdks/python/apache_beam/utils/retry.py",>
line 174, in wrapper
    return fun(*args, **kwargs)
  File "<https://builds.apache.org/job/beam_PostCommit_Python_Verify/ws/sdks/python/apache_beam/runners/dataflow/internal/apiclient.py",>
line 411, in create_job
    self.create_job_description(job)
  File "<https://builds.apache.org/job/beam_PostCommit_Python_Verify/ws/sdks/python/apache_beam/runners/dataflow/internal/apiclient.py",>
line 432, in create_job_description
    job.options, file_copy=self._gcs_file_copy)
  File "<https://builds.apache.org/job/beam_PostCommit_Python_Verify/ws/sdks/python/apache_beam/runners/dataflow/internal/dependency.py",>
line 395, in stage_job_resources
    shutil.rmtree(temp_dir)
  File "/usr/lib/python2.7/shutil.py", line 239, in rmtree
    onerror(os.listdir, path, sys.exc_info())
  File "/usr/lib/python2.7/shutil.py", line 237, in rmtree
    names = os.listdir(path)
OSError: [Errno 2] No such file or directory: '/tmp/tmpWDcCfy'
-------------------- >> begin captured logging << --------------------
root: DEBUG: PValue computed by Some Numbers (tag 1): refcount: 1 => 0
root: DEBUG: PValue computed by ClassifyNumbers/FlatMap(<lambda at ptransform_test.py:214>)
(tag 1): refcount: 1 => 0
root: DEBUG: PValue computed by assert_that/WindowInto(WindowIntoFn) (tag 1): refcount: 1
=> 0
root: DEBUG: PValue computed by assert_that/ToVoidKey (tag 1): refcount: 1 => 0
root: DEBUG: PValue computed by assert_that/Group (tag 1): refcount: 1 => 0
root: DEBUG: PValue computed by assert_that/UnKey (tag 1): refcount: 1 => 0
root: DEBUG: PValue computed by ClassifyNumbers/FlatMap(<lambda at ptransform_test.py:214>)
(tag 1): refcount: 1 => 0
root: DEBUG: PValue computed by assert:odd/WindowInto(WindowIntoFn) (tag 1): refcount: 1 =>
0
root: DEBUG: PValue computed by assert:odd/ToVoidKey (tag 1): refcount: 1 => 0
root: DEBUG: PValue computed by assert:odd/Group (tag 1): refcount: 1 => 0
root: DEBUG: PValue computed by assert:odd/UnKey (tag 1): refcount: 1 => 0
root: DEBUG: PValue computed by ClassifyNumbers/FlatMap(<lambda at ptransform_test.py:214>)
(tag 1): refcount: 1 => 0
root: DEBUG: PValue computed by assert:even/WindowInto(WindowIntoFn) (tag 1): refcount: 1
=> 0
root: DEBUG: PValue computed by assert:even/ToVoidKey (tag 1): refcount: 1 => 0
root: DEBUG: PValue computed by assert:even/Group (tag 1): refcount: 1 => 0
root: DEBUG: PValue computed by assert:even/UnKey (tag 1): refcount: 1 => 0
root: INFO: Starting GCS upload to gs://temp-storage-for-end-to-end-tests/staging-validatesrunner-test/beamapp-jenkins-0318030552-467943.1489806352.468127/requirements.txt...
root: INFO: Completed GCS upload to gs://temp-storage-for-end-to-end-tests/staging-validatesrunner-test/beamapp-jenkins-0318030552-467943.1489806352.468127/requirements.txt
root: INFO: Executing command: ['<https://builds.apache.org/job/beam_PostCommit_Python_Verify/ws/sdks/python/bin/python',>
'-m', 'pip', 'install', '--download', '/tmp/dataflow-requirements-cache', '-r', 'postcommit_requirements.txt',
'--no-binary', ':all:']
root: INFO: Starting GCS upload to gs://temp-storage-for-end-to-end-tests/staging-validatesrunner-test/beamapp-jenkins-0318030552-467943.1489806352.468127/def.txt...
root: INFO: Completed GCS upload to gs://temp-storage-for-end-to-end-tests/staging-validatesrunner-test/beamapp-jenkins-0318030552-467943.1489806352.468127/def.txt
root: INFO: Starting GCS upload to gs://temp-storage-for-end-to-end-tests/staging-validatesrunner-test/beamapp-jenkins-0318030552-467943.1489806352.468127/setuptools-34.3.0.zip...
root: INFO: Completed GCS upload to gs://temp-storage-for-end-to-end-tests/staging-validatesrunner-test/beamapp-jenkins-0318030552-467943.1489806352.468127/setuptools-34.3.0.zip
root: INFO: Starting GCS upload to gs://temp-storage-for-end-to-end-tests/staging-validatesrunner-test/beamapp-jenkins-0318030552-467943.1489806352.468127/appdirs-1.4.0.tar.gz...
root: INFO: Completed GCS upload to gs://temp-storage-for-end-to-end-tests/staging-validatesrunner-test/beamapp-jenkins-0318030552-467943.1489806352.468127/appdirs-1.4.0.tar.gz
root: INFO: Starting GCS upload to gs://temp-storage-for-end-to-end-tests/staging-validatesrunner-test/beamapp-jenkins-0318030552-467943.1489806352.468127/abc.txt...
root: INFO: Completed GCS upload to gs://temp-storage-for-end-to-end-tests/staging-validatesrunner-test/beamapp-jenkins-0318030552-467943.1489806352.468127/abc.txt
root: INFO: Starting GCS upload to gs://temp-storage-for-end-to-end-tests/staging-validatesrunner-test/beamapp-jenkins-0318030552-467943.1489806352.468127/appdirs-1.4.1.tar.gz...
root: INFO: Completed GCS upload to gs://temp-storage-for-end-to-end-tests/staging-validatesrunner-test/beamapp-jenkins-0318030552-467943.1489806352.468127/appdirs-1.4.1.tar.gz
root: INFO: Starting GCS upload to gs://temp-storage-for-end-to-end-tests/staging-validatesrunner-test/beamapp-jenkins-0318030552-467943.1489806352.468127/setuptools-34.0.3.zip...
root: INFO: Completed GCS upload to gs://temp-storage-for-end-to-end-tests/staging-validatesrunner-test/beamapp-jenkins-0318030552-467943.1489806352.468127/setuptools-34.0.3.zip
root: INFO: Starting GCS upload to gs://temp-storage-for-end-to-end-tests/staging-validatesrunner-test/beamapp-jenkins-0318030552-467943.1489806352.468127/appdirs-1.4.2.tar.gz...
root: INFO: Completed GCS upload to gs://temp-storage-for-end-to-end-tests/staging-validatesrunner-test/beamapp-jenkins-0318030552-467943.1489806352.468127/appdirs-1.4.2.tar.gz
root: INFO: Starting GCS upload to gs://temp-storage-for-end-to-end-tests/staging-validatesrunner-test/beamapp-jenkins-0318030552-467943.1489806352.468127/appdirs-1.4.3.tar.gz...
root: INFO: Completed GCS upload to gs://temp-storage-for-end-to-end-tests/staging-validatesrunner-test/beamapp-jenkins-0318030552-467943.1489806352.468127/appdirs-1.4.3.tar.gz
root: INFO: Starting GCS upload to gs://temp-storage-for-end-to-end-tests/staging-validatesrunner-test/beamapp-jenkins-0318030552-467943.1489806352.468127/six-1.10.0.tar.gz...
root: INFO: Completed GCS upload to gs://temp-storage-for-end-to-end-tests/staging-validatesrunner-test/beamapp-jenkins-0318030552-467943.1489806352.468127/six-1.10.0.tar.gz
root: INFO: Starting GCS upload to gs://temp-storage-for-end-to-end-tests/staging-validatesrunner-test/beamapp-jenkins-0318030552-467943.1489806352.468127/pyparsing-2.2.0.tar.gz...
root: INFO: Completed GCS upload to gs://temp-storage-for-end-to-end-tests/staging-validatesrunner-test/beamapp-jenkins-0318030552-467943.1489806352.468127/pyparsing-2.2.0.tar.gz
root: INFO: Starting GCS upload to gs://temp-storage-for-end-to-end-tests/staging-validatesrunner-test/beamapp-jenkins-0318030552-467943.1489806352.468127/setuptools-34.1.0.zip...
root: INFO: Completed GCS upload to gs://temp-storage-for-end-to-end-tests/staging-validatesrunner-test/beamapp-jenkins-0318030552-467943.1489806352.468127/setuptools-34.1.0.zip
root: INFO: Starting GCS upload to gs://temp-storage-for-end-to-end-tests/staging-validatesrunner-test/beamapp-jenkins-0318030552-467943.1489806352.468127/setuptools-34.2.0.zip...
root: INFO: Completed GCS upload to gs://temp-storage-for-end-to-end-tests/staging-validatesrunner-test/beamapp-jenkins-0318030552-467943.1489806352.468127/setuptools-34.2.0.zip
root: INFO: Starting GCS upload to gs://temp-storage-for-end-to-end-tests/staging-validatesrunner-test/beamapp-jenkins-0318030552-467943.1489806352.468127/pbr-2.0.0.tar.gz...
root: INFO: Completed GCS upload to gs://temp-storage-for-end-to-end-tests/staging-validatesrunner-test/beamapp-jenkins-0318030552-467943.1489806352.468127/pbr-2.0.0.tar.gz
root: INFO: Starting GCS upload to gs://temp-storage-for-end-to-end-tests/staging-validatesrunner-test/beamapp-jenkins-0318030552-467943.1489806352.468127/packaging-16.8.tar.gz...
root: INFO: Completed GCS upload to gs://temp-storage-for-end-to-end-tests/staging-validatesrunner-test/beamapp-jenkins-0318030552-467943.1489806352.468127/packaging-16.8.tar.gz
root: INFO: Starting GCS upload to gs://temp-storage-for-end-to-end-tests/staging-validatesrunner-test/beamapp-jenkins-0318030552-467943.1489806352.468127/mock-2.0.0.tar.gz...
root: INFO: Completed GCS upload to gs://temp-storage-for-end-to-end-tests/staging-validatesrunner-test/beamapp-jenkins-0318030552-467943.1489806352.468127/mock-2.0.0.tar.gz
root: INFO: Starting GCS upload to gs://temp-storage-for-end-to-end-tests/staging-validatesrunner-test/beamapp-jenkins-0318030552-467943.1489806352.468127/funcsigs-1.0.2.tar.gz...
root: DEBUG: Response returned status 503, retrying
root: DEBUG: Retrying request to url https://www.googleapis.com/upload/storage/v1/b/temp-storage-for-end-to-end-tests/o?uploadType=multipart&alt=json&name=staging-validatesrunner-test%2Fbeamapp-jenkins-0318030552-467943.1489806352.468127%2Ffuncsigs-1.0.2.tar.gz
after exception HttpError accessing <https://www.googleapis.com/upload/storage/v1/b/temp-storage-for-end-to-end-tests/o?uploadType=multipart&alt=json&name=staging-validatesrunner-test%2Fbeamapp-jenkins-0318030552-467943.1489806352.468127%2Ffuncsigs-1.0.2.tar.gz>:
response: <{'status': '503', 'content-length': '177', 'vary': 'Origin, X-Origin', 'server':
'UploadServer', 'x-guploader-uploadid': 'AEnB2UoBzS0a95wV2y8eMMkNjOFjHjADGPrS2r9mMJsQ3ZYKZQSawjZ1XGVYp5BZcHll_jj1dlLNTyD7g204mgJGyapDmw5G_g',
'date': 'Sat, 18 Mar 2017 03:06:17 GMT', 'content-type': 'application/json; charset=UTF-8'}>,
content <{
 "error": {
  "errors": [
   {
    "domain": "global",
    "reason": "backendError",
    "message": "Backend Error"
   }
  ],
  "code": 503,
  "message": "Backend Error"
 }
}
>
root: INFO: Completed GCS upload to gs://temp-storage-for-end-to-end-tests/staging-validatesrunner-test/beamapp-jenkins-0318030552-467943.1489806352.468127/funcsigs-1.0.2.tar.gz
root: INFO: Starting GCS upload to gs://temp-storage-for-end-to-end-tests/staging-validatesrunner-test/beamapp-jenkins-0318030552-467943.1489806352.468127/PyHamcrest-1.9.0.tar.gz...
root: INFO: Completed GCS upload to gs://temp-storage-for-end-to-end-tests/staging-validatesrunner-test/beamapp-jenkins-0318030552-467943.1489806352.468127/PyHamcrest-1.9.0.tar.gz
root: INFO: Starting GCS upload to gs://temp-storage-for-end-to-end-tests/staging-validatesrunner-test/beamapp-jenkins-0318030552-467943.1489806352.468127/pbr-1.10.0.tar.gz...
root: INFO: Completed GCS upload to gs://temp-storage-for-end-to-end-tests/staging-validatesrunner-test/beamapp-jenkins-0318030552-467943.1489806352.468127/pbr-1.10.0.tar.gz
root: INFO: Starting GCS upload to gs://temp-storage-for-end-to-end-tests/staging-validatesrunner-test/beamapp-jenkins-0318030552-467943.1489806352.468127/setuptools-34.3.1.zip...
root: INFO: Completed GCS upload to gs://temp-storage-for-end-to-end-tests/staging-validatesrunner-test/beamapp-jenkins-0318030552-467943.1489806352.468127/setuptools-34.3.1.zip
root: INFO: Starting GCS upload to gs://temp-storage-for-end-to-end-tests/staging-validatesrunner-test/beamapp-jenkins-0318030552-467943.1489806352.468127/setuptools-34.3.2.zip...
root: INFO: Completed GCS upload to gs://temp-storage-for-end-to-end-tests/staging-validatesrunner-test/beamapp-jenkins-0318030552-467943.1489806352.468127/setuptools-34.3.2.zip
root: INFO: Starting GCS upload to gs://temp-storage-for-end-to-end-tests/staging-validatesrunner-test/beamapp-jenkins-0318030552-467943.1489806352.468127/setuptools-34.1.1.zip...
root: INFO: Completed GCS upload to gs://temp-storage-for-end-to-end-tests/staging-validatesrunner-test/beamapp-jenkins-0318030552-467943.1489806352.468127/setuptools-34.1.1.zip
root: INFO: Starting GCS upload to gs://temp-storage-for-end-to-end-tests/staging-validatesrunner-test/beamapp-jenkins-0318030552-467943.1489806352.468127/pyparsing-2.1.10.zip...
root: INFO: Completed GCS upload to gs://temp-storage-for-end-to-end-tests/staging-validatesrunner-test/beamapp-jenkins-0318030552-467943.1489806352.468127/pyparsing-2.1.10.zip
root: INFO: Starting GCS upload to gs://temp-storage-for-end-to-end-tests/staging-validatesrunner-test/beamapp-jenkins-0318030552-467943.1489806352.468127/setuptools-34.0.2.zip...
root: INFO: Completed GCS upload to gs://temp-storage-for-end-to-end-tests/staging-validatesrunner-test/beamapp-jenkins-0318030552-467943.1489806352.468127/setuptools-34.0.2.zip
root: INFO: Copying Beam SDK "dist/apache-beam-0.7.0.dev0.tar.gz" to staging location.
root: INFO: Starting GCS upload to gs://temp-storage-for-end-to-end-tests/staging-validatesrunner-test/beamapp-jenkins-0318030552-467943.1489806352.468127/dataflow_python_sdk.tar...
root: INFO: Completed GCS upload to gs://temp-storage-for-end-to-end-tests/staging-validatesrunner-test/beamapp-jenkins-0318030552-467943.1489806352.468127/dataflow_python_sdk.tar
--------------------- >> end captured logging << ---------------------

----------------------------------------------------------------------
Ran 14 tests in 887.156s

FAILED (errors=4)
Build step 'Execute shell' marked build as failure

Mime
View raw message