beam-commits mailing list archives

Site index · List index
Message view « Date » · « Thread »
Top « Date » · « Thread »
From Apache Jenkins Server <jenk...@builds.apache.org>
Subject Build failed in Jenkins: beam_PostCommit_Java_Version_Test » OpenJDK 8 (on Ubuntu only),linux #2
Date Thu, 09 Mar 2017 02:16:34 GMT
See <https://builds.apache.org/job/beam_PostCommit_Java_Version_Test/jdk=OpenJDK%208%20(on%20Ubuntu%20only),label=linux/2/display/redirect>

------------------------------------------
Started by upstream project "beam_PostCommit_Java_Version_Test" build number 2
originally caused by:
 GitHub pull request #2204 of commit cd9ca662d596d87a09b4ca16cb97a457095fefb7, no merge conflicts.
[EnvInject] - Loading node environment variables.
Building remotely on H11 (Hadoop) in workspace <https://builds.apache.org/job/beam_PostCommit_Java_Version_Test/jdk=OpenJDK%208%20(on%20Ubuntu%20only),label=linux/ws/>
Cloning the remote Git repository
Cloning repository https://github.com/apache/beam.git
 > git init <https://builds.apache.org/job/beam_PostCommit_Java_Version_Test/jdk=OpenJDK%208%20(on%20Ubuntu%20only),label=linux/ws/>
# timeout=10
Fetching upstream changes from https://github.com/apache/beam.git
 > git --version # timeout=10
 > git fetch --tags --progress https://github.com/apache/beam.git +refs/heads/*:refs/remotes/origin/*
 > git config remote.origin.url https://github.com/apache/beam.git # timeout=10
 > git config --add remote.origin.fetch +refs/heads/*:refs/remotes/origin/* # timeout=10
 > git config remote.origin.url https://github.com/apache/beam.git # timeout=10
Fetching upstream changes from https://github.com/apache/beam.git
 > git fetch --tags --progress https://github.com/apache/beam.git +refs/heads/*:refs/remotes/origin/*
+refs/pull/*:refs/remotes/origin/pr/*
Checking out Revision 110b9592a6e081a6d9375a627b5b601a6aedf4ef (refs/remotes/origin/pr/2204/merge)
 > git config core.sparsecheckout # timeout=10
 > git checkout -f 110b9592a6e081a6d9375a627b5b601a6aedf4ef
 > git rev-list e88fe3a0e630bc60aef755a2519cfdf4e4dba7b2 # timeout=10
First time build. Skipping changelog.
Cleaning workspace
 > git rev-parse --verify HEAD # timeout=10
Resetting working tree
 > git reset --hard # timeout=10
 > git clean -fdx # timeout=10
[EnvInject] - Executing scripts and injecting environment variables after the SCM step.
[EnvInject] - Injecting as environment variables the properties content 
SPARK_LOCAL_IP=127.0.0.1

[EnvInject] - Variables injected successfully.
[linux] $ /home/jenkins/tools/maven/apache-maven-3.3.3/bin/mvn -f pom.xml -DghprbTriggerAuthorLogin=markflyhigh
-DghprbGhRepository=apache/beam -DghprbAuthorRepoGitUrl=https://github.com/markflyhigh/incubator-beam.git
"-DghprbTriggerAuthor=Mark Liu" -DghprbPullLink=https://github.com/apache/beam/pull/2204 -DghprbActualCommit=cd9ca662d596d87a09b4ca16cb97a457095fefb7
-DghprbPullAuthorLogin=markflyhigh -DghprbSourceBranch=jenkins_java_sdk_version_test -DghprbTriggerAuthorLoginMention=@markflyhigh
"-DghprbPullLongDescription=Be sure to do all of the following to help us incorporate your
contribution\r\nquickly and easily:\r\n\r\n - [x] Make sure the PR title is formatted like:\r\n
  `[BEAM-<Jira issue #>] Description of pull request`\r\n - [ ] Make sure tests pass
via `mvn clean verify`. (Even better, enable\r\n       Travis-CI on your fork and ensure the
whole test matrix passes).\r\n - [ ] Replace `<Jira issue #>` in the title with the
actual Jira issue\r\n       number, if there is one.\r\n - [ ] If this contribution is large,
please file an Apache\r\n       [Individual Contributor License Agreement](https://www.apache.org/licenses/icla.txt).\r\n\r\n---\r\n\r\nJava
JDK version tests in Jenkins." -DghprbTriggerAuthorEmail= "-DghprbPullTitle=This PR is only
for test purpose - Do not merge!" -DghprbActualCommitAuthorEmail=markliu@google.com -DghprbTargetBranch=master
-DghprbPullId=2204 -DghprbCredentialsId=56783412-83e6-4ab7-965c-3f8c3b9dd8f1 -DghprbPullAuthorEmail=
-Dlabel=linux -Dsha1=origin/pr/2204/merge "-Djdk=OpenJDK 8 (on Ubuntu only)" -DghprbPullAuthorLoginMention=@markflyhigh
"-DghprbPullDescription=GitHub pull request #2204 of commit cd9ca662d596d87a09b4ca16cb97a457095fefb7,
no merge conflicts." "-DghprbActualCommitAuthor=Mark Liu" -DGIT_BRANCH=jenkins_java_sdk_version_test
"-DghprbCommentBody=Run Java Versions Test" "-Dmaven.repo.local=<https://builds.apache.org/job/beam_PostCommit_Java_Version_Test/jdk=OpenJDK%208%20(on%20Ubuntu%20only),label=linux/ws/.repository">
-B -e -P release clean install -pl !sdks/python coveralls:report -DrepoToken=**** -B -e -P
release clean verify coveralls:report -pl examples/java -DrepoToken=**** -DskipITs=false -Dit.test=WordCountIT
'-DintegrationTestPipelineOptions=[ "--project=apache-beam-testing", "--tempRoot=gs://temp-storage-for-end-to-end-tests",
"--runner=org.apache.beam.runners.dataflow.testing.TestDataflowRunner"]'
/home/jenkins/tools/maven/apache-maven-3.3.3/bin/mvn: 200: local: 8: bad variable name
2017-03-09\T\02:16:29.198 [INFO] Error stacktraces are turned on.
2017-03-09\T\02:16:29.249 [INFO] Scanning for projects...
2017-03-09\T\02:16:29.576 [INFO] Downloading: https://repo.maven.apache.org/maven2/org/apache/apache/18/apache-18.pom
2017-03-09\T\02:16:29.884 [INFO] Downloaded: https://repo.maven.apache.org/maven2/org/apache/apache/18/apache-18.pom
(16 KB at 49.0 KB/sec)
2017-03-09\T\02:16:30.412 [INFO] Downloading: https://repo.maven.apache.org/maven2/kr/motd/maven/os-maven-plugin/1.4.0.Final/os-maven-plugin-1.4.0.Final.pom
2017-03-09\T\02:16:30.431 [INFO] Downloaded: https://repo.maven.apache.org/maven2/kr/motd/maven/os-maven-plugin/1.4.0.Final/os-maven-plugin-1.4.0.Final.pom
(7 KB at 318.2 KB/sec)
2017-03-09\T\02:16:30.437 [INFO] Downloading: https://repo.maven.apache.org/maven2/org/sonatype/oss/oss-parent/9/oss-parent-9.pom
2017-03-09\T\02:16:30.456 [INFO] Downloaded: https://repo.maven.apache.org/maven2/org/sonatype/oss/oss-parent/9/oss-parent-9.pom
(7 KB at 356.4 KB/sec)
2017-03-09\T\02:16:30.467 [INFO] Downloading: https://repo.maven.apache.org/maven2/org/apache/maven/maven-plugin-api/3.2.1/maven-plugin-api-3.2.1.pom
2017-03-09\T\02:16:30.485 [INFO] Downloaded: https://repo.maven.apache.org/maven2/org/apache/maven/maven-plugin-api/3.2.1/maven-plugin-api-3.2.1.pom
(4 KB at 183.5 KB/sec)
2017-03-09\T\02:16:30.488 [INFO] Downloading: https://repo.maven.apache.org/maven2/org/apache/maven/maven/3.2.1/maven-3.2.1.pom
2017-03-09\T\02:16:30.510 [INFO] Downloaded: https://repo.maven.apache.org/maven2/org/apache/maven/maven/3.2.1/maven-3.2.1.pom
(23 KB at 1002.7 KB/sec)
2017-03-09\T\02:16:30.515 [INFO] Downloading: https://repo.maven.apache.org/maven2/org/apache/maven/maven-parent/23/maven-parent-23.pom
2017-03-09\T\02:16:30.539 [INFO] Downloaded: https://repo.maven.apache.org/maven2/org/apache/maven/maven-parent/23/maven-parent-23.pom
(32 KB at 1325.9 KB/sec)
2017-03-09\T\02:16:30.545 [INFO] Downloading: https://repo.maven.apache.org/maven2/org/apache/apache/13/apache-13.pom
2017-03-09\T\02:16:30.565 [INFO] Downloaded: https://repo.maven.apache.org/maven2/org/apache/apache/13/apache-13.pom
(14 KB at 682.3 KB/sec)
2017-03-09\T\02:16:30.575 [INFO] Downloading: https://repo.maven.apache.org/maven2/org/apache/maven/maven-model/3.2.1/maven-model-3.2.1.pom
2017-03-09\T\02:16:30.594 [INFO] Downloaded: https://repo.maven.apache.org/maven2/org/apache/maven/maven-model/3.2.1/maven-model-3.2.1.pom
(5 KB at 224.7 KB/sec)
2017-03-09\T\02:16:30.600 [INFO] Downloading: https://repo.maven.apache.org/maven2/org/codehaus/plexus/plexus-utils/3.0.17/plexus-utils-3.0.17.pom
2017-03-09\T\02:16:30.618 [INFO] Downloaded: https://repo.maven.apache.org/maven2/org/codehaus/plexus/plexus-utils/3.0.17/plexus-utils-3.0.17.pom
(4 KB at 184.2 KB/sec)
2017-03-09\T\02:16:30.622 [INFO] Downloading: https://repo.maven.apache.org/maven2/org/codehaus/plexus/plexus/3.3.1/plexus-3.3.1.pom
2017-03-09\T\02:16:30.643 [INFO] Downloaded: https://repo.maven.apache.org/maven2/org/codehaus/plexus/plexus/3.3.1/plexus-3.3.1.pom
(20 KB at 950.8 KB/sec)
2017-03-09\T\02:16:30.648 [INFO] Downloading: https://repo.maven.apache.org/maven2/org/sonatype/spice/spice-parent/17/spice-parent-17.pom
2017-03-09\T\02:16:30.666 [INFO] Downloaded: https://repo.maven.apache.org/maven2/org/sonatype/spice/spice-parent/17/spice-parent-17.pom
(7 KB at 366.7 KB/sec)
2017-03-09\T\02:16:30.669 [INFO] Downloading: https://repo.maven.apache.org/maven2/org/sonatype/forge/forge-parent/10/forge-parent-10.pom
2017-03-09\T\02:16:30.691 [INFO] Downloaded: https://repo.maven.apache.org/maven2/org/sonatype/forge/forge-parent/10/forge-parent-10.pom
(14 KB at 601.9 KB/sec)
2017-03-09\T\02:16:30.698 [INFO] Downloading: https://repo.maven.apache.org/maven2/org/apache/maven/maven-artifact/3.2.1/maven-artifact-3.2.1.pom
2017-03-09\T\02:16:30.715 [INFO] Downloaded: https://repo.maven.apache.org/maven2/org/apache/maven/maven-artifact/3.2.1/maven-artifact-3.2.1.pom
(2 KB at 113.2 KB/sec)
2017-03-09\T\02:16:30.724 [INFO] Downloading: https://repo.maven.apache.org/maven2/org/eclipse/sisu/org.eclipse.sisu.plexus/0.0.0.M5/org.eclipse.sisu.plexus-0.0.0.M5.pom
2017-03-09\T\02:16:30.742 [INFO] Downloaded: https://repo.maven.apache.org/maven2/org/eclipse/sisu/org.eclipse.sisu.plexus/0.0.0.M5/org.eclipse.sisu.plexus-0.0.0.M5.pom
(5 KB at 262.0 KB/sec)
2017-03-09\T\02:16:30.745 [INFO] Downloading: https://repo.maven.apache.org/maven2/org/eclipse/sisu/sisu-plexus/0.0.0.M5/sisu-plexus-0.0.0.M5.pom
2017-03-09\T\02:16:30.765 [INFO] Downloaded: https://repo.maven.apache.org/maven2/org/eclipse/sisu/sisu-plexus/0.0.0.M5/sisu-plexus-0.0.0.M5.pom
(13 KB at 644.7 KB/sec)
2017-03-09\T\02:16:30.769 [INFO] Downloading: https://repo.maven.apache.org/maven2/org/sonatype/oss/oss-parent/7/oss-parent-7.pom
2017-03-09\T\02:16:30.786 [INFO] Downloaded: https://repo.maven.apache.org/maven2/org/sonatype/oss/oss-parent/7/oss-parent-7.pom
(5 KB at 277.1 KB/sec)
2017-03-09\T\02:16:30.791 [INFO] Downloading: https://repo.maven.apache.org/maven2/javax/enterprise/cdi-api/1.0/cdi-api-1.0.pom
2017-03-09\T\02:16:30.808 [INFO] Downloaded: https://repo.maven.apache.org/maven2/javax/enterprise/cdi-api/1.0/cdi-api-1.0.pom
(2 KB at 82.4 KB/sec)
2017-03-09\T\02:16:30.810 [INFO] Downloading: https://repo.maven.apache.org/maven2/org/jboss/weld/weld-api-parent/1.0/weld-api-parent-1.0.pom
2017-03-09\T\02:16:30.826 [INFO] Downloaded: https://repo.maven.apache.org/maven2/org/jboss/weld/weld-api-parent/1.0/weld-api-parent-1.0.pom
(3 KB at 143.7 KB/sec)
2017-03-09\T\02:16:30.829 [INFO] Downloading: https://repo.maven.apache.org/maven2/org/jboss/weld/weld-api-bom/1.0/weld-api-bom-1.0.pom
2017-03-09\T\02:16:30.848 [INFO] Downloaded: https://repo.maven.apache.org/maven2/org/jboss/weld/weld-api-bom/1.0/weld-api-bom-1.0.pom
(8 KB at 406.4 KB/sec)
2017-03-09\T\02:16:30.851 [INFO] Downloading: https://repo.maven.apache.org/maven2/org/jboss/weld/weld-parent/6/weld-parent-6.pom
2017-03-09\T\02:16:30.870 [INFO] Downloaded: https://repo.maven.apache.org/maven2/org/jboss/weld/weld-parent/6/weld-parent-6.pom
(21 KB at 1063.5 KB/sec)
2017-03-09\T\02:16:30.879 [INFO] Downloading: https://repo.maven.apache.org/maven2/javax/annotation/jsr250-api/1.0/jsr250-api-1.0.pom
2017-03-09\T\02:16:30.895 [INFO] Downloaded: https://repo.maven.apache.org/maven2/javax/annotation/jsr250-api/1.0/jsr250-api-1.0.pom
(1023 B at 62.4 KB/sec)
2017-03-09\T\02:16:30.898 [INFO] Downloading: https://repo.maven.apache.org/maven2/javax/inject/javax.inject/1/javax.inject-1.pom
2017-03-09\T\02:16:30.913 [INFO] Downloaded: https://repo.maven.apache.org/maven2/javax/inject/javax.inject/1/javax.inject-1.pom
(612 B at 39.8 KB/sec)
2017-03-09\T\02:16:30.916 [INFO] Downloading: https://repo.maven.apache.org/maven2/com/google/guava/guava/10.0.1/guava-10.0.1.pom
2017-03-09\T\02:16:30.934 [INFO] Downloaded: https://repo.maven.apache.org/maven2/com/google/guava/guava/10.0.1/guava-10.0.1.pom
(6 KB at 309.3 KB/sec)
2017-03-09\T\02:16:30.936 [INFO] Downloading: https://repo.maven.apache.org/maven2/com/google/guava/guava-parent/10.0.1/guava-parent-10.0.1.pom
2017-03-09\T\02:16:30.951 [INFO] Downloaded: https://repo.maven.apache.org/maven2/com/google/guava/guava-parent/10.0.1/guava-parent-10.0.1.pom
(2 KB at 127.5 KB/sec)
2017-03-09\T\02:16:30.955 [INFO] Downloading: https://repo.maven.apache.org/maven2/com/google/code/findbugs/jsr305/1.3.9/jsr305-1.3.9.pom
2017-03-09\T\02:16:30.971 [INFO] Downloaded: https://repo.maven.apache.org/maven2/com/google/code/findbugs/jsr305/1.3.9/jsr305-1.3.9.pom
(965 B at 58.9 KB/sec)
2017-03-09\T\02:16:30.974 [INFO] Downloading: https://repo.maven.apache.org/maven2/org/sonatype/sisu/sisu-guice/3.1.0/sisu-guice-3.1.0.pom
2017-03-09\T\02:16:30.991 [INFO] Downloaded: https://repo.maven.apache.org/maven2/org/sonatype/sisu/sisu-guice/3.1.0/sisu-guice-3.1.0.pom
(10 KB at 583.0 KB/sec)
2017-03-09\T\02:16:30.994 [INFO] Downloading: https://repo.maven.apache.org/maven2/org/sonatype/sisu/inject/guice-parent/3.1.0/guice-parent-3.1.0.pom
2017-03-09\T\02:16:31.013 [INFO] Downloaded: https://repo.maven.apache.org/maven2/org/sonatype/sisu/inject/guice-parent/3.1.0/guice-parent-3.1.0.pom
(11 KB at 561.6 KB/sec)
2017-03-09\T\02:16:31.020 [INFO] Downloading: https://repo.maven.apache.org/maven2/aopalliance/aopalliance/1.0/aopalliance-1.0.pom
2017-03-09\T\02:16:31.037 [INFO] Downloaded: https://repo.maven.apache.org/maven2/aopalliance/aopalliance/1.0/aopalliance-1.0.pom
(363 B at 20.9 KB/sec)
2017-03-09\T\02:16:31.040 [INFO] Downloading: https://repo.maven.apache.org/maven2/org/eclipse/sisu/org.eclipse.sisu.inject/0.0.0.M5/org.eclipse.sisu.inject-0.0.0.M5.pom
2017-03-09\T\02:16:31.056 [INFO] Downloaded: https://repo.maven.apache.org/maven2/org/eclipse/sisu/org.eclipse.sisu.inject/0.0.0.M5/org.eclipse.sisu.inject-0.0.0.M5.pom
(3 KB at 153.8 KB/sec)
2017-03-09\T\02:16:31.058 [INFO] Downloading: https://repo.maven.apache.org/maven2/org/eclipse/sisu/sisu-inject/0.0.0.M5/sisu-inject-0.0.0.M5.pom
2017-03-09\T\02:16:31.076 [INFO] Downloaded: https://repo.maven.apache.org/maven2/org/eclipse/sisu/sisu-inject/0.0.0.M5/sisu-inject-0.0.0.M5.pom
(14 KB at 759.3 KB/sec)
2017-03-09\T\02:16:31.081 [INFO] Downloading: https://repo.maven.apache.org/maven2/org/codehaus/plexus/plexus-component-annotations/1.5.5/plexus-component-annotations-1.5.5.pom
2017-03-09\T\02:16:31.095 [INFO] Downloaded: https://repo.maven.apache.org/maven2/org/codehaus/plexus/plexus-component-annotations/1.5.5/plexus-component-annotations-1.5.5.pom
(815 B at 56.8 KB/sec)
2017-03-09\T\02:16:31.096 [INFO] Downloading: https://repo.maven.apache.org/maven2/org/codehaus/plexus/plexus-containers/1.5.5/plexus-containers-1.5.5.pom
2017-03-09\T\02:16:31.111 [INFO] Downloaded: https://repo.maven.apache.org/maven2/org/codehaus/plexus/plexus-containers/1.5.5/plexus-containers-1.5.5.pom
(5 KB at 276.0 KB/sec)
2017-03-09\T\02:16:31.113 [INFO] Downloading: https://repo.maven.apache.org/maven2/org/codehaus/plexus/plexus/2.0.7/plexus-2.0.7.pom
2017-03-09\T\02:16:31.129 [INFO] Downloaded: https://repo.maven.apache.org/maven2/org/codehaus/plexus/plexus/2.0.7/plexus-2.0.7.pom
(17 KB at 993.5 KB/sec)
2017-03-09\T\02:16:31.135 [INFO] Downloading: https://repo.maven.apache.org/maven2/org/codehaus/plexus/plexus-classworlds/2.4/plexus-classworlds-2.4.pom
2017-03-09\T\02:16:31.151 [INFO] Downloaded: https://repo.maven.apache.org/maven2/org/codehaus/plexus/plexus-classworlds/2.4/plexus-classworlds-2.4.pom
(4 KB at 237.0 KB/sec)
2017-03-09\T\02:16:31.155 [INFO] Downloading: https://repo.maven.apache.org/maven2/org/codehaus/plexus/plexus-utils/2.1/plexus-utils-2.1.pom
2017-03-09\T\02:16:31.170 [INFO] Downloaded: https://repo.maven.apache.org/maven2/org/codehaus/plexus/plexus-utils/2.1/plexus-utils-2.1.pom
(4 KB at 262.6 KB/sec)
2017-03-09\T\02:16:31.173 [INFO] Downloading: https://repo.maven.apache.org/maven2/org/sonatype/spice/spice-parent/16/spice-parent-16.pom
2017-03-09\T\02:16:31.190 [INFO] Downloaded: https://repo.maven.apache.org/maven2/org/sonatype/spice/spice-parent/16/spice-parent-16.pom
(9 KB at 480.1 KB/sec)
2017-03-09\T\02:16:31.193 [INFO] Downloading: https://repo.maven.apache.org/maven2/org/sonatype/forge/forge-parent/5/forge-parent-5.pom
2017-03-09\T\02:16:31.210 [INFO] Downloaded: https://repo.maven.apache.org/maven2/org/sonatype/forge/forge-parent/5/forge-parent-5.pom
(9 KB at 480.4 KB/sec)
2017-03-09\T\02:16:31.232 [INFO] Downloading: https://repo.maven.apache.org/maven2/kr/motd/maven/os-maven-plugin/1.4.0.Final/os-maven-plugin-1.4.0.Final.jar
2017-03-09\T\02:16:31.232 [INFO] Downloading: https://repo.maven.apache.org/maven2/org/apache/maven/maven-plugin-api/3.2.1/maven-plugin-api-3.2.1.jar
2017-03-09\T\02:16:31.233 [INFO] Downloading: https://repo.maven.apache.org/maven2/org/apache/maven/maven-artifact/3.2.1/maven-artifact-3.2.1.jar
2017-03-09\T\02:16:31.233 [INFO] Downloading: https://repo.maven.apache.org/maven2/org/apache/maven/maven-model/3.2.1/maven-model-3.2.1.jar
2017-03-09\T\02:16:31.233 [INFO] Downloading: https://repo.maven.apache.org/maven2/org/eclipse/sisu/org.eclipse.sisu.plexus/0.0.0.M5/org.eclipse.sisu.plexus-0.0.0.M5.jar
2017-03-09\T\02:16:31.255 [INFO] Downloaded: https://repo.maven.apache.org/maven2/kr/motd/maven/os-maven-plugin/1.4.0.Final/os-maven-plugin-1.4.0.Final.jar
(29 KB at 1167.8 KB/sec)
2017-03-09\T\02:16:31.256 [INFO] Downloading: https://repo.maven.apache.org/maven2/javax/enterprise/cdi-api/1.0/cdi-api-1.0.jar
2017-03-09\T\02:16:31.278 [INFO] Downloaded: https://repo.maven.apache.org/maven2/javax/enterprise/cdi-api/1.0/cdi-api-1.0.jar
(44 KB at 974.6 KB/sec)
2017-03-09\T\02:16:31.278 [INFO] Downloading: https://repo.maven.apache.org/maven2/javax/annotation/jsr250-api/1.0/jsr250-api-1.0.jar
2017-03-09\T\02:16:31.292 [INFO] Downloaded: https://repo.maven.apache.org/maven2/org/apache/maven/maven-plugin-api/3.2.1/maven-plugin-api-3.2.1.jar
(45 KB at 745.9 KB/sec)
2017-03-09\T\02:16:31.292 [INFO] Downloaded: https://repo.maven.apache.org/maven2/org/apache/maven/maven-artifact/3.2.1/maven-artifact-3.2.1.jar
(53 KB at 873.2 KB/sec)
2017-03-09\T\02:16:31.292 [INFO] Downloading: https://repo.maven.apache.org/maven2/javax/inject/javax.inject/1/javax.inject-1.jar
2017-03-09\T\02:16:31.293 [INFO] Downloading: https://repo.maven.apache.org/maven2/com/google/guava/guava/10.0.1/guava-10.0.1.jar
2017-03-09\T\02:16:31.294 [INFO] Downloaded: https://repo.maven.apache.org/maven2/javax/annotation/jsr250-api/1.0/jsr250-api-1.0.jar
(6 KB at 93.6 KB/sec)
2017-03-09\T\02:16:31.294 [INFO] Downloading: https://repo.maven.apache.org/maven2/com/google/code/findbugs/jsr305/1.3.9/jsr305-1.3.9.jar
2017-03-09\T\02:16:31.305 [INFO] Downloaded: https://repo.maven.apache.org/maven2/org/apache/maven/maven-model/3.2.1/maven-model-3.2.1.jar
(157 KB at 2138.5 KB/sec)
2017-03-09\T\02:16:31.306 [INFO] Downloading: https://repo.maven.apache.org/maven2/org/sonatype/sisu/sisu-guice/3.1.0/sisu-guice-3.1.0-no_aop.jar
2017-03-09\T\02:16:31.308 [INFO] Downloaded: https://repo.maven.apache.org/maven2/javax/inject/javax.inject/1/javax.inject-1.jar
(3 KB at 32.5 KB/sec)
2017-03-09\T\02:16:31.308 [INFO] Downloading: https://repo.maven.apache.org/maven2/aopalliance/aopalliance/1.0/aopalliance-1.0.jar
2017-03-09\T\02:16:31.309 [INFO] Downloaded: https://repo.maven.apache.org/maven2/org/eclipse/sisu/org.eclipse.sisu.plexus/0.0.0.M5/org.eclipse.sisu.plexus-0.0.0.M5.jar
(192 KB at 2525.5 KB/sec)
2017-03-09\T\02:16:31.309 [INFO] Downloading: https://repo.maven.apache.org/maven2/org/eclipse/sisu/org.eclipse.sisu.inject/0.0.0.M5/org.eclipse.sisu.inject-0.0.0.M5.jar
2017-03-09\T\02:16:31.313 [INFO] Downloaded: https://repo.maven.apache.org/maven2/com/google/code/findbugs/jsr305/1.3.9/jsr305-1.3.9.jar
(33 KB at 403.0 KB/sec)
2017-03-09\T\02:16:31.313 [INFO] Downloading: https://repo.maven.apache.org/maven2/org/codehaus/plexus/plexus-component-annotations/1.5.5/plexus-component-annotations-1.5.5.jar
2017-03-09\T\02:16:31.323 [INFO] Downloaded: https://repo.maven.apache.org/maven2/aopalliance/aopalliance/1.0/aopalliance-1.0.jar
(5 KB at 48.5 KB/sec)
2017-03-09\T\02:16:31.323 [INFO] Downloading: https://repo.maven.apache.org/maven2/org/codehaus/plexus/plexus-classworlds/2.4/plexus-classworlds-2.4.jar
2017-03-09\T\02:16:31.327 [INFO] Downloaded: https://repo.maven.apache.org/maven2/org/codehaus/plexus/plexus-component-annotations/1.5.5/plexus-component-annotations-1.5.5.jar
(5 KB at 44.2 KB/sec)
2017-03-09\T\02:16:31.328 [INFO] Downloading: https://repo.maven.apache.org/maven2/org/codehaus/plexus/plexus-utils/3.0.17/plexus-utils-3.0.17.jar
2017-03-09\T\02:16:31.343 [INFO] Downloaded: https://repo.maven.apache.org/maven2/org/codehaus/plexus/plexus-classworlds/2.4/plexus-classworlds-2.4.jar
(46 KB at 421.6 KB/sec)
2017-03-09\T\02:16:31.354 [INFO] Downloaded: https://repo.maven.apache.org/maven2/org/eclipse/sisu/org.eclipse.sisu.inject/0.0.0.M5/org.eclipse.sisu.inject-0.0.0.M5.jar
(285 KB at 2351.8 KB/sec)
2017-03-09\T\02:16:31.365 [INFO] Downloaded: https://repo.maven.apache.org/maven2/org/sonatype/sisu/sisu-guice/3.1.0/sisu-guice-3.1.0-no_aop.jar
(350 KB at 2664.5 KB/sec)
2017-03-09\T\02:16:31.367 [INFO] Downloaded: https://repo.maven.apache.org/maven2/org/codehaus/plexus/plexus-utils/3.0.17/plexus-utils-3.0.17.jar
(246 KB at 1848.8 KB/sec)
2017-03-09\T\02:16:31.432 [INFO] Downloaded: https://repo.maven.apache.org/maven2/com/google/guava/guava/10.0.1/guava-10.0.1.jar
(1467 KB at 7368.8 KB/sec)
2017-03-09\T\02:16:31.590 [INFO] Downloading: https://repo.maven.apache.org/maven2/org/apache/maven/archetype/archetype-packaging/2.4/archetype-packaging-2.4.pom
2017-03-09\T\02:16:31.613 [INFO] Downloaded: https://repo.maven.apache.org/maven2/org/apache/maven/archetype/archetype-packaging/2.4/archetype-packaging-2.4.pom
(2 KB at 66.5 KB/sec)
2017-03-09\T\02:16:31.615 [INFO] Downloading: https://repo.maven.apache.org/maven2/org/apache/maven/archetype/maven-archetype/2.4/maven-archetype-2.4.pom
2017-03-09\T\02:16:31.632 [INFO] Downloaded: https://repo.maven.apache.org/maven2/org/apache/maven/archetype/maven-archetype/2.4/maven-archetype-2.4.pom
(13 KB at 758.3 KB/sec)
2017-03-09\T\02:16:31.635 [INFO] Downloading: https://repo.maven.apache.org/maven2/org/apache/maven/maven-parent/26/maven-parent-26.pom
2017-03-09\T\02:16:31.653 [INFO] Downloaded: https://repo.maven.apache.org/maven2/org/apache/maven/maven-parent/26/maven-parent-26.pom
(39 KB at 2285.4 KB/sec)
2017-03-09\T\02:16:31.656 [INFO] Downloading: https://repo.maven.apache.org/maven2/org/apache/apache/16/apache-16.pom
2017-03-09\T\02:16:31.673 [INFO] Downloaded: https://repo.maven.apache.org/maven2/org/apache/apache/16/apache-16.pom
(16 KB at 939.8 KB/sec)
2017-03-09\T\02:16:31.679 [INFO] Downloading: https://repo.maven.apache.org/maven2/org/apache/maven/archetype/archetype-packaging/2.4/archetype-packaging-2.4.jar
2017-03-09\T\02:16:31.680 [INFO] Downloading: https://repo.maven.apache.org/maven2/org/codehaus/plexus/plexus-utils/1.1/plexus-utils-1.1.jar
2017-03-09\T\02:16:31.696 [INFO] Downloaded: https://repo.maven.apache.org/maven2/org/apache/maven/archetype/archetype-packaging/2.4/archetype-packaging-2.4.jar
(8 KB at 432.8 KB/sec)
2017-03-09\T\02:16:31.713 [INFO] Downloaded: https://repo.maven.apache.org/maven2/org/codehaus/plexus/plexus-utils/1.1/plexus-utils-1.1.jar
(165 KB at 4841.7 KB/sec)
2017-03-09\T\02:16:31.799 [WARNING] 
2017-03-09\T\02:16:31.799 [WARNING] Some problems were encountered while building the effective
model for org.apache.beam:beam-runners-google-cloud-dataflow-java:jar:0.7.0-SNAPSHOT
2017-03-09\T\02:16:31.799 [WARNING] 'dependencies.dependency.(groupId:artifactId:type:classifier)'
must be unique: org.apache.beam:beam-runners-core-construction-java:jar -> duplicate declaration
of version (?) @ org.apache.beam:beam-runners-google-cloud-dataflow-java:[unknown-version],
<https://builds.apache.org/job/beam_PostCommit_Java_Version_Test/jdk=OpenJDK%208%20(on%20Ubuntu%20only),label=linux/ws/runners/google-cloud-dataflow-java/pom.xml,>
line 360, column 19
2017-03-09\T\02:16:31.799 [WARNING] 
2017-03-09\T\02:16:31.799 [WARNING] It is highly recommended to fix these problems because
they threaten the stability of your build.
2017-03-09\T\02:16:31.799 [WARNING] 
2017-03-09\T\02:16:31.799 [WARNING] For this reason, future Maven versions might no longer
support building such malformed projects.
2017-03-09\T\02:16:31.799 [WARNING] 
2017-03-09\T\02:16:31.826 [ERROR] [ERROR] Could not find the selected project in the reactor:
sdks/python @ 
2017-03-09\T\02:16:31.827 [ERROR] Could not find the selected project in the reactor: sdks/python
-> [Help 1]
org.apache.maven.MavenExecutionException: Could not find the selected project in the reactor:
sdks/python
	at org.apache.maven.graph.DefaultGraphBuilder.trimExcludedProjects(DefaultGraphBuilder.java:273)
	at org.apache.maven.graph.DefaultGraphBuilder.dependencyGraph(DefaultGraphBuilder.java:116)
	at org.apache.maven.graph.DefaultGraphBuilder.build(DefaultGraphBuilder.java:92)
	at org.apache.maven.DefaultMaven.buildGraph(DefaultMaven.java:491)
	at org.apache.maven.DefaultMaven.doExecute(DefaultMaven.java:219)
	at org.apache.maven.DefaultMaven.doExecute(DefaultMaven.java:193)
	at org.apache.maven.DefaultMaven.execute(DefaultMaven.java:106)
	at org.apache.maven.cli.MavenCli.execute(MavenCli.java:862)
	at org.apache.maven.cli.MavenCli.doMain(MavenCli.java:286)
	at org.apache.maven.cli.MavenCli.main(MavenCli.java:197)
	at sun.reflect.NativeMethodAccessorImpl.invoke0(Native Method)
	at sun.reflect.NativeMethodAccessorImpl.invoke(NativeMethodAccessorImpl.java:57)
	at sun.reflect.DelegatingMethodAccessorImpl.invoke(DelegatingMethodAccessorImpl.java:43)
	at java.lang.reflect.Method.invoke(Method.java:606)
	at org.codehaus.plexus.classworlds.launcher.Launcher.launchEnhanced(Launcher.java:289)
	at org.codehaus.plexus.classworlds.launcher.Launcher.launch(Launcher.java:229)
	at org.codehaus.plexus.classworlds.launcher.Launcher.mainWithExitCode(Launcher.java:415)
	at org.codehaus.plexus.classworlds.launcher.Launcher.main(Launcher.java:356)
2017-03-09\T\02:16:31.827 [ERROR] 
2017-03-09\T\02:16:31.828 [ERROR] Re-run Maven using the -X switch to enable full debug logging.
2017-03-09\T\02:16:31.828 [ERROR] 
2017-03-09\T\02:16:31.828 [ERROR] For more information about the errors and possible solutions,
please read the following articles:
2017-03-09\T\02:16:31.828 [ERROR] [Help 1] http://cwiki.apache.org/confluence/display/MAVEN/MavenExecutionException
Build step 'Invoke top-level Maven targets' marked build as failure

Mime
View raw message