beam-commits mailing list archives

Site index · List index
Message view « Date » · « Thread »
Top « Date » · « Thread »
From Apache Jenkins Server <jenk...@builds.apache.org>
Subject Build failed in Jenkins: beam_PostCommit_Java_RunnableOnService_Spark #1320
Date Wed, 22 Mar 2017 12:06:14 GMT
See <https://builds.apache.org/job/beam_PostCommit_Java_RunnableOnService_Spark/1320/display/redirect>

------------------------------------------
[...truncated 243.25 KB...]
2017-03-22T12:03:36.402 [INFO] Downloading: https://repo.maven.apache.org/maven2/org/codehaus/plexus/plexus-component-annotations/1.5.5/plexus-component-annotations-1.5.5.pom
2017-03-22T12:03:36.430 [INFO] Downloaded: https://repo.maven.apache.org/maven2/org/codehaus/plexus/plexus-component-annotations/1.5.5/plexus-component-annotations-1.5.5.pom
(815 B at 28.4 KB/sec)
2017-03-22T12:03:36.432 [INFO] Downloading: https://repo.maven.apache.org/maven2/org/codehaus/plexus/plexus-containers/1.5.5/plexus-containers-1.5.5.pom
2017-03-22T12:03:36.460 [INFO] Downloaded: https://repo.maven.apache.org/maven2/org/codehaus/plexus/plexus-containers/1.5.5/plexus-containers-1.5.5.pom
(5 KB at 147.9 KB/sec)
2017-03-22T12:03:36.462 [INFO] Downloading: https://repo.maven.apache.org/maven2/org/codehaus/plexus/plexus/2.0.7/plexus-2.0.7.pom
2017-03-22T12:03:36.495 [INFO] Downloaded: https://repo.maven.apache.org/maven2/org/codehaus/plexus/plexus/2.0.7/plexus-2.0.7.pom
(17 KB at 511.8 KB/sec)
2017-03-22T12:03:36.499 [INFO] Downloading: https://repo.maven.apache.org/maven2/org/codehaus/plexus/plexus-classworlds/2.4/plexus-classworlds-2.4.pom
2017-03-22T12:03:36.527 [INFO] Downloaded: https://repo.maven.apache.org/maven2/org/codehaus/plexus/plexus-classworlds/2.4/plexus-classworlds-2.4.pom
(4 KB at 135.4 KB/sec)
2017-03-22T12:03:36.530 [INFO] Downloading: https://repo.maven.apache.org/maven2/org/codehaus/plexus/plexus-utils/2.1/plexus-utils-2.1.pom
2017-03-22T12:03:36.558 [INFO] Downloaded: https://repo.maven.apache.org/maven2/org/codehaus/plexus/plexus-utils/2.1/plexus-utils-2.1.pom
(4 KB at 140.7 KB/sec)
2017-03-22T12:03:36.561 [INFO] Downloading: https://repo.maven.apache.org/maven2/org/sonatype/spice/spice-parent/16/spice-parent-16.pom
2017-03-22T12:03:36.590 [INFO] Downloaded: https://repo.maven.apache.org/maven2/org/sonatype/spice/spice-parent/16/spice-parent-16.pom
(9 KB at 272.1 KB/sec)
2017-03-22T12:03:36.592 [INFO] Downloading: https://repo.maven.apache.org/maven2/org/sonatype/forge/forge-parent/5/forge-parent-5.pom
2017-03-22T12:03:36.624 [INFO] Downloaded: https://repo.maven.apache.org/maven2/org/sonatype/forge/forge-parent/5/forge-parent-5.pom
(9 KB at 255.2 KB/sec)
2017-03-22T12:03:36.642 [INFO] Downloading: https://repo.maven.apache.org/maven2/kr/motd/maven/os-maven-plugin/1.4.0.Final/os-maven-plugin-1.4.0.Final.jar
2017-03-22T12:03:36.643 [INFO] Downloading: https://repo.maven.apache.org/maven2/org/apache/maven/maven-plugin-api/3.2.1/maven-plugin-api-3.2.1.jar
2017-03-22T12:03:36.643 [INFO] Downloading: https://repo.maven.apache.org/maven2/org/apache/maven/maven-model/3.2.1/maven-model-3.2.1.jar
2017-03-22T12:03:36.644 [INFO] Downloading: https://repo.maven.apache.org/maven2/org/apache/maven/maven-artifact/3.2.1/maven-artifact-3.2.1.jar
2017-03-22T12:03:36.646 [INFO] Downloading: https://repo.maven.apache.org/maven2/org/eclipse/sisu/org.eclipse.sisu.plexus/0.0.0.M5/org.eclipse.sisu.plexus-0.0.0.M5.jar
2017-03-22T12:03:36.715 [INFO] Downloaded: https://repo.maven.apache.org/maven2/kr/motd/maven/os-maven-plugin/1.4.0.Final/os-maven-plugin-1.4.0.Final.jar
(29 KB at 383.9 KB/sec)
2017-03-22T12:03:36.715 [INFO] Downloading: https://repo.maven.apache.org/maven2/javax/enterprise/cdi-api/1.0/cdi-api-1.0.jar
2017-03-22T12:03:36.723 [INFO] Downloaded: https://repo.maven.apache.org/maven2/org/apache/maven/maven-plugin-api/3.2.1/maven-plugin-api-3.2.1.jar
(45 KB at 552.6 KB/sec)
2017-03-22T12:03:36.724 [INFO] Downloading: https://repo.maven.apache.org/maven2/javax/annotation/jsr250-api/1.0/jsr250-api-1.0.jar
2017-03-22T12:03:36.725 [INFO] Downloaded: https://repo.maven.apache.org/maven2/org/apache/maven/maven-artifact/3.2.1/maven-artifact-3.2.1.jar
(53 KB at 638.9 KB/sec)
2017-03-22T12:03:36.727 [INFO] Downloading: https://repo.maven.apache.org/maven2/javax/inject/javax.inject/1/javax.inject-1.jar
2017-03-22T12:03:36.732 [INFO] Downloaded: https://repo.maven.apache.org/maven2/org/apache/maven/maven-model/3.2.1/maven-model-3.2.1.jar
(157 KB at 1734.5 KB/sec)
2017-03-22T12:03:36.732 [INFO] Downloading: https://repo.maven.apache.org/maven2/com/google/guava/guava/10.0.1/guava-10.0.1.jar
2017-03-22T12:03:36.753 [INFO] Downloaded: https://repo.maven.apache.org/maven2/javax/annotation/jsr250-api/1.0/jsr250-api-1.0.jar
(6 KB at 52.4 KB/sec)
2017-03-22T12:03:36.753 [INFO] Downloading: https://repo.maven.apache.org/maven2/com/google/code/findbugs/jsr305/1.3.9/jsr305-1.3.9.jar
2017-03-22T12:03:36.756 [INFO] Downloaded: https://repo.maven.apache.org/maven2/javax/enterprise/cdi-api/1.0/cdi-api-1.0.jar
(44 KB at 391.6 KB/sec)
2017-03-22T12:03:36.756 [INFO] Downloading: https://repo.maven.apache.org/maven2/org/sonatype/sisu/sisu-guice/3.1.0/sisu-guice-3.1.0-no_aop.jar
2017-03-22T12:03:36.759 [INFO] Downloaded: https://repo.maven.apache.org/maven2/org/eclipse/sisu/org.eclipse.sisu.plexus/0.0.0.M5/org.eclipse.sisu.plexus-0.0.0.M5.jar
(192 KB at 1654.6 KB/sec)
2017-03-22T12:03:36.759 [INFO] Downloading: https://repo.maven.apache.org/maven2/aopalliance/aopalliance/1.0/aopalliance-1.0.jar
2017-03-22T12:03:36.760 [INFO] Downloaded: https://repo.maven.apache.org/maven2/javax/inject/javax.inject/1/javax.inject-1.jar
(3 KB at 21.2 KB/sec)
2017-03-22T12:03:36.760 [INFO] Downloading: https://repo.maven.apache.org/maven2/org/eclipse/sisu/org.eclipse.sisu.inject/0.0.0.M5/org.eclipse.sisu.inject-0.0.0.M5.jar
2017-03-22T12:03:36.787 [INFO] Downloaded: https://repo.maven.apache.org/maven2/com/google/code/findbugs/jsr305/1.3.9/jsr305-1.3.9.jar
(33 KB at 227.1 KB/sec)
2017-03-22T12:03:36.788 [INFO] Downloading: https://repo.maven.apache.org/maven2/org/codehaus/plexus/plexus-component-annotations/1.5.5/plexus-component-annotations-1.5.5.jar
2017-03-22T12:03:36.790 [INFO] Downloaded: https://repo.maven.apache.org/maven2/aopalliance/aopalliance/1.0/aopalliance-1.0.jar
(5 KB at 30.1 KB/sec)
2017-03-22T12:03:36.790 [INFO] Downloading: https://repo.maven.apache.org/maven2/org/codehaus/plexus/plexus-classworlds/2.4/plexus-classworlds-2.4.jar
2017-03-22T12:03:36.817 [INFO] Downloaded: https://repo.maven.apache.org/maven2/org/codehaus/plexus/plexus-component-annotations/1.5.5/plexus-component-annotations-1.5.5.jar
(5 KB at 23.9 KB/sec)
2017-03-22T12:03:36.817 [INFO] Downloading: https://repo.maven.apache.org/maven2/org/codehaus/plexus/plexus-utils/3.0.17/plexus-utils-3.0.17.jar
2017-03-22T12:03:36.830 [INFO] Downloaded: https://repo.maven.apache.org/maven2/org/codehaus/plexus/plexus-classworlds/2.4/plexus-classworlds-2.4.jar
(46 KB at 248.4 KB/sec)
2017-03-22T12:03:36.844 [INFO] Downloaded: https://repo.maven.apache.org/maven2/org/sonatype/sisu/sisu-guice/3.1.0/sisu-guice-3.1.0-no_aop.jar
(350 KB at 1754.0 KB/sec)
2017-03-22T12:03:36.846 [INFO] Downloaded: https://repo.maven.apache.org/maven2/org/eclipse/sisu/org.eclipse.sisu.inject/0.0.0.M5/org.eclipse.sisu.inject-0.0.0.M5.jar
(285 KB at 1415.8 KB/sec)
2017-03-22T12:03:36.900 [INFO] Downloaded: https://repo.maven.apache.org/maven2/org/codehaus/plexus/plexus-utils/3.0.17/plexus-utils-3.0.17.jar
(246 KB at 964.3 KB/sec)
2017-03-22T12:03:37.004 [INFO] Downloaded: https://repo.maven.apache.org/maven2/com/google/guava/guava/10.0.1/guava-10.0.1.jar
(1467 KB at 4084.6 KB/sec)
2017-03-22T12:03:37.106 [INFO] Downloading: https://repo.maven.apache.org/maven2/org/apache/maven/archetype/archetype-packaging/2.4/archetype-packaging-2.4.pom
2017-03-22T12:03:37.134 [INFO] Downloaded: https://repo.maven.apache.org/maven2/org/apache/maven/archetype/archetype-packaging/2.4/archetype-packaging-2.4.pom
(2 KB at 54.7 KB/sec)
2017-03-22T12:03:37.136 [INFO] Downloading: https://repo.maven.apache.org/maven2/org/apache/maven/archetype/maven-archetype/2.4/maven-archetype-2.4.pom
2017-03-22T12:03:37.165 [INFO] Downloaded: https://repo.maven.apache.org/maven2/org/apache/maven/archetype/maven-archetype/2.4/maven-archetype-2.4.pom
(13 KB at 444.5 KB/sec)
2017-03-22T12:03:37.168 [INFO] Downloading: https://repo.maven.apache.org/maven2/org/apache/maven/maven-parent/26/maven-parent-26.pom
2017-03-22T12:03:37.199 [INFO] Downloaded: https://repo.maven.apache.org/maven2/org/apache/maven/maven-parent/26/maven-parent-26.pom
(39 KB at 1253.3 KB/sec)
2017-03-22T12:03:37.202 [INFO] Downloading: https://repo.maven.apache.org/maven2/org/apache/apache/16/apache-16.pom
2017-03-22T12:03:37.230 [INFO] Downloaded: https://repo.maven.apache.org/maven2/org/apache/apache/16/apache-16.pom
(16 KB at 537.0 KB/sec)
2017-03-22T12:03:37.235 [INFO] Downloading: https://repo.maven.apache.org/maven2/org/apache/maven/archetype/archetype-packaging/2.4/archetype-packaging-2.4.jar
2017-03-22T12:03:37.235 [INFO] Downloading: https://repo.maven.apache.org/maven2/org/codehaus/plexus/plexus-utils/1.1/plexus-utils-1.1.jar
2017-03-22T12:03:37.264 [INFO] Downloaded: https://repo.maven.apache.org/maven2/org/apache/maven/archetype/archetype-packaging/2.4/archetype-packaging-2.4.jar
(8 KB at 253.7 KB/sec)
2017-03-22T12:03:37.302 [INFO] Downloaded: https://repo.maven.apache.org/maven2/org/codehaus/plexus/plexus-utils/1.1/plexus-utils-1.1.jar
(165 KB at 2457.0 KB/sec)
2017-03-22T12:03:37.377 [INFO] ------------------------------------------------------------------------
2017-03-22T12:03:37.377 [INFO] Detecting the operating system and CPU architecture
2017-03-22T12:03:37.377 [INFO] ------------------------------------------------------------------------
2017-03-22T12:03:37.377 [INFO] os.detected.name: linux
2017-03-22T12:03:37.377 [INFO] os.detected.arch: x86_64
2017-03-22T12:03:37.378 [INFO] os.detected.release: ubuntu
2017-03-22T12:03:37.378 [INFO] os.detected.release.version: 14.04
2017-03-22T12:03:37.378 [INFO] os.detected.release.like.ubuntu: true
2017-03-22T12:03:37.378 [INFO] os.detected.release.like.debian: true
2017-03-22T12:03:37.378 [INFO] os.detected.classifier: linux-x86_64
2017-03-22T12:05:12.155 [INFO] ------------------------------------------------------------------------
2017-03-22T12:05:12.155 [INFO] Reactor Build Order:
2017-03-22T12:05:12.155 [INFO] 
2017-03-22T12:05:12.155 [INFO] Apache Beam :: Parent
2017-03-22T12:05:12.155 [INFO] Apache Beam :: SDKs :: Java :: Build Tools
2017-03-22T12:05:12.155 [INFO] Apache Beam :: SDKs
2017-03-22T12:05:12.155 [INFO] Apache Beam :: SDKs :: Common
2017-03-22T12:05:12.155 [INFO] Apache Beam :: SDKs :: Common :: Fn API
2017-03-22T12:05:12.155 [INFO] Apache Beam :: SDKs :: Common :: Runner API
2017-03-22T12:05:12.155 [INFO] Apache Beam :: SDKs :: Java
2017-03-22T12:05:12.155 [INFO] Apache Beam :: SDKs :: Java :: Core
2017-03-22T12:05:12.155 [INFO] Apache Beam :: SDKs :: Java :: IO
2017-03-22T12:05:12.155 [INFO] Apache Beam :: Runners
2017-03-22T12:05:12.155 [INFO] Apache Beam :: Runners :: Core Java Construction
2017-03-22T12:05:12.155 [INFO] Apache Beam :: Runners :: Core Java
2017-03-22T12:05:12.155 [INFO] Apache Beam :: Runners :: Direct Java
2017-03-22T12:05:12.155 [INFO] Apache Beam :: SDKs :: Java :: IO :: Hadoop Common
2017-03-22T12:05:12.155 [INFO] Apache Beam :: SDKs :: Java :: IO :: Kafka
2017-03-22T12:05:12.155 [INFO] Apache Beam :: Runners :: Spark
2017-03-22T12:05:24.467 [INFO]                                                           
             
2017-03-22T12:05:24.467 [INFO] ------------------------------------------------------------------------
2017-03-22T12:05:24.467 [INFO] Building Apache Beam :: Parent 0.7.0-SNAPSHOT
2017-03-22T12:05:24.467 [INFO] ------------------------------------------------------------------------
2017-03-22T12:05:24.470 [INFO] Downloading: https://repo.maven.apache.org/maven2/org/apache/maven/plugins/maven-remote-resources-plugin/1.5/maven-remote-resources-plugin-1.5.pom
[INFO] I/O exception (java.net.SocketException) caught when processing request to {s}->https://repo.maven.apache.org:443:
Connection reset
[INFO] Retrying request to {s}->https://repo.maven.apache.org:443
[INFO] I/O exception (java.net.SocketException) caught when processing request to {s}->https://repo.maven.apache.org:443:
Connection reset
[INFO] Retrying request to {s}->https://repo.maven.apache.org:443
[INFO] I/O exception (java.net.SocketException) caught when processing request to {s}->https://repo.maven.apache.org:443:
Connection reset
[INFO] Retrying request to {s}->https://repo.maven.apache.org:443
[JENKINS] Archiving disabled
[JENKINS] Archiving disabled
[JENKINS] Archiving disabled
[JENKINS] Archiving disabled
[JENKINS] Archiving disabled
[JENKINS] Archiving disabled
[JENKINS] Archiving disabled
[JENKINS] Archiving disabled
[JENKINS] Archiving disabled
[JENKINS] Archiving disabled
[JENKINS] Archiving disabled
[JENKINS] Archiving disabled
[JENKINS] Archiving disabled
[JENKINS] Archiving disabled
[JENKINS] Archiving disabled
[JENKINS] Archiving disabled
[JENKINS] Archiving disabled
2017-03-22T12:05:35.195 [INFO] ------------------------------------------------------------------------
2017-03-22T12:05:35.195 [INFO] Reactor Summary:
2017-03-22T12:05:35.195 [INFO] 
2017-03-22T12:05:35.195 [INFO] Apache Beam :: Parent .............................. FAILURE
[ 12.366 s]
2017-03-22T12:05:35.195 [INFO] Apache Beam :: SDKs :: Java :: Build Tools ......... SKIPPED
2017-03-22T12:05:35.195 [INFO] Apache Beam :: SDKs ................................ SKIPPED
2017-03-22T12:05:35.195 [INFO] Apache Beam :: SDKs :: Common ...................... SKIPPED
2017-03-22T12:05:35.195 [INFO] Apache Beam :: SDKs :: Common :: Fn API ............ SKIPPED
2017-03-22T12:05:35.195 [INFO] Apache Beam :: SDKs :: Common :: Runner API ........ SKIPPED
2017-03-22T12:05:35.195 [INFO] Apache Beam :: SDKs :: Java ........................ SKIPPED
2017-03-22T12:05:35.195 [INFO] Apache Beam :: SDKs :: Java :: Core ................ SKIPPED
2017-03-22T12:05:35.195 [INFO] Apache Beam :: SDKs :: Java :: IO .................. SKIPPED
2017-03-22T12:05:35.195 [INFO] Apache Beam :: Runners ............................. SKIPPED
2017-03-22T12:05:35.195 [INFO] Apache Beam :: Runners :: Core Java Construction ... SKIPPED
2017-03-22T12:05:35.195 [INFO] Apache Beam :: Runners :: Core Java ................ SKIPPED
2017-03-22T12:05:35.195 [INFO] Apache Beam :: Runners :: Direct Java .............. SKIPPED
2017-03-22T12:05:35.195 [INFO] Apache Beam :: SDKs :: Java :: IO :: Hadoop Common . SKIPPED
2017-03-22T12:05:35.195 [INFO] Apache Beam :: SDKs :: Java :: IO :: Kafka ......... SKIPPED
2017-03-22T12:05:35.195 [INFO] Apache Beam :: Runners :: Spark .................... SKIPPED
2017-03-22T12:05:35.195 [INFO] ------------------------------------------------------------------------
2017-03-22T12:05:35.195 [INFO] BUILD FAILURE
2017-03-22T12:05:35.195 [INFO] ------------------------------------------------------------------------
2017-03-22T12:05:35.195 [INFO] Total time: 02:01 min
2017-03-22T12:05:35.195 [INFO] Finished at: 2017-03-22T12:05:35+00:00
2017-03-22T12:05:35.313 [INFO] Final Memory: 33M/354M
2017-03-22T12:05:35.313 [INFO] ------------------------------------------------------------------------
Waiting for Jenkins to finish collecting data
2017-03-22T12:05:45.827 [ERROR] Plugin org.apache.maven.plugins:maven-remote-resources-plugin:1.5
or one of its dependencies could not be resolved: Failed to read artifact descriptor for org.apache.maven.plugins:maven-remote-resources-plugin:jar:1.5:
Could not transfer artifact org.apache.maven.plugins:maven-remote-resources-plugin:pom:1.5
from/to central (https://repo.maven.apache.org/maven2): Connection reset -> [Help 1]
org.apache.maven.plugin.PluginResolutionException: Plugin org.apache.maven.plugins:maven-remote-resources-plugin:1.5
or one of its dependencies could not be resolved: Failed to read artifact descriptor for org.apache.maven.plugins:maven-remote-resources-plugin:jar:1.5
	at org.apache.maven.plugin.internal.DefaultPluginDependenciesResolver.resolve(DefaultPluginDependenciesResolver.java:117)
	at org.apache.maven.plugin.internal.DefaultMavenPluginManager.getPluginDescriptor(DefaultMavenPluginManager.java:179)
	at org.apache.maven.plugin.internal.DefaultMavenPluginManager.getMojoDescriptor(DefaultMavenPluginManager.java:298)
	at org.apache.maven.plugin.DefaultBuildPluginManager.getMojoDescriptor(DefaultBuildPluginManager.java:241)
	at org.apache.maven.lifecycle.internal.DefaultLifecycleMappingDelegate.calculateLifecycleMappings(DefaultLifecycleMappingDelegate.java:110)
	at org.apache.maven.lifecycle.internal.DefaultLifecycleExecutionPlanCalculator.calculateLifecycleMappings(DefaultLifecycleExecutionPlanCalculator.java:266)
	at org.apache.maven.lifecycle.internal.DefaultLifecycleExecutionPlanCalculator.calculateMojoExecutions(DefaultLifecycleExecutionPlanCalculator.java:217)
	at org.apache.maven.lifecycle.internal.DefaultLifecycleExecutionPlanCalculator.calculateExecutionPlan(DefaultLifecycleExecutionPlanCalculator.java:127)
	at org.apache.maven.lifecycle.internal.DefaultLifecycleExecutionPlanCalculator.calculateExecutionPlan(DefaultLifecycleExecutionPlanCalculator.java:145)
	at org.apache.maven.lifecycle.internal.builder.BuilderCommon.resolveBuildPlan(BuilderCommon.java:96)
	at org.apache.maven.lifecycle.internal.LifecycleModuleBuilder.buildProject(LifecycleModuleBuilder.java:109)
	at org.apache.maven.lifecycle.internal.LifecycleModuleBuilder.buildProject(LifecycleModuleBuilder.java:80)
	at org.apache.maven.lifecycle.internal.builder.singlethreaded.SingleThreadedBuilder.build(SingleThreadedBuilder.java:51)
	at org.apache.maven.lifecycle.internal.LifecycleStarter.execute(LifecycleStarter.java:128)
	at org.apache.maven.DefaultMaven.doExecute(DefaultMaven.java:307)
	at org.apache.maven.DefaultMaven.doExecute(DefaultMaven.java:193)
	at org.apache.maven.DefaultMaven.execute(DefaultMaven.java:106)
	at org.jvnet.hudson.maven3.launcher.Maven33Launcher.main(Maven33Launcher.java:129)
	at sun.reflect.NativeMethodAccessorImpl.invoke0(Native Method)
	at sun.reflect.NativeMethodAccessorImpl.invoke(NativeMethodAccessorImpl.java:62)
	at sun.reflect.DelegatingMethodAccessorImpl.invoke(DelegatingMethodAccessorImpl.java:43)
	at java.lang.reflect.Method.invoke(Method.java:498)
	at org.codehaus.plexus.classworlds.launcher.Launcher.launchStandard(Launcher.java:330)
	at org.codehaus.plexus.classworlds.launcher.Launcher.launch(Launcher.java:238)
	at jenkins.maven3.agent.Maven33Main.launch(Maven33Main.java:176)
	at sun.reflect.NativeMethodAccessorImpl.invoke0(Native Method)
	at sun.reflect.NativeMethodAccessorImpl.invoke(NativeMethodAccessorImpl.java:62)
	at sun.reflect.DelegatingMethodAccessorImpl.invoke(DelegatingMethodAccessorImpl.java:43)
	at java.lang.reflect.Method.invoke(Method.java:498)
	at hudson.maven.Maven3Builder.call(Maven3Builder.java:139)
	at hudson.maven.Maven3Builder.call(Maven3Builder.java:70)
	at hudson.remoting.UserRequest.perform(UserRequest.java:153)
	at hudson.remoting.UserRequest.perform(UserRequest.java:50)
	at hudson.remoting.Request$2.run(Request.java:336)
	at hudson.remoting.InterceptingExecutorService$1.call(InterceptingExecutorService.java:68)
	at java.util.concurrent.FutureTask.run(FutureTask.java:266)
	at java.util.concurrent.ThreadPoolExecutor.runWorker(ThreadPoolExecutor.java:1142)
	at java.util.concurrent.ThreadPoolExecutor$Worker.run(ThreadPoolExecutor.java:617)
	at java.lang.Thread.run(Thread.java:745)
Caused by: org.eclipse.aether.resolution.ArtifactDescriptorException: Failed to read artifact
descriptor for org.apache.maven.plugins:maven-remote-resources-plugin:jar:1.5
	at org.apache.maven.repository.internal.DefaultArtifactDescriptorReader.loadPom(DefaultArtifactDescriptorReader.java:302)
	at org.apache.maven.repository.internal.DefaultArtifactDescriptorReader.readArtifactDescriptor(DefaultArtifactDescriptorReader.java:218)
	at org.eclipse.aether.internal.impl.DefaultRepositorySystem.readArtifactDescriptor(DefaultRepositorySystem.java:287)
	at org.apache.maven.plugin.internal.DefaultPluginDependenciesResolver.resolve(DefaultPluginDependenciesResolver.java:103)
	... 38 more
Caused by: org.eclipse.aether.resolution.ArtifactResolutionException: Could not transfer artifact
org.apache.maven.plugins:maven-remote-resources-plugin:pom:1.5 from/to central (https://repo.maven.apache.org/maven2):
Connection reset
	at org.eclipse.aether.internal.impl.DefaultArtifactResolver.resolve(DefaultArtifactResolver.java:444)
	at org.eclipse.aether.internal.impl.DefaultArtifactResolver.resolveArtifacts(DefaultArtifactResolver.java:246)
	at org.eclipse.aether.internal.impl.DefaultArtifactResolver.resolveArtifact(DefaultArtifactResolver.java:223)
	at org.apache.maven.repository.internal.DefaultArtifactDescriptorReader.loadPom(DefaultArtifactDescriptorReader.java:287)
	... 41 more
Caused by: org.eclipse.aether.transfer.ArtifactTransferException: Could not transfer artifact
org.apache.maven.plugins:maven-remote-resources-plugin:pom:1.5 from/to central (https://repo.maven.apache.org/maven2):
Connection reset
	at org.eclipse.aether.connector.basic.ArtifactTransportListener.transferFailed(ArtifactTransportListener.java:43)
	at org.eclipse.aether.connector.basic.BasicRepositoryConnector$TaskRunner.run(BasicRepositoryConnector.java:355)
	at org.eclipse.aether.util.concurrency.RunnableErrorForwarder$1.run(RunnableErrorForwarder.java:67)
	at org.eclipse.aether.connector.basic.BasicRepositoryConnector$DirectExecutor.execute(BasicRepositoryConnector.java:581)
	at org.eclipse.aether.connector.basic.BasicRepositoryConnector.get(BasicRepositoryConnector.java:249)
	at org.eclipse.aether.internal.impl.DefaultArtifactResolver.performDownloads(DefaultArtifactResolver.java:520)
	at org.eclipse.aether.internal.impl.DefaultArtifactResolver.resolve(DefaultArtifactResolver.java:421)
	... 44 more
Caused by: org.apache.maven.wagon.TransferFailedException: Connection reset
	at org.apache.maven.wagon.providers.http.AbstractHttpClientWagon.fillInputData(AbstractHttpClientWagon.java:1066)
	at org.apache.maven.wagon.providers.http.AbstractHttpClientWagon.fillInputData(AbstractHttpClientWagon.java:960)
	at org.apache.maven.wagon.StreamWagon.getInputStream(StreamWagon.java:116)
	at org.apache.maven.wagon.StreamWagon.getIfNewer(StreamWagon.java:88)
	at org.apache.maven.wagon.StreamWagon.get(StreamWagon.java:61)
	at org.eclipse.aether.transport.wagon.WagonTransporter$GetTaskRunner.run(WagonTransporter.java:560)
	at org.eclipse.aether.transport.wagon.WagonTransporter.execute(WagonTransporter.java:427)
	at org.eclipse.aether.transport.wagon.WagonTransporter.get(WagonTransporter.java:404)
	at org.eclipse.aether.connector.basic.BasicRepositoryConnector$GetTaskRunner.runTask(BasicRepositoryConnector.java:447)
	at org.eclipse.aether.connector.basic.BasicRepositoryConnector$TaskRunner.run(BasicRepositoryConnector.java:350)
	... 49 more
Caused by: java.net.SocketException: Connection reset
	at java.net.SocketInputStream.read(SocketInputStream.java:210)
	at java.net.SocketInputStream.read(SocketInputStream.java:141)
	at sun.security.ssl.InputRecord.readFully(InputRecord.java:465)
	at sun.security.ssl.InputRecord.read(InputRecord.java:503)
	at sun.security.ssl.SSLSocketImpl.readRecord(SSLSocketImpl.java:973)
	at sun.security.ssl.SSLSocketImpl.readDataRecord(SSLSocketImpl.java:930)
	at sun.security.ssl.AppInputStream.read(AppInputStream.java:105)
	at org.apache.maven.wagon.providers.http.httpclient.impl.io.SessionInputBufferImpl.streamRead(SessionInputBufferImpl.java:136)
	at org.apache.maven.wagon.providers.http.httpclient.impl.io.SessionInputBufferImpl.fillBuffer(SessionInputBufferImpl.java:152)
	at org.apache.maven.wagon.providers.http.httpclient.impl.io.SessionInputBufferImpl.readLine(SessionInputBufferImpl.java:270)
	at org.apache.maven.wagon.providers.http.httpclient.impl.conn.DefaultHttpResponseParser.parseHead(DefaultHttpResponseParser.java:140)
	at org.apache.maven.wagon.providers.http.httpclient.impl.conn.DefaultHttpResponseParser.parseHead(DefaultHttpResponseParser.java:57)
	at org.apache.maven.wagon.providers.http.httpclient.impl.io.AbstractMessageParser.parse(AbstractMessageParser.java:260)
	at org.apache.maven.wagon.providers.http.httpclient.impl.DefaultBHttpClientConnection.receiveResponseHeader(DefaultBHttpClientConnection.java:161)
	at org.apache.maven.wagon.providers.http.httpclient.impl.conn.CPoolProxy.receiveResponseHeader(CPoolProxy.java:153)
	at org.apache.maven.wagon.providers.http.httpclient.protocol.HttpRequestExecutor.doReceiveResponse(HttpRequestExecutor.java:271)
	at org.apache.maven.wagon.providers.http.httpclient.protocol.HttpRequestExecutor.execute(HttpRequestExecutor.java:123)
	at org.apache.maven.wagon.providers.http.httpclient.impl.execchain.MainClientExec.execute(MainClientExec.java:254)
	at org.apache.maven.wagon.providers.http.httpclient.impl.execchain.ProtocolExec.execute(ProtocolExec.java:195)
	at org.apache.maven.wagon.providers.http.httpclient.impl.execchain.RetryExec.execute(RetryExec.java:86)
	at org.apache.maven.wagon.providers.http.httpclient.impl.execchain.RedirectExec.execute(RedirectExec.java:108)
	at org.apache.maven.wagon.providers.http.httpclient.impl.client.InternalHttpClient.doExecute(InternalHttpClient.java:184)
	at org.apache.maven.wagon.providers.http.httpclient.impl.client.CloseableHttpClient.execute(CloseableHttpClient.java:82)
	at org.apache.maven.wagon.providers.http.AbstractHttpClientWagon.execute(AbstractHttpClientWagon.java:832)
	at org.apache.maven.wagon.providers.http.AbstractHttpClientWagon.fillInputData(AbstractHttpClientWagon.java:983)
	... 58 more
2017-03-22T12:05:45.829 [ERROR] 
2017-03-22T12:05:45.829 [ERROR] Re-run Maven using the -X switch to enable full debug logging.
2017-03-22T12:05:45.829 [ERROR] 
2017-03-22T12:05:45.829 [ERROR] For more information about the errors and possible solutions,
please read the following articles:
2017-03-22T12:05:45.829 [ERROR] [Help 1] http://cwiki.apache.org/confluence/display/MAVEN/PluginResolutionException
channel stopped

Mime
View raw message