beam-commits mailing list archives

Site index · List index
Message view « Date » · « Thread »
Top « Date » · « Thread »
From Apache Jenkins Server <jenk...@builds.apache.org>
Subject Build failed in Jenkins: beam_PostCommit_Java_RunnableOnService_Flink #1923
Date Tue, 14 Mar 2017 15:05:11 GMT
See <https://builds.apache.org/job/beam_PostCommit_Java_RunnableOnService_Flink/1923/display/redirect>

------------------------------------------
[...truncated 541.18 KB...]
2017-03-14T15:04:49.266 [INFO] Downloading: https://repo.maven.apache.org/maven2/com/github/scopt/scopt_2.10/3.2.0/scopt_2.10-3.2.0.jar
2017-03-14T15:04:49.273 [INFO] Downloaded: https://repo.maven.apache.org/maven2/org/clapper/grizzled-slf4j_2.10/1.0.2/grizzled-slf4j_2.10-1.0.2.jar
(7 KB at 4.2 KB/sec)
2017-03-14T15:04:49.273 [INFO] Downloading: https://repo.maven.apache.org/maven2/org/apache/zookeeper/zookeeper/3.4.6/zookeeper-3.4.6.jar
2017-03-14T15:04:49.325 [INFO] Downloaded: https://repo.maven.apache.org/maven2/com/github/scopt/scopt_2.10/3.2.0/scopt_2.10-3.2.0.jar
(121 KB at 76.9 KB/sec)
2017-03-14T15:04:49.326 [INFO] Downloading: https://repo.maven.apache.org/maven2/jline/jline/0.9.94/jline-0.9.94.jar
2017-03-14T15:04:49.370 [INFO] Downloaded: https://repo.maven.apache.org/maven2/jline/jline/0.9.94/jline-0.9.94.jar
(86 KB at 53.1 KB/sec)
2017-03-14T15:04:49.370 [INFO] Downloading: https://repo.maven.apache.org/maven2/com/twitter/chill_2.10/0.7.4/chill_2.10-0.7.4.jar
2017-03-14T15:04:49.377 [INFO] Downloaded: https://repo.maven.apache.org/maven2/com/data-artisans/flakka-actor_2.10/2.3-custom/flakka-actor_2.10-2.3-custom.jar
(2754 KB at 1707.0 KB/sec)
2017-03-14T15:04:49.377 [INFO] Downloading: https://repo.maven.apache.org/maven2/com/twitter/chill-java/0.7.4/chill-java-0.7.4.jar
2017-03-14T15:04:49.399 [INFO] Downloaded: https://repo.maven.apache.org/maven2/org/apache/zookeeper/zookeeper/3.4.6/zookeeper-3.4.6.jar
(775 KB at 473.6 KB/sec)
2017-03-14T15:04:49.399 [INFO] Downloading: https://repo.maven.apache.org/maven2/org/apache/flink/flink-streaming-java_2.10/1.2.0/flink-streaming-java_2.10-1.2.0-tests.jar
2017-03-14T15:04:49.411 [INFO] Downloaded: https://repo.maven.apache.org/maven2/com/twitter/chill-java/0.7.4/chill-java-0.7.4.jar
(50 KB at 29.9 KB/sec)
2017-03-14T15:04:49.411 [INFO] Downloading: https://repo.maven.apache.org/maven2/org/apache/flink/flink-test-utils_2.10/1.2.0/flink-test-utils_2.10-1.2.0.jar
2017-03-14T15:04:49.416 [INFO] Downloaded: https://repo.maven.apache.org/maven2/com/twitter/chill_2.10/0.7.4/chill_2.10-0.7.4.jar
(217 KB at 130.8 KB/sec)
2017-03-14T15:04:49.417 [INFO] Downloading: https://repo.maven.apache.org/maven2/org/apache/flink/flink-test-utils-junit/1.2.0/flink-test-utils-junit-1.2.0.jar
2017-03-14T15:04:49.453 [INFO] Downloaded: https://repo.maven.apache.org/maven2/org/apache/flink/flink-test-utils-junit/1.2.0/flink-test-utils-junit-1.2.0.jar
(24 KB at 13.6 KB/sec)
2017-03-14T15:04:49.453 [INFO] Downloading: https://repo.maven.apache.org/maven2/org/apache/curator/curator-test/2.8.0/curator-test-2.8.0.jar
2017-03-14T15:04:49.485 [INFO] Downloaded: https://repo.maven.apache.org/maven2/org/apache/curator/curator-test/2.8.0/curator-test-2.8.0.jar
(39 KB at 22.6 KB/sec)
2017-03-14T15:04:49.485 [INFO] Downloading: https://repo.maven.apache.org/maven2/org/apache/commons/commons-math/2.2/commons-math-2.2.jar
2017-03-14T15:04:49.567 [INFO] Downloaded: https://repo.maven.apache.org/maven2/org/apache/flink/flink-streaming-java_2.10/1.2.0/flink-streaming-java_2.10-1.2.0-tests.jar
(942 KB at 521.9 KB/sec)
2017-03-14T15:04:49.567 [INFO] Downloading: https://repo.maven.apache.org/maven2/org/apache/hadoop/hadoop-minikdc/2.7.2/hadoop-minikdc-2.7.2.jar
2017-03-14T15:04:49.595 [INFO] Downloaded: https://repo.maven.apache.org/maven2/org/apache/hadoop/hadoop-minikdc/2.7.2/hadoop-minikdc-2.7.2.jar
(17 KB at 9.0 KB/sec)
2017-03-14T15:04:49.595 [INFO] Downloading: https://repo.maven.apache.org/maven2/org/apache/directory/server/apacheds-core-api/2.0.0-M15/apacheds-core-api-2.0.0-M15.jar
2017-03-14T15:04:49.682 [INFO] Downloaded: https://repo.maven.apache.org/maven2/org/apache/commons/commons-math/2.2/commons-math-2.2.jar
(966 KB at 503.3 KB/sec)
2017-03-14T15:04:49.682 [INFO] Downloading: https://repo.maven.apache.org/maven2/org/apache/directory/server/apacheds-core-constants/2.0.0-M15/apacheds-core-constants-2.0.0-M15.jar
2017-03-14T15:04:49.683 [INFO] Downloaded: https://repo.maven.apache.org/maven2/org/apache/directory/server/apacheds-core-api/2.0.0-M15/apacheds-core-api-2.0.0-M15.jar
(254 KB at 132.3 KB/sec)
2017-03-14T15:04:49.683 [INFO] Downloading: https://repo.maven.apache.org/maven2/org/apache/directory/server/apacheds-i18n/2.0.0-M15/apacheds-i18n-2.0.0-M15.jar
2017-03-14T15:04:49.711 [INFO] Downloaded: https://repo.maven.apache.org/maven2/org/apache/directory/server/apacheds-core-constants/2.0.0-M15/apacheds-core-constants-2.0.0-M15.jar
(10 KB at 4.9 KB/sec)
2017-03-14T15:04:49.711 [INFO] Downloading: https://repo.maven.apache.org/maven2/org/apache/directory/api/api-i18n/1.0.0-M20/api-i18n-1.0.0-M20.jar
2017-03-14T15:04:49.715 [INFO] Downloaded: https://repo.maven.apache.org/maven2/org/apache/directory/server/apacheds-i18n/2.0.0-M15/apacheds-i18n-2.0.0-M15.jar
(44 KB at 22.5 KB/sec)
2017-03-14T15:04:49.715 [INFO] Downloading: https://repo.maven.apache.org/maven2/org/apache/directory/api/api-asn1-api/1.0.0-M20/api-asn1-api-1.0.0-M20.jar
2017-03-14T15:04:49.744 [INFO] Downloaded: https://repo.maven.apache.org/maven2/org/apache/directory/api/api-i18n/1.0.0-M20/api-i18n-1.0.0-M20.jar
(44 KB at 22.0 KB/sec)
2017-03-14T15:04:49.744 [INFO] Downloading: https://repo.maven.apache.org/maven2/org/apache/directory/api/api-ldap-client-api/1.0.0-M20/api-ldap-client-api-1.0.0-M20.jar
2017-03-14T15:04:49.746 [INFO] Downloaded: https://repo.maven.apache.org/maven2/org/apache/directory/api/api-asn1-api/1.0.0-M20/api-asn1-api-1.0.0-M20.jar
(17 KB at 8.2 KB/sec)
2017-03-14T15:04:49.746 [INFO] Downloading: https://repo.maven.apache.org/maven2/org/apache/directory/api/api-ldap-codec-core/1.0.0-M20/api-ldap-codec-core-1.0.0-M20.jar
2017-03-14T15:04:49.790 [INFO] Downloaded: https://repo.maven.apache.org/maven2/org/apache/directory/api/api-ldap-client-api/1.0.0-M20/api-ldap-client-api-1.0.0-M20.jar
(78 KB at 38.3 KB/sec)
2017-03-14T15:04:49.790 [INFO] Downloading: https://repo.maven.apache.org/maven2/org/apache/directory/api/api-ldap-extras-aci/1.0.0-M20/api-ldap-extras-aci-1.0.0-M20.jar
2017-03-14T15:04:49.808 [INFO] Downloaded: https://repo.maven.apache.org/maven2/org/scala-lang/scala-library/2.10.4/scala-library-2.10.4.jar
(6960 KB at 3404.8 KB/sec)
2017-03-14T15:04:49.808 [INFO] Downloading: https://repo.maven.apache.org/maven2/org/apache/directory/api/api-ldap-extras-util/1.0.0-M20/api-ldap-extras-util-1.0.0-M20.jar
2017-03-14T15:04:49.815 [INFO] Downloaded: https://repo.maven.apache.org/maven2/org/apache/directory/api/api-ldap-codec-core/1.0.0-M20/api-ldap-codec-core-1.0.0-M20.jar
(323 KB at 157.1 KB/sec)
2017-03-14T15:04:49.815 [INFO] Downloading: https://repo.maven.apache.org/maven2/org/apache/directory/api/api-ldap-model/1.0.0-M20/api-ldap-model-1.0.0-M20.jar
2017-03-14T15:04:49.815 [INFO] Downloaded: https://repo.maven.apache.org/maven2/org/apache/flink/flink-test-utils_2.10/1.2.0/flink-test-utils_2.10-1.2.0.jar
(2367 KB at 1153.6 KB/sec)
2017-03-14T15:04:49.815 [INFO] Downloading: https://repo.maven.apache.org/maven2/org/apache/directory/api/api-util/1.0.0-M20/api-util-1.0.0-M20.jar
2017-03-14T15:04:49.826 [INFO] Downloaded: https://repo.maven.apache.org/maven2/org/apache/directory/api/api-ldap-extras-aci/1.0.0-M20/api-ldap-extras-aci-1.0.0-M20.jar
(100 KB at 48.2 KB/sec)
2017-03-14T15:04:49.826 [INFO] Downloading: https://repo.maven.apache.org/maven2/org/apache/mina/mina-core/2.0.7/mina-core-2.0.7.jar
2017-03-14T15:04:49.835 [INFO] Downloaded: https://repo.maven.apache.org/maven2/org/apache/directory/api/api-ldap-extras-util/1.0.0-M20/api-ldap-extras-util-1.0.0-M20.jar
(20 KB at 9.7 KB/sec)
2017-03-14T15:04:49.835 [INFO] Downloading: https://repo.maven.apache.org/maven2/net/sf/ehcache/ehcache-core/2.4.4/ehcache-core-2.4.4.jar
2017-03-14T15:04:49.847 [INFO] Downloaded: https://repo.maven.apache.org/maven2/org/apache/directory/api/api-util/1.0.0-M20/api-util-1.0.0-M20.jar
(79 KB at 37.5 KB/sec)
2017-03-14T15:04:49.847 [INFO] Downloading: https://repo.maven.apache.org/maven2/org/apache/directory/server/apacheds-interceptor-kerberos/2.0.0-M15/apacheds-interceptor-kerberos-2.0.0-M15.jar
2017-03-14T15:04:49.886 [INFO] Downloaded: https://repo.maven.apache.org/maven2/org/apache/directory/server/apacheds-interceptor-kerberos/2.0.0-M15/apacheds-interceptor-kerberos-2.0.0-M15.jar
(16 KB at 7.1 KB/sec)
2017-03-14T15:04:49.886 [INFO] Downloading: https://repo.maven.apache.org/maven2/org/apache/directory/server/apacheds-core/2.0.0-M15/apacheds-core-2.0.0-M15.jar
2017-03-14T15:04:49.917 [INFO] Downloaded: https://repo.maven.apache.org/maven2/org/apache/directory/server/apacheds-core/2.0.0-M15/apacheds-core-2.0.0-M15.jar
(45 KB at 20.8 KB/sec)
2017-03-14T15:04:49.918 [INFO] Downloading: https://repo.maven.apache.org/maven2/org/apache/directory/server/apacheds-interceptors-admin/2.0.0-M15/apacheds-interceptors-admin-2.0.0-M15.jar
2017-03-14T15:04:49.935 [INFO] Downloaded: https://repo.maven.apache.org/maven2/org/apache/mina/mina-core/2.0.7/mina-core-2.0.7.jar
(630 KB at 290.0 KB/sec)
2017-03-14T15:04:49.935 [INFO] Downloading: https://repo.maven.apache.org/maven2/org/apache/directory/server/apacheds-interceptors-authn/2.0.0-M15/apacheds-interceptors-authn-2.0.0-M15.jar
2017-03-14T15:04:49.946 [INFO] Downloaded: https://repo.maven.apache.org/maven2/org/apache/directory/server/apacheds-interceptors-admin/2.0.0-M15/apacheds-interceptors-admin-2.0.0-M15.jar
(20 KB at 9.0 KB/sec)
2017-03-14T15:04:49.946 [INFO] Downloading: https://repo.maven.apache.org/maven2/org/apache/directory/server/apacheds-interceptors-authz/2.0.0-M15/apacheds-interceptors-authz-2.0.0-M15.jar
2017-03-14T15:04:49.958 [INFO] Downloaded: https://repo.maven.apache.org/maven2/org/apache/directory/api/api-ldap-model/1.0.0-M20/api-ldap-model-1.0.0-M20.jar
(868 KB at 395.7 KB/sec)
2017-03-14T15:04:49.958 [INFO] Downloading: https://repo.maven.apache.org/maven2/org/apache/directory/server/apacheds-interceptors-changelog/2.0.0-M15/apacheds-interceptors-changelog-2.0.0-M15.jar
2017-03-14T15:04:49.970 [INFO] Downloaded: https://repo.maven.apache.org/maven2/org/apache/directory/server/apacheds-interceptors-authn/2.0.0-M15/apacheds-interceptors-authn-2.0.0-M15.jar
(41 KB at 18.4 KB/sec)
2017-03-14T15:04:49.970 [INFO] Downloading: https://repo.maven.apache.org/maven2/org/apache/directory/server/apacheds-interceptors-collective/2.0.0-M15/apacheds-interceptors-collective-2.0.0-M15.jar
2017-03-14T15:04:49.980 [INFO] Downloaded: https://repo.maven.apache.org/maven2/org/apache/directory/server/apacheds-interceptors-authz/2.0.0-M15/apacheds-interceptors-authz-2.0.0-M15.jar
(63 KB at 28.3 KB/sec)
2017-03-14T15:04:49.980 [INFO] Downloading: https://repo.maven.apache.org/maven2/org/apache/directory/server/apacheds-interceptors-event/2.0.0-M15/apacheds-interceptors-event-2.0.0-M15.jar
2017-03-14T15:04:49.981 [INFO] Downloaded: https://repo.maven.apache.org/maven2/net/sf/ehcache/ehcache-core/2.4.4/ehcache-core-2.4.4.jar
(986 KB at 444.7 KB/sec)
2017-03-14T15:04:49.981 [INFO] Downloading: https://repo.maven.apache.org/maven2/org/apache/directory/server/apacheds-interceptors-exception/2.0.0-M15/apacheds-interceptors-exception-2.0.0-M15.jar
2017-03-14T15:04:49.987 [INFO] Downloaded: https://repo.maven.apache.org/maven2/org/apache/directory/server/apacheds-interceptors-changelog/2.0.0-M15/apacheds-interceptors-changelog-2.0.0-M15.jar
(21 KB at 9.4 KB/sec)
2017-03-14T15:04:49.987 [INFO] Downloading: https://repo.maven.apache.org/maven2/org/apache/directory/server/apacheds-interceptors-journal/2.0.0-M15/apacheds-interceptors-journal-2.0.0-M15.jar
2017-03-14T15:04:49.997 [INFO] Downloaded: https://repo.maven.apache.org/maven2/org/apache/directory/server/apacheds-interceptors-collective/2.0.0-M15/apacheds-interceptors-collective-2.0.0-M15.jar
(14 KB at 6.1 KB/sec)
2017-03-14T15:04:49.997 [INFO] Downloading: https://repo.maven.apache.org/maven2/org/apache/directory/server/apacheds-interceptors-normalization/2.0.0-M15/apacheds-interceptors-normalization-2.0.0-M15.jar
2017-03-14T15:04:50.007 [INFO] Downloaded: https://repo.maven.apache.org/maven2/org/apache/directory/server/apacheds-interceptors-event/2.0.0-M15/apacheds-interceptors-event-2.0.0-M15.jar
(19 KB at 8.2 KB/sec)
2017-03-14T15:04:50.007 [INFO] Downloading: https://repo.maven.apache.org/maven2/org/apache/directory/server/apacheds-interceptors-operational/2.0.0-M15/apacheds-interceptors-operational-2.0.0-M15.jar
2017-03-14T15:04:50.007 [INFO] Downloaded: https://repo.maven.apache.org/maven2/org/apache/directory/server/apacheds-interceptors-exception/2.0.0-M15/apacheds-interceptors-exception-2.0.0-M15.jar
(11 KB at 4.9 KB/sec)
2017-03-14T15:04:50.008 [INFO] Downloading: https://repo.maven.apache.org/maven2/org/apache/directory/server/apacheds-interceptors-referral/2.0.0-M15/apacheds-interceptors-referral-2.0.0-M15.jar
2017-03-14T15:04:50.015 [INFO] Downloaded: https://repo.maven.apache.org/maven2/org/apache/directory/server/apacheds-interceptors-journal/2.0.0-M15/apacheds-interceptors-journal-2.0.0-M15.jar
(14 KB at 6.0 KB/sec)
2017-03-14T15:04:50.015 [INFO] Downloading: https://repo.maven.apache.org/maven2/org/apache/directory/server/apacheds-interceptors-schema/2.0.0-M15/apacheds-interceptors-schema-2.0.0-M15.jar
2017-03-14T15:04:50.024 [INFO] Downloaded: https://repo.maven.apache.org/maven2/org/apache/directory/server/apacheds-interceptors-normalization/2.0.0-M15/apacheds-interceptors-normalization-2.0.0-M15.jar
(16 KB at 6.6 KB/sec)
2017-03-14T15:04:50.024 [INFO] Downloading: https://repo.maven.apache.org/maven2/org/apache/directory/server/apacheds-interceptors-subtree/2.0.0-M15/apacheds-interceptors-subtree-2.0.0-M15.jar
2017-03-14T15:04:50.034 [INFO] Downloaded: https://repo.maven.apache.org/maven2/org/apache/directory/server/apacheds-interceptors-operational/2.0.0-M15/apacheds-interceptors-operational-2.0.0-M15.jar
(15 KB at 6.5 KB/sec)
2017-03-14T15:04:50.034 [INFO] Downloading: https://repo.maven.apache.org/maven2/org/apache/directory/server/apacheds-interceptors-trigger/2.0.0-M15/apacheds-interceptors-trigger-2.0.0-M15.jar
2017-03-14T15:04:50.037 [INFO] Downloaded: https://repo.maven.apache.org/maven2/org/apache/directory/server/apacheds-interceptors-referral/2.0.0-M15/apacheds-interceptors-referral-2.0.0-M15.jar
(12 KB at 4.9 KB/sec)
2017-03-14T15:04:50.037 [INFO] Downloading: https://repo.maven.apache.org/maven2/org/apache/directory/api/api-ldap-extras-trigger/1.0.0-M20/api-ldap-extras-trigger-1.0.0-M20.jar
2017-03-14T15:04:50.044 [INFO] Downloaded: https://repo.maven.apache.org/maven2/org/apache/directory/server/apacheds-interceptors-schema/2.0.0-M15/apacheds-interceptors-schema-2.0.0-M15.jar
(40 KB at 17.1 KB/sec)
2017-03-14T15:04:50.044 [INFO] Downloading: https://repo.maven.apache.org/maven2/org/apache/directory/server/apacheds-kerberos-codec/2.0.0-M15/apacheds-kerberos-codec-2.0.0-M15.jar
2017-03-14T15:04:50.053 [INFO] Downloaded: https://repo.maven.apache.org/maven2/org/apache/directory/server/apacheds-interceptors-subtree/2.0.0-M15/apacheds-interceptors-subtree-2.0.0-M15.jar
(26 KB at 11.1 KB/sec)
2017-03-14T15:04:50.053 [INFO] Downloading: https://repo.maven.apache.org/maven2/org/apache/directory/server/apacheds-protocol-shared/2.0.0-M15/apacheds-protocol-shared-2.0.0-M15.jar
2017-03-14T15:04:50.063 [INFO] Downloaded: https://repo.maven.apache.org/maven2/org/apache/directory/server/apacheds-interceptors-trigger/2.0.0-M15/apacheds-interceptors-trigger-2.0.0-M15.jar
(47 KB at 20.3 KB/sec)
2017-03-14T15:04:50.063 [INFO] Downloading: https://repo.maven.apache.org/maven2/org/apache/directory/server/apacheds-protocol-kerberos/2.0.0-M15/apacheds-protocol-kerberos-2.0.0-M15.jar
2017-03-14T15:04:50.069 [INFO] Downloaded: https://repo.maven.apache.org/maven2/org/apache/directory/api/api-ldap-extras-trigger/1.0.0-M20/api-ldap-extras-trigger-1.0.0-M20.jar
(48 KB at 20.6 KB/sec)
2017-03-14T15:04:50.070 [INFO] Downloading: https://repo.maven.apache.org/maven2/org/apache/directory/server/apacheds-core-shared/2.0.0-M15/apacheds-core-shared-2.0.0-M15.jar
2017-03-14T15:04:50.087 [INFO] Downloaded: https://repo.maven.apache.org/maven2/org/apache/directory/server/apacheds-protocol-shared/2.0.0-M15/apacheds-protocol-shared-2.0.0-M15.jar
(32 KB at 13.5 KB/sec)
2017-03-14T15:04:50.087 [INFO] Downloading: https://repo.maven.apache.org/maven2/org/apache/directory/server/apacheds-ldif-partition/2.0.0-M15/apacheds-ldif-partition-2.0.0-M15.jar
2017-03-14T15:04:50.101 [INFO] Downloaded: https://repo.maven.apache.org/maven2/org/apache/directory/server/apacheds-core-shared/2.0.0-M15/apacheds-core-shared-2.0.0-M15.jar
(37 KB at 15.8 KB/sec)
2017-03-14T15:04:50.101 [INFO] Downloading: https://repo.maven.apache.org/maven2/org/apache/directory/server/apacheds-xdbm-partition/2.0.0-M15/apacheds-xdbm-partition-2.0.0-M15.jar
2017-03-14T15:04:50.102 [INFO] Downloaded: https://repo.maven.apache.org/maven2/org/apache/directory/server/apacheds-protocol-kerberos/2.0.0-M15/apacheds-protocol-kerberos-2.0.0-M15.jar
(83 KB at 35.4 KB/sec)
2017-03-14T15:04:50.102 [INFO] Downloading: https://repo.maven.apache.org/maven2/org/apache/directory/server/apacheds-mavibot-partition/2.0.0-M15/apacheds-mavibot-partition-2.0.0-M15.jar
2017-03-14T15:04:50.117 [INFO] Downloaded: https://repo.maven.apache.org/maven2/org/apache/directory/server/apacheds-ldif-partition/2.0.0-M15/apacheds-ldif-partition-2.0.0-M15.jar
(29 KB at 12.1 KB/sec)
2017-03-14T15:04:50.117 [INFO] Downloading: https://repo.maven.apache.org/maven2/org/apache/directory/mavibot/mavibot/1.0.0-M1/mavibot-1.0.0-M1.jar
2017-03-14T15:04:50.121 [INFO] Downloaded: https://repo.maven.apache.org/maven2/org/apache/flink/flink-shaded-hadoop2/1.2.0/flink-shaded-hadoop2-1.2.0.jar
(17859 KB at 7577.0 KB/sec)
2017-03-14T15:04:50.122 [INFO] Downloading: https://repo.maven.apache.org/maven2/org/apache/directory/server/apacheds-core-avl/2.0.0-M15/apacheds-core-avl-2.0.0-M15.jar
2017-03-14T15:04:50.134 [INFO] Downloaded: https://repo.maven.apache.org/maven2/org/apache/directory/server/apacheds-mavibot-partition/2.0.0-M15/apacheds-mavibot-partition-2.0.0-M15.jar
(48 KB at 19.9 KB/sec)
2017-03-14T15:04:50.134 [INFO] Downloading: https://repo.maven.apache.org/maven2/org/apache/directory/api/api-all/1.0.0-M20/api-all-1.0.0-M20.jar
2017-03-14T15:04:50.140 [INFO] Downloaded: https://repo.maven.apache.org/maven2/org/apache/directory/server/apacheds-xdbm-partition/2.0.0-M15/apacheds-xdbm-partition-2.0.0-M15.jar
(173 KB at 72.8 KB/sec)
2017-03-14T15:04:50.140 [INFO] Downloading: https://repo.maven.apache.org/maven2/commons-pool/commons-pool/1.6/commons-pool-1.6.jar
2017-03-14T15:04:50.147 [INFO] Downloaded: https://repo.maven.apache.org/maven2/org/apache/directory/server/apacheds-kerberos-codec/2.0.0-M15/apacheds-kerberos-codec-2.0.0-M15.jar
(676 KB at 283.5 KB/sec)
2017-03-14T15:04:50.147 [INFO] Downloading: https://repo.maven.apache.org/maven2/org/apache/directory/server/apacheds-jdbm-partition/2.0.0-M15/apacheds-jdbm-partition-2.0.0-M15.jar
2017-03-14T15:04:50.152 [INFO] Downloaded: https://repo.maven.apache.org/maven2/org/apache/directory/server/apacheds-core-avl/2.0.0-M15/apacheds-core-avl-2.0.0-M15.jar
(60 KB at 25.0 KB/sec)
2017-03-14T15:04:50.152 [INFO] Downloading: https://repo.maven.apache.org/maven2/org/apache/directory/server/apacheds-protocol-ldap/2.0.0-M15/apacheds-protocol-ldap-2.0.0-M15.jar
2017-03-14T15:04:50.153 [INFO] Downloaded: https://repo.maven.apache.org/maven2/org/apache/directory/mavibot/mavibot/1.0.0-M1/mavibot-1.0.0-M1.jar
(146 KB at 60.9 KB/sec)
2017-03-14T15:04:50.153 [INFO] Downloading: https://repo.maven.apache.org/maven2/org/apache/directory/api/api-asn1-ber/1.0.0-M20/api-asn1-ber-1.0.0-M20.jar
2017-03-14T15:04:50.177 [INFO] Downloaded: https://repo.maven.apache.org/maven2/org/apache/directory/server/apacheds-jdbm-partition/2.0.0-M15/apacheds-jdbm-partition-2.0.0-M15.jar
(71 KB at 29.3 KB/sec)
2017-03-14T15:04:50.177 [INFO] Downloading: https://repo.maven.apache.org/maven2/org/apache/directory/api/api-ldap-extras-codec-api/1.0.0-M20/api-ldap-extras-codec-api-1.0.0-M20.jar
2017-03-14T15:04:50.181 [INFO] Downloaded: https://repo.maven.apache.org/maven2/commons-pool/commons-pool/1.6/commons-pool-1.6.jar
(109 KB at 44.9 KB/sec)
2017-03-14T15:04:50.181 [INFO] Downloading: https://repo.maven.apache.org/maven2/org/apache/directory/api/api-ldap-extras-codec/1.0.0-M20/api-ldap-extras-codec-1.0.0-M20.jar
2017-03-14T15:04:50.187 [INFO] Downloaded: https://repo.maven.apache.org/maven2/org/apache/directory/api/api-asn1-ber/1.0.0-M20/api-asn1-ber-1.0.0-M20.jar
(42 KB at 17.0 KB/sec)
2017-03-14T15:04:50.187 [INFO] Downloading: https://repo.maven.apache.org/maven2/org/apache/directory/api/api-ldap-extras-sp/1.0.0-M20/api-ldap-extras-sp-1.0.0-M20.jar
2017-03-14T15:04:50.198 [INFO] Downloaded: https://repo.maven.apache.org/maven2/org/apache/directory/server/apacheds-protocol-ldap/2.0.0-M15/apacheds-protocol-ldap-2.0.0-M15.jar
(224 KB at 91.7 KB/sec)
2017-03-14T15:04:50.198 [INFO] Downloading: https://repo.maven.apache.org/maven2/bouncycastle/bcprov-jdk15/140/bcprov-jdk15-140.jar
2017-03-14T15:04:50.209 [INFO] Downloaded: https://repo.maven.apache.org/maven2/org/apache/directory/api/api-ldap-extras-codec-api/1.0.0-M20/api-ldap-extras-codec-api-1.0.0-M20.jar
(54 KB at 21.9 KB/sec)
2017-03-14T15:04:50.217 [INFO] Downloaded: https://repo.maven.apache.org/maven2/org/apache/directory/api/api-ldap-extras-sp/1.0.0-M20/api-ldap-extras-sp-1.0.0-M20.jar
(13 KB at 5.1 KB/sec)
2017-03-14T15:04:50.224 [INFO] Downloaded: https://repo.maven.apache.org/maven2/org/apache/directory/api/api-ldap-extras-codec/1.0.0-M20/api-ldap-extras-codec-1.0.0-M20.jar
(204 KB at 82.6 KB/sec)
2017-03-14T15:04:50.386 [INFO] Downloaded: https://repo.maven.apache.org/maven2/bouncycastle/bcprov-jdk15/140/bcprov-jdk15-140.jar
(1557 KB at 593.7 KB/sec)
2017-03-14T15:04:50.412 [INFO] Downloaded: https://repo.maven.apache.org/maven2/org/apache/directory/api/api-all/1.0.0-M20/api-all-1.0.0-M20.jar
(2708 KB at 1022.7 KB/sec)
2017-03-14T15:04:50.437 [INFO] Downloading: http://repository.apache.org/snapshots/org/apache/commons/commons-compress/1.14-SNAPSHOT/commons-compress-1.14-20170304.181212-104.jar
2017-03-14T15:04:50.773 [INFO] Downloaded: http://repository.apache.org/snapshots/org/apache/commons/commons-compress/1.14-SNAPSHOT/commons-compress-1.14-20170304.181212-104.jar
(507 KB at 1508.1 KB/sec)
2017-03-14T15:04:50.777 [INFO] 
2017-03-14T15:04:50.777 [INFO] --- maven-clean-plugin:3.0.0:clean (default-clean) @ beam-runners-flink_2.10
---
2017-03-14T15:04:50.778 [INFO] Deleting <https://builds.apache.org/job/beam_PostCommit_Java_RunnableOnService_Flink/ws/runners/flink/runner>
(includes = [**/*.pyc, **/*.egg-info/], excludes = [])
2017-03-14T15:04:52.397 [INFO] 
2017-03-14T15:04:52.397 [INFO] --- maven-enforcer-plugin:1.4.1:enforce (enforce) @ beam-runners-flink_2.10
---
2017-03-14T15:04:56.431 [INFO] 
2017-03-14T15:04:56.431 [INFO] --- maven-remote-resources-plugin:1.5:process (process-resource-bundles)
@ beam-runners-flink_2.10 ---
2017-03-14T15:04:57.525 [INFO] 
2017-03-14T15:04:57.525 [INFO] --- maven-resources-plugin:2.7:resources (default-resources)
@ beam-runners-flink_2.10 ---
2017-03-14T15:04:57.526 [INFO] Using 'UTF-8' encoding to copy filtered resources.
2017-03-14T15:04:57.527 [INFO] Copying 1 resource
2017-03-14T15:04:57.527 [INFO] Copying 3 resources
2017-03-14T15:04:57.618 [INFO] 
2017-03-14T15:04:57.618 [INFO] --- maven-compiler-plugin:3.6.1:compile (default-compile) @
beam-runners-flink_2.10 ---
2017-03-14T15:04:57.632 [INFO] Changes detected - recompiling the module!
2017-03-14T15:04:57.632 [INFO] Compiling 73 source files to <https://builds.apache.org/job/beam_PostCommit_Java_RunnableOnService_Flink/ws/runners/flink/runner/target/classes>
2017-03-14T15:04:58.386 [WARNING] bootstrap class path not set in conjunction with -source
1.7
2017-03-14T15:04:58.386 [INFO] <https://builds.apache.org/job/beam_PostCommit_Java_RunnableOnService_Flink/ws/runners/flink/runner/src/main/java/org/apache/beam/runners/flink/translation/utils/SerializedPipelineOptions.java>:
Some input files use or override a deprecated API.
2017-03-14T15:04:58.386 [INFO] <https://builds.apache.org/job/beam_PostCommit_Java_RunnableOnService_Flink/ws/runners/flink/runner/src/main/java/org/apache/beam/runners/flink/translation/utils/SerializedPipelineOptions.java>:
Recompile with -Xlint:deprecation for details.
2017-03-14T15:04:58.386 [INFO] <https://builds.apache.org/job/beam_PostCommit_Java_RunnableOnService_Flink/ws/runners/flink/runner/src/main/java/org/apache/beam/runners/flink/translation/wrappers/streaming/SingletonKeyedWorkItem.java>:
Some input files use unchecked or unsafe operations.
2017-03-14T15:04:58.386 [INFO] <https://builds.apache.org/job/beam_PostCommit_Java_RunnableOnService_Flink/ws/runners/flink/runner/src/main/java/org/apache/beam/runners/flink/translation/wrappers/streaming/SingletonKeyedWorkItem.java>:
Recompile with -Xlint:unchecked for details.
2017-03-14T15:04:58.477 [INFO] 
2017-03-14T15:04:58.477 [INFO] --- maven-resources-plugin:2.7:testResources (default-testResources)
@ beam-runners-flink_2.10 ---
2017-03-14T15:04:58.478 [INFO] Using 'UTF-8' encoding to copy filtered resources.
2017-03-14T15:04:58.478 [INFO] Copying 1 resource
2017-03-14T15:04:58.479 [INFO] Copying 3 resources
2017-03-14T15:04:58.568 [INFO] 
2017-03-14T15:04:58.568 [INFO] --- maven-compiler-plugin:3.6.1:testCompile (default-testCompile)
@ beam-runners-flink_2.10 ---
2017-03-14T15:04:58.581 [INFO] Changes detected - recompiling the module!
2017-03-14T15:04:58.581 [INFO] Compiling 17 source files to <https://builds.apache.org/job/beam_PostCommit_Java_RunnableOnService_Flink/ws/runners/flink/runner/target/test-classes>
2017-03-14T15:04:59.094 [INFO] <https://builds.apache.org/job/beam_PostCommit_Java_RunnableOnService_Flink/ws/runners/flink/runner/src/test/java/org/apache/beam/runners/flink/streaming/DoFnOperatorTest.java>:
Some input files use unchecked or unsafe operations.
2017-03-14T15:04:59.094 [INFO] <https://builds.apache.org/job/beam_PostCommit_Java_RunnableOnService_Flink/ws/runners/flink/runner/src/test/java/org/apache/beam/runners/flink/streaming/DoFnOperatorTest.java>:
Recompile with -Xlint:unchecked for details.
2017-03-14T15:04:59.144 [INFO] 
2017-03-14T15:04:59.144 [INFO] --- maven-checkstyle-plugin:2.17:check (default) @ beam-runners-flink_2.10
---
2017-03-14T15:05:01.072 [INFO] Starting audit...
[ERROR] <https://builds.apache.org/job/beam_PostCommit_Java_RunnableOnService_Flink/ws/runners/flink/runner/src/main/java/org/apache/beam/runners/flink/FlinkStreamingTransformTranslators.java>:1114:
Trailing whitespace [RegexpSingleline]
Audit done.
2017-03-14T15:05:01.072 [INFO] There is 1 error reported by Checkstyle 6.19 with beam/checkstyle.xml
ruleset.
2017-03-14T15:05:01.073 [ERROR] src/main/java/org/apache/beam/runners/flink/FlinkStreamingTransformTranslators.java:[1114]
(regexp) RegexpSingleline: Trailing whitespace
[JENKINS] Archiving disabled
[JENKINS] Archiving disabled
[JENKINS] Archiving disabled
[JENKINS] Archiving disabled
[JENKINS] Archiving disabled
[JENKINS] Archiving disabled
[JENKINS] Archiving disabled
[JENKINS] Archiving disabled
[JENKINS] Archiving disabled
[JENKINS] Archiving disabled
[JENKINS] Archiving disabled
[JENKINS] Archiving disabled
[JENKINS] Archiving disabled
[JENKINS] Archiving disabled
2017-03-14T15:05:05.145 [INFO] ------------------------------------------------------------------------
2017-03-14T15:05:05.145 [INFO] Reactor Summary:
2017-03-14T15:05:05.145 [INFO] 
2017-03-14T15:05:05.145 [INFO] Apache Beam :: Parent .............................. SUCCESS
[ 17.962 s]
2017-03-14T15:05:05.145 [INFO] Apache Beam :: SDKs :: Java :: Build Tools ......... SUCCESS
[  9.075 s]
2017-03-14T15:05:05.145 [INFO] Apache Beam :: SDKs ................................ SUCCESS
[  0.913 s]
2017-03-14T15:05:05.145 [INFO] Apache Beam :: SDKs :: Common ...................... SUCCESS
[  0.771 s]
2017-03-14T15:05:05.145 [INFO] Apache Beam :: SDKs :: Common :: Fn API ............ SUCCESS
[  7.727 s]
2017-03-14T15:05:05.145 [INFO] Apache Beam :: SDKs :: Common :: Runner API ........ SUCCESS
[  2.909 s]
2017-03-14T15:05:05.145 [INFO] Apache Beam :: SDKs :: Java ........................ SUCCESS
[  0.791 s]
2017-03-14T15:05:05.145 [INFO] Apache Beam :: SDKs :: Java :: Core ................ SUCCESS
[01:57 min]
2017-03-14T15:05:05.145 [INFO] Apache Beam :: Runners ............................. SUCCESS
[  0.986 s]
2017-03-14T15:05:05.145 [INFO] Apache Beam :: Runners :: Core Java Construction ... SUCCESS
[  7.451 s]
2017-03-14T15:05:05.145 [INFO] Apache Beam :: Runners :: Core Java ................ SUCCESS
[ 35.603 s]
2017-03-14T15:05:05.145 [INFO] Apache Beam :: Runners :: Flink .................... SUCCESS
[  1.075 s]
2017-03-14T15:05:05.145 [INFO] Apache Beam :: Runners :: Flink :: Core ............ FAILURE
[ 19.048 s]
2017-03-14T15:05:05.145 [INFO] ------------------------------------------------------------------------
2017-03-14T15:05:05.145 [INFO] BUILD FAILURE
2017-03-14T15:05:05.145 [INFO] ------------------------------------------------------------------------
2017-03-14T15:05:05.145 [INFO] Total time: 04:41 min
2017-03-14T15:05:05.146 [INFO] Finished at: 2017-03-14T15:05:05+00:00
2017-03-14T15:05:05.791 [INFO] Final Memory: 125M/1643M
2017-03-14T15:05:05.791 [INFO] ------------------------------------------------------------------------
Waiting for Jenkins to finish collecting data
2017-03-14T15:05:09.338 [ERROR] Failed to execute goal org.apache.maven.plugins:maven-checkstyle-plugin:2.17:check
(default) on project beam-runners-flink_2.10: You have 1 Checkstyle violation. -> [Help
1]
org.apache.maven.lifecycle.LifecycleExecutionException: Failed to execute goal org.apache.maven.plugins:maven-checkstyle-plugin:2.17:check
(default) on project beam-runners-flink_2.10: You have 1 Checkstyle violation.
	at org.apache.maven.lifecycle.internal.MojoExecutor.execute(MojoExecutor.java:212)
	at org.apache.maven.lifecycle.internal.MojoExecutor.execute(MojoExecutor.java:153)
	at org.apache.maven.lifecycle.internal.MojoExecutor.execute(MojoExecutor.java:145)
	at org.apache.maven.lifecycle.internal.LifecycleModuleBuilder.buildProject(LifecycleModuleBuilder.java:116)
	at org.apache.maven.lifecycle.internal.LifecycleModuleBuilder.buildProject(LifecycleModuleBuilder.java:80)
	at org.apache.maven.lifecycle.internal.builder.singlethreaded.SingleThreadedBuilder.build(SingleThreadedBuilder.java:51)
	at org.apache.maven.lifecycle.internal.LifecycleStarter.execute(LifecycleStarter.java:128)
	at org.apache.maven.DefaultMaven.doExecute(DefaultMaven.java:307)
	at org.apache.maven.DefaultMaven.doExecute(DefaultMaven.java:193)
	at org.apache.maven.DefaultMaven.execute(DefaultMaven.java:106)
	at org.jvnet.hudson.maven3.launcher.Maven33Launcher.main(Maven33Launcher.java:129)
	at sun.reflect.NativeMethodAccessorImpl.invoke0(Native Method)
	at sun.reflect.NativeMethodAccessorImpl.invoke(NativeMethodAccessorImpl.java:62)
	at sun.reflect.DelegatingMethodAccessorImpl.invoke(DelegatingMethodAccessorImpl.java:43)
	at java.lang.reflect.Method.invoke(Method.java:498)
	at org.codehaus.plexus.classworlds.launcher.Launcher.launchStandard(Launcher.java:330)
	at org.codehaus.plexus.classworlds.launcher.Launcher.launch(Launcher.java:238)
	at jenkins.maven3.agent.Maven33Main.launch(Maven33Main.java:176)
	at sun.reflect.NativeMethodAccessorImpl.invoke0(Native Method)
	at sun.reflect.NativeMethodAccessorImpl.invoke(NativeMethodAccessorImpl.java:62)
	at sun.reflect.DelegatingMethodAccessorImpl.invoke(DelegatingMethodAccessorImpl.java:43)
	at java.lang.reflect.Method.invoke(Method.java:498)
	at hudson.maven.Maven3Builder.call(Maven3Builder.java:139)
	at hudson.maven.Maven3Builder.call(Maven3Builder.java:70)
	at hudson.remoting.UserRequest.perform(UserRequest.java:153)
	at hudson.remoting.UserRequest.perform(UserRequest.java:50)
	at hudson.remoting.Request$2.run(Request.java:336)
	at hudson.remoting.InterceptingExecutorService$1.call(InterceptingExecutorService.java:68)
	at java.util.concurrent.FutureTask.run(FutureTask.java:266)
	at java.util.concurrent.ThreadPoolExecutor.runWorker(ThreadPoolExecutor.java:1142)
	at java.util.concurrent.ThreadPoolExecutor$Worker.run(ThreadPoolExecutor.java:617)
	at java.lang.Thread.run(Thread.java:745)
Caused by: org.apache.maven.plugin.MojoFailureException: You have 1 Checkstyle violation.
	at org.apache.maven.plugin.checkstyle.CheckstyleViolationCheckMojo.execute(CheckstyleViolationCheckMojo.java:588)
	at org.apache.maven.plugin.DefaultBuildPluginManager.executeMojo(DefaultBuildPluginManager.java:134)
	at org.apache.maven.lifecycle.internal.MojoExecutor.execute(MojoExecutor.java:208)
	... 31 more
2017-03-14T15:05:09.339 [ERROR] 
2017-03-14T15:05:09.339 [ERROR] Re-run Maven using the -X switch to enable full debug logging.
2017-03-14T15:05:09.339 [ERROR] 
2017-03-14T15:05:09.340 [ERROR] For more information about the errors and possible solutions,
please read the following articles:
2017-03-14T15:05:09.340 [ERROR] [Help 1] http://cwiki.apache.org/confluence/display/MAVEN/MojoFailureException
2017-03-14T15:05:09.340 [ERROR] 
2017-03-14T15:05:09.340 [ERROR] After correcting the problems, you can resume the build with
the command
2017-03-14T15:05:09.340 [ERROR]   mvn <goals> -rf :beam-runners-flink_2.10
channel stopped

Mime
View raw message