beam-commits mailing list archives

Site index · List index
Message view « Date » · « Thread »
Top « Date » · « Thread »
From Apache Jenkins Server <jenk...@builds.apache.org>
Subject Build failed in Jenkins: beam_PostCommit_Java_Version_Test » JDK 1.8 (latest),beam #20
Date Wed, 15 Mar 2017 20:47:14 GMT
See <https://builds.apache.org/job/beam_PostCommit_Java_Version_Test/jdk=JDK%201.8%20(latest),label=beam/20/display/redirect?page=changes>

Changes:

[aljoscha.krettek] [BEAM-1689] Apply changes for Flink's StatefulDoFnRunner to the primary

[tgroh] Stop Double-finalizing checkpoints in the DirectRunner

[tgroh] Prevent Double-Close in UnboundedReadEvaluatorFactory

[altay] [BEAM-1694] Fix docstring inaccuracies in Python-SDK

[davor] [BEAM-1092] Shade commonly used libraries (e.g. Guava) to avoid class

[davor] [BEAM-1092] Replace hyphens in artifactId with dots in shading

[tgroh] Remove two unused fields

[tgroh] Condense BigQueryIO.Read.Bound into BigQueryIO.Read

[tgroh] Condense BigQueryIO.Write.Bound into BigQueryIO.Write

[tgroh] Makes NameUtils recognize AutoValue classes

[tgroh] Use AutoValue for BigQueryIO.Read

[tgroh] Use AutoValue for BigQueryIO.Write

[tgroh] Simplify configuration of StreamWithDedup

[tgroh] Replace BigQueryIO.Read.from() with BigQueryIO.read().from()

[tgroh] Replace BigQueryIO.Write.to() with BigQueryIO.write().to()

[jbonofre] [BEAM-1660] Update JdbcIO JavaDoc about withCoder() use to ensure the

[altay] [BEAM-547] Version should be accessed from pom file

[tgroh] Add Create.TimestampedValues.withType

[davor] Add ValueProvider options for DatastoreIO

[altay] Add ValueProvider class for FileBasedSource I/O Transforms

[davor] Increment shade-plugin version back to 3.0.0

------------------------------------------
[...truncated 1.62 MB...]
declare -x NODE_LABELS="beam beam5"
declare -x NODE_NAME="beam5"
declare -x OLDPWD
declare -x PATH="/home/jenkins/tools/java/latest1.8/bin:/usr/local/sbin:/usr/local/bin:/usr/sbin:/usr/bin:/sbin:/bin:/usr/games:/usr/local/games"
declare -x PWD="<https://builds.apache.org/job/beam_PostCommit_Java_Version_Test/jdk=JDK%201.8%20(latest),label=beam/ws/">
declare -x ROOT_BUILD_CAUSE="SCMTRIGGER"
declare -x ROOT_BUILD_CAUSE_SCMTRIGGER="true"
declare -x RUN_CHANGES_DISPLAY_URL="https://builds.apache.org/job/beam_PostCommit_Java_Version_Test/jdk=JDK%201.8%20(latest),label=beam/20/display/redirect?page=changes"
declare -x RUN_DISPLAY_URL="https://builds.apache.org/job/beam_PostCommit_Java_Version_Test/jdk=JDK%201.8%20(latest),label=beam/20/display/redirect"
declare -x SHELL="/bin/bash"
declare -x SHLVL="2"
declare -x SPARK_LOCAL_IP="127.0.0.1"
declare -x SSH_CLIENT="140.211.11.14 47418 22"
declare -x SSH_CONNECTION="140.211.11.14 47418 10.128.0.6 22"
declare -x USER="jenkins"
declare -x WORKSPACE="<https://builds.apache.org/job/beam_PostCommit_Java_Version_Test/jdk=JDK%201.8%20(latest),label=beam/ws/">
declare -x XDG_RUNTIME_DIR="/run/user/9997"
declare -x XDG_SESSION_ID="5"
declare -x XFILESEARCHPATH="/usr/dt/app-defaults/%L/Dt"
declare -x jdk="JDK 1.8 (latest)"
declare -x label="beam"
declare -x sha1="master"
[beam] $ /home/jenkins/tools/maven/apache-maven-3.3.3/bin/mvn -f pom.xml -Dsha1=master "-Djdk=JDK
1.8 (latest)" -Dlabel=beam "-Dmaven.repo.local=<https://builds.apache.org/job/beam_PostCommit_Java_Version_Test/jdk=JDK%201.8%20(latest),label=beam/ws/.repository">
-B -e -P dataflow-runner clean install -DskipITs=false '-DintegrationTestPipelineOptions=[
"--project=apache-beam-testing", "--tempRoot=gs://temp-storage-for-end-to-end-tests", "--runner=org.apache.beam.runners.dataflow.testing.TestDataflowRunner"
]'
/home/jenkins/tools/maven/apache-maven-3.3.3/bin/mvn: 200: local: 1.8: bad variable name
2017-03-15\T\20:45:01.476 [INFO] Error stacktraces are turned on.
2017-03-15\T\20:45:01.521 [INFO] Scanning for projects...
2017-03-15\T\20:45:01.834 [INFO] Downloading: https://repo.maven.apache.org/maven2/org/apache/apache/18/apache-18.pom
2017-03-15\T\20:45:02.114 [INFO] Downloaded: https://repo.maven.apache.org/maven2/org/apache/apache/18/apache-18.pom
(16 KB at 53.9 KB/sec)
2017-03-15\T\20:45:02.528 [INFO] Downloading: https://repo.maven.apache.org/maven2/kr/motd/maven/os-maven-plugin/1.4.0.Final/os-maven-plugin-1.4.0.Final.pom
2017-03-15\T\20:45:02.562 [INFO] Downloaded: https://repo.maven.apache.org/maven2/kr/motd/maven/os-maven-plugin/1.4.0.Final/os-maven-plugin-1.4.0.Final.pom
(7 KB at 177.8 KB/sec)
2017-03-15\T\20:45:02.566 [INFO] Downloading: https://repo.maven.apache.org/maven2/org/sonatype/oss/oss-parent/9/oss-parent-9.pom
2017-03-15\T\20:45:02.607 [INFO] Downloaded: https://repo.maven.apache.org/maven2/org/sonatype/oss/oss-parent/9/oss-parent-9.pom
(7 KB at 160.4 KB/sec)
2017-03-15\T\20:45:02.616 [INFO] Downloading: https://repo.maven.apache.org/maven2/org/apache/maven/maven-plugin-api/3.2.1/maven-plugin-api-3.2.1.pom
2017-03-15\T\20:45:02.649 [INFO] Downloaded: https://repo.maven.apache.org/maven2/org/apache/maven/maven-plugin-api/3.2.1/maven-plugin-api-3.2.1.pom
(4 KB at 100.1 KB/sec)
2017-03-15\T\20:45:02.651 [INFO] Downloading: https://repo.maven.apache.org/maven2/org/apache/maven/maven/3.2.1/maven-3.2.1.pom
2017-03-15\T\20:45:02.686 [INFO] Downloaded: https://repo.maven.apache.org/maven2/org/apache/maven/maven/3.2.1/maven-3.2.1.pom
(23 KB at 630.3 KB/sec)
2017-03-15\T\20:45:02.689 [INFO] Downloading: https://repo.maven.apache.org/maven2/org/apache/maven/maven-parent/23/maven-parent-23.pom
2017-03-15\T\20:45:02.728 [INFO] Downloaded: https://repo.maven.apache.org/maven2/org/apache/maven/maven-parent/23/maven-parent-23.pom
(32 KB at 816.0 KB/sec)
2017-03-15\T\20:45:02.732 [INFO] Downloading: https://repo.maven.apache.org/maven2/org/apache/apache/13/apache-13.pom
2017-03-15\T\20:45:02.761 [INFO] Downloaded: https://repo.maven.apache.org/maven2/org/apache/apache/13/apache-13.pom
(14 KB at 470.6 KB/sec)
2017-03-15\T\20:45:02.767 [INFO] Downloading: https://repo.maven.apache.org/maven2/org/apache/maven/maven-model/3.2.1/maven-model-3.2.1.pom
2017-03-15\T\20:45:02.797 [INFO] Downloaded: https://repo.maven.apache.org/maven2/org/apache/maven/maven-model/3.2.1/maven-model-3.2.1.pom
(5 KB at 134.8 KB/sec)
2017-03-15\T\20:45:02.801 [INFO] Downloading: https://repo.maven.apache.org/maven2/org/codehaus/plexus/plexus-utils/3.0.17/plexus-utils-3.0.17.pom
2017-03-15\T\20:45:02.828 [INFO] Downloaded: https://repo.maven.apache.org/maven2/org/codehaus/plexus/plexus-utils/3.0.17/plexus-utils-3.0.17.pom
(4 KB at 122.8 KB/sec)
2017-03-15\T\20:45:02.830 [INFO] Downloading: https://repo.maven.apache.org/maven2/org/codehaus/plexus/plexus/3.3.1/plexus-3.3.1.pom
2017-03-15\T\20:45:02.862 [INFO] Downloaded: https://repo.maven.apache.org/maven2/org/codehaus/plexus/plexus/3.3.1/plexus-3.3.1.pom
(20 KB at 624.0 KB/sec)
2017-03-15\T\20:45:02.864 [INFO] Downloading: https://repo.maven.apache.org/maven2/org/sonatype/spice/spice-parent/17/spice-parent-17.pom
2017-03-15\T\20:45:02.892 [INFO] Downloaded: https://repo.maven.apache.org/maven2/org/sonatype/spice/spice-parent/17/spice-parent-17.pom
(7 KB at 235.7 KB/sec)
2017-03-15\T\20:45:02.894 [INFO] Downloading: https://repo.maven.apache.org/maven2/org/sonatype/forge/forge-parent/10/forge-parent-10.pom
2017-03-15\T\20:45:02.923 [INFO] Downloaded: https://repo.maven.apache.org/maven2/org/sonatype/forge/forge-parent/10/forge-parent-10.pom
(14 KB at 456.6 KB/sec)
2017-03-15\T\20:45:02.927 [INFO] Downloading: https://repo.maven.apache.org/maven2/org/apache/maven/maven-artifact/3.2.1/maven-artifact-3.2.1.pom
2017-03-15\T\20:45:02.954 [INFO] Downloaded: https://repo.maven.apache.org/maven2/org/apache/maven/maven-artifact/3.2.1/maven-artifact-3.2.1.pom
(2 KB at 71.3 KB/sec)
2017-03-15\T\20:45:02.959 [INFO] Downloading: https://repo.maven.apache.org/maven2/org/eclipse/sisu/org.eclipse.sisu.plexus/0.0.0.M5/org.eclipse.sisu.plexus-0.0.0.M5.pom
2017-03-15\T\20:45:02.988 [INFO] Downloaded: https://repo.maven.apache.org/maven2/org/eclipse/sisu/org.eclipse.sisu.plexus/0.0.0.M5/org.eclipse.sisu.plexus-0.0.0.M5.pom
(5 KB at 162.6 KB/sec)
2017-03-15\T\20:45:02.990 [INFO] Downloading: https://repo.maven.apache.org/maven2/org/eclipse/sisu/sisu-plexus/0.0.0.M5/sisu-plexus-0.0.0.M5.pom
2017-03-15\T\20:45:03.021 [INFO] Downloaded: https://repo.maven.apache.org/maven2/org/eclipse/sisu/sisu-plexus/0.0.0.M5/sisu-plexus-0.0.0.M5.pom
(13 KB at 415.9 KB/sec)
2017-03-15\T\20:45:03.024 [INFO] Downloading: https://repo.maven.apache.org/maven2/org/sonatype/oss/oss-parent/7/oss-parent-7.pom
2017-03-15\T\20:45:03.053 [INFO] Downloaded: https://repo.maven.apache.org/maven2/org/sonatype/oss/oss-parent/7/oss-parent-7.pom
(5 KB at 168.2 KB/sec)
2017-03-15\T\20:45:03.056 [INFO] Downloading: https://repo.maven.apache.org/maven2/javax/enterprise/cdi-api/1.0/cdi-api-1.0.pom
2017-03-15\T\20:45:03.086 [INFO] Downloaded: https://repo.maven.apache.org/maven2/javax/enterprise/cdi-api/1.0/cdi-api-1.0.pom
(2 KB at 46.7 KB/sec)
2017-03-15\T\20:45:03.088 [INFO] Downloading: https://repo.maven.apache.org/maven2/org/jboss/weld/weld-api-parent/1.0/weld-api-parent-1.0.pom
2017-03-15\T\20:45:03.115 [INFO] Downloaded: https://repo.maven.apache.org/maven2/org/jboss/weld/weld-api-parent/1.0/weld-api-parent-1.0.pom
(3 KB at 85.2 KB/sec)
2017-03-15\T\20:45:03.118 [INFO] Downloading: https://repo.maven.apache.org/maven2/org/jboss/weld/weld-api-bom/1.0/weld-api-bom-1.0.pom
2017-03-15\T\20:45:03.146 [INFO] Downloaded: https://repo.maven.apache.org/maven2/org/jboss/weld/weld-api-bom/1.0/weld-api-bom-1.0.pom
(8 KB at 275.8 KB/sec)
2017-03-15\T\20:45:03.148 [INFO] Downloading: https://repo.maven.apache.org/maven2/org/jboss/weld/weld-parent/6/weld-parent-6.pom
2017-03-15\T\20:45:03.180 [INFO] Downloaded: https://repo.maven.apache.org/maven2/org/jboss/weld/weld-parent/6/weld-parent-6.pom
(21 KB at 631.5 KB/sec)
2017-03-15\T\20:45:03.184 [INFO] Downloading: https://repo.maven.apache.org/maven2/javax/annotation/jsr250-api/1.0/jsr250-api-1.0.pom
2017-03-15\T\20:45:03.211 [INFO] Downloaded: https://repo.maven.apache.org/maven2/javax/annotation/jsr250-api/1.0/jsr250-api-1.0.pom
(1023 B at 37.0 KB/sec)
2017-03-15\T\20:45:03.213 [INFO] Downloading: https://repo.maven.apache.org/maven2/javax/inject/javax.inject/1/javax.inject-1.pom
2017-03-15\T\20:45:03.240 [INFO] Downloaded: https://repo.maven.apache.org/maven2/javax/inject/javax.inject/1/javax.inject-1.pom
(612 B at 22.1 KB/sec)
2017-03-15\T\20:45:03.243 [INFO] Downloading: https://repo.maven.apache.org/maven2/com/google/guava/guava/10.0.1/guava-10.0.1.pom
2017-03-15\T\20:45:03.272 [INFO] Downloaded: https://repo.maven.apache.org/maven2/com/google/guava/guava/10.0.1/guava-10.0.1.pom
(6 KB at 181.3 KB/sec)
2017-03-15\T\20:45:03.274 [INFO] Downloading: https://repo.maven.apache.org/maven2/com/google/guava/guava-parent/10.0.1/guava-parent-10.0.1.pom
2017-03-15\T\20:45:03.302 [INFO] Downloaded: https://repo.maven.apache.org/maven2/com/google/guava/guava-parent/10.0.1/guava-parent-10.0.1.pom
(2 KB at 68.3 KB/sec)
2017-03-15\T\20:45:03.305 [INFO] Downloading: https://repo.maven.apache.org/maven2/com/google/code/findbugs/jsr305/1.3.9/jsr305-1.3.9.pom
2017-03-15\T\20:45:03.333 [INFO] Downloaded: https://repo.maven.apache.org/maven2/com/google/code/findbugs/jsr305/1.3.9/jsr305-1.3.9.pom
(965 B at 33.7 KB/sec)
2017-03-15\T\20:45:03.335 [INFO] Downloading: https://repo.maven.apache.org/maven2/org/sonatype/sisu/sisu-guice/3.1.0/sisu-guice-3.1.0.pom
2017-03-15\T\20:45:03.364 [INFO] Downloaded: https://repo.maven.apache.org/maven2/org/sonatype/sisu/sisu-guice/3.1.0/sisu-guice-3.1.0.pom
(10 KB at 341.8 KB/sec)
2017-03-15\T\20:45:03.366 [INFO] Downloading: https://repo.maven.apache.org/maven2/org/sonatype/sisu/inject/guice-parent/3.1.0/guice-parent-3.1.0.pom
2017-03-15\T\20:45:03.396 [INFO] Downloaded: https://repo.maven.apache.org/maven2/org/sonatype/sisu/inject/guice-parent/3.1.0/guice-parent-3.1.0.pom
(11 KB at 355.7 KB/sec)
2017-03-15\T\20:45:03.400 [INFO] Downloading: https://repo.maven.apache.org/maven2/aopalliance/aopalliance/1.0/aopalliance-1.0.pom
2017-03-15\T\20:45:03.429 [INFO] Downloaded: https://repo.maven.apache.org/maven2/aopalliance/aopalliance/1.0/aopalliance-1.0.pom
(363 B at 12.7 KB/sec)
2017-03-15\T\20:45:03.431 [INFO] Downloading: https://repo.maven.apache.org/maven2/org/eclipse/sisu/org.eclipse.sisu.inject/0.0.0.M5/org.eclipse.sisu.inject-0.0.0.M5.pom
2017-03-15\T\20:45:03.457 [INFO] Downloaded: https://repo.maven.apache.org/maven2/org/eclipse/sisu/org.eclipse.sisu.inject/0.0.0.M5/org.eclipse.sisu.inject-0.0.0.M5.pom
(3 KB at 94.7 KB/sec)
2017-03-15\T\20:45:03.459 [INFO] Downloading: https://repo.maven.apache.org/maven2/org/eclipse/sisu/sisu-inject/0.0.0.M5/sisu-inject-0.0.0.M5.pom
2017-03-15\T\20:45:03.491 [INFO] Downloaded: https://repo.maven.apache.org/maven2/org/eclipse/sisu/sisu-inject/0.0.0.M5/sisu-inject-0.0.0.M5.pom
(14 KB at 427.1 KB/sec)
2017-03-15\T\20:45:03.495 [INFO] Downloading: https://repo.maven.apache.org/maven2/org/codehaus/plexus/plexus-component-annotations/1.5.5/plexus-component-annotations-1.5.5.pom
2017-03-15\T\20:45:03.525 [INFO] Downloaded: https://repo.maven.apache.org/maven2/org/codehaus/plexus/plexus-component-annotations/1.5.5/plexus-component-annotations-1.5.5.pom
(815 B at 26.5 KB/sec)
2017-03-15\T\20:45:03.527 [INFO] Downloading: https://repo.maven.apache.org/maven2/org/codehaus/plexus/plexus-containers/1.5.5/plexus-containers-1.5.5.pom
2017-03-15\T\20:45:03.555 [INFO] Downloaded: https://repo.maven.apache.org/maven2/org/codehaus/plexus/plexus-containers/1.5.5/plexus-containers-1.5.5.pom
(5 KB at 147.9 KB/sec)
2017-03-15\T\20:45:03.558 [INFO] Downloading: https://repo.maven.apache.org/maven2/org/codehaus/plexus/plexus/2.0.7/plexus-2.0.7.pom
2017-03-15\T\20:45:03.592 [INFO] Downloaded: https://repo.maven.apache.org/maven2/org/codehaus/plexus/plexus/2.0.7/plexus-2.0.7.pom
(17 KB at 496.8 KB/sec)
2017-03-15\T\20:45:03.595 [INFO] Downloading: https://repo.maven.apache.org/maven2/org/codehaus/plexus/plexus-classworlds/2.4/plexus-classworlds-2.4.pom
2017-03-15\T\20:45:03.623 [INFO] Downloaded: https://repo.maven.apache.org/maven2/org/codehaus/plexus/plexus-classworlds/2.4/plexus-classworlds-2.4.pom
(4 KB at 135.4 KB/sec)
2017-03-15\T\20:45:03.626 [INFO] Downloading: https://repo.maven.apache.org/maven2/org/codehaus/plexus/plexus-utils/2.1/plexus-utils-2.1.pom
2017-03-15\T\20:45:03.661 [INFO] Downloaded: https://repo.maven.apache.org/maven2/org/codehaus/plexus/plexus-utils/2.1/plexus-utils-2.1.pom
(4 KB at 112.6 KB/sec)
2017-03-15\T\20:45:03.663 [INFO] Downloading: https://repo.maven.apache.org/maven2/org/sonatype/spice/spice-parent/16/spice-parent-16.pom
2017-03-15\T\20:45:03.691 [INFO] Downloaded: https://repo.maven.apache.org/maven2/org/sonatype/spice/spice-parent/16/spice-parent-16.pom
(9 KB at 291.5 KB/sec)
2017-03-15\T\20:45:03.693 [INFO] Downloading: https://repo.maven.apache.org/maven2/org/sonatype/forge/forge-parent/5/forge-parent-5.pom
2017-03-15\T\20:45:03.723 [INFO] Downloaded: https://repo.maven.apache.org/maven2/org/sonatype/forge/forge-parent/5/forge-parent-5.pom
(9 KB at 272.2 KB/sec)
2017-03-15\T\20:45:03.738 [INFO] Downloading: https://repo.maven.apache.org/maven2/kr/motd/maven/os-maven-plugin/1.4.0.Final/os-maven-plugin-1.4.0.Final.jar
2017-03-15\T\20:45:03.739 [INFO] Downloading: https://repo.maven.apache.org/maven2/org/apache/maven/maven-plugin-api/3.2.1/maven-plugin-api-3.2.1.jar
2017-03-15\T\20:45:03.739 [INFO] Downloading: https://repo.maven.apache.org/maven2/org/apache/maven/maven-model/3.2.1/maven-model-3.2.1.jar
2017-03-15\T\20:45:03.740 [INFO] Downloading: https://repo.maven.apache.org/maven2/org/apache/maven/maven-artifact/3.2.1/maven-artifact-3.2.1.jar
2017-03-15\T\20:45:03.741 [INFO] Downloading: https://repo.maven.apache.org/maven2/org/eclipse/sisu/org.eclipse.sisu.plexus/0.0.0.M5/org.eclipse.sisu.plexus-0.0.0.M5.jar
2017-03-15\T\20:45:03.773 [INFO] Downloaded: https://repo.maven.apache.org/maven2/kr/motd/maven/os-maven-plugin/1.4.0.Final/os-maven-plugin-1.4.0.Final.jar
(29 KB at 800.8 KB/sec)
2017-03-15\T\20:45:03.773 [INFO] Downloading: https://repo.maven.apache.org/maven2/javax/enterprise/cdi-api/1.0/cdi-api-1.0.jar
2017-03-15\T\20:45:03.814 [INFO] Downloaded: https://repo.maven.apache.org/maven2/javax/enterprise/cdi-api/1.0/cdi-api-1.0.jar
(44 KB at 600.8 KB/sec)
2017-03-15\T\20:45:03.814 [INFO] Downloading: https://repo.maven.apache.org/maven2/javax/annotation/jsr250-api/1.0/jsr250-api-1.0.jar
2017-03-15\T\20:45:03.826 [INFO] Downloaded: https://repo.maven.apache.org/maven2/org/apache/maven/maven-model/3.2.1/maven-model-3.2.1.jar
(157 KB at 1774.0 KB/sec)
2017-03-15\T\20:45:03.826 [INFO] Downloading: https://repo.maven.apache.org/maven2/javax/inject/javax.inject/1/javax.inject-1.jar
2017-03-15\T\20:45:03.852 [INFO] Downloaded: https://repo.maven.apache.org/maven2/javax/annotation/jsr250-api/1.0/jsr250-api-1.0.jar
(6 KB at 51.4 KB/sec)
2017-03-15\T\20:45:03.852 [INFO] Downloading: https://repo.maven.apache.org/maven2/com/google/guava/guava/10.0.1/guava-10.0.1.jar
2017-03-15\T\20:45:03.854 [INFO] Downloaded: https://repo.maven.apache.org/maven2/javax/inject/javax.inject/1/javax.inject-1.jar
(3 KB at 21.6 KB/sec)
2017-03-15\T\20:45:03.854 [INFO] Downloading: https://repo.maven.apache.org/maven2/com/google/code/findbugs/jsr305/1.3.9/jsr305-1.3.9.jar
2017-03-15\T\20:45:03.885 [INFO] Downloaded: https://repo.maven.apache.org/maven2/com/google/code/findbugs/jsr305/1.3.9/jsr305-1.3.9.jar
(33 KB at 223.9 KB/sec)
2017-03-15\T\20:45:03.885 [INFO] Downloading: https://repo.maven.apache.org/maven2/org/sonatype/sisu/sisu-guice/3.1.0/sisu-guice-3.1.0-no_aop.jar
2017-03-15\T\20:45:03.953 [INFO] Downloaded: https://repo.maven.apache.org/maven2/org/sonatype/sisu/sisu-guice/3.1.0/sisu-guice-3.1.0-no_aop.jar
(350 KB at 1646.5 KB/sec)
2017-03-15\T\20:45:03.954 [INFO] Downloading: https://repo.maven.apache.org/maven2/aopalliance/aopalliance/1.0/aopalliance-1.0.jar
2017-03-15\T\20:45:03.979 [INFO] Downloaded: https://repo.maven.apache.org/maven2/aopalliance/aopalliance/1.0/aopalliance-1.0.jar
(5 KB at 18.3 KB/sec)
2017-03-15\T\20:45:03.979 [INFO] Downloading: https://repo.maven.apache.org/maven2/org/eclipse/sisu/org.eclipse.sisu.inject/0.0.0.M5/org.eclipse.sisu.inject-0.0.0.M5.jar
2017-03-15\T\20:45:04.036 [INFO] Downloaded: https://repo.maven.apache.org/maven2/org/eclipse/sisu/org.eclipse.sisu.inject/0.0.0.M5/org.eclipse.sisu.inject-0.0.0.M5.jar
(285 KB at 964.6 KB/sec)
2017-03-15\T\20:45:04.036 [INFO] Downloading: https://repo.maven.apache.org/maven2/org/codehaus/plexus/plexus-component-annotations/1.5.5/plexus-component-annotations-1.5.5.jar
2017-03-15\T\20:45:04.063 [INFO] Downloaded: https://repo.maven.apache.org/maven2/org/codehaus/plexus/plexus-component-annotations/1.5.5/plexus-component-annotations-1.5.5.jar
(5 KB at 12.8 KB/sec)
2017-03-15\T\20:45:04.063 [INFO] Downloading: https://repo.maven.apache.org/maven2/org/codehaus/plexus/plexus-classworlds/2.4/plexus-classworlds-2.4.jar
2017-03-15\T\20:45:04.095 [INFO] Downloaded: https://repo.maven.apache.org/maven2/com/google/guava/guava/10.0.1/guava-10.0.1.jar
(1467 KB at 4142.3 KB/sec)
2017-03-15\T\20:45:04.095 [INFO] Downloaded: https://repo.maven.apache.org/maven2/org/codehaus/plexus/plexus-classworlds/2.4/plexus-classworlds-2.4.jar
(46 KB at 129.8 KB/sec)
2017-03-15\T\20:45:04.095 [INFO] Downloading: https://repo.maven.apache.org/maven2/org/codehaus/plexus/plexus-utils/3.0.17/plexus-utils-3.0.17.jar
2017-03-15\T\20:45:04.147 [INFO] Downloaded: https://repo.maven.apache.org/maven2/org/codehaus/plexus/plexus-utils/3.0.17/plexus-utils-3.0.17.jar
(246 KB at 607.1 KB/sec)
2017-03-15\T\20:47:11.022 [ERROR] [ERROR] Some problems were encountered while processing
the POMs:
[WARNING] 'build.pluginManagement.plugins.plugin.(groupId:artifactId)' must be unique but
found duplicate declaration of plugin org.codehaus.mojo:build-helper-maven-plugin @ line 1459,
column 17
[ERROR] Unresolveable build extension: Plugin kr.motd.maven:os-maven-plugin:1.4.0.Final or
one of its dependencies could not be resolved: The following artifacts could not be resolved:
org.apache.maven:maven-plugin-api:jar:3.2.1, org.apache.maven:maven-artifact:jar:3.2.1, org.eclipse.sisu:org.eclipse.sisu.plexus:jar:0.0.0.M5:
Could not transfer artifact org.apache.maven:maven-plugin-api:jar:3.2.1 from/to central (https://repo.maven.apache.org/maven2):
Connect to repo.maven.apache.org:443 [repo.maven.apache.org/151.101.44.215] failed: Connection
timed out (Connection timed out) @ 
 @ 
2017-03-15\T\20:47:11.023 [ERROR] The build could not read 1 project -> [Help 1]
org.apache.maven.project.ProjectBuildingException: Some problems were encountered while processing
the POMs:
[WARNING] 'build.pluginManagement.plugins.plugin.(groupId:artifactId)' must be unique but
found duplicate declaration of plugin org.codehaus.mojo:build-helper-maven-plugin @ line 1459,
column 17
[ERROR] Unresolveable build extension: Plugin kr.motd.maven:os-maven-plugin:1.4.0.Final or
one of its dependencies could not be resolved: The following artifacts could not be resolved:
org.apache.maven:maven-plugin-api:jar:3.2.1, org.apache.maven:maven-artifact:jar:3.2.1, org.eclipse.sisu:org.eclipse.sisu.plexus:jar:0.0.0.M5:
Could not transfer artifact org.apache.maven:maven-plugin-api:jar:3.2.1 from/to central (https://repo.maven.apache.org/maven2):
Connect to repo.maven.apache.org:443 [repo.maven.apache.org/151.101.44.215] failed: Connection
timed out (Connection timed out) @ 

	at org.apache.maven.project.DefaultProjectBuilder.build(DefaultProjectBuilder.java:422)
	at org.apache.maven.graph.DefaultGraphBuilder.collectProjects(DefaultGraphBuilder.java:419)
	at org.apache.maven.graph.DefaultGraphBuilder.getProjectsForMavenReactor(DefaultGraphBuilder.java:410)
	at org.apache.maven.graph.DefaultGraphBuilder.build(DefaultGraphBuilder.java:83)
	at org.apache.maven.DefaultMaven.buildGraph(DefaultMaven.java:491)
	at org.apache.maven.DefaultMaven.doExecute(DefaultMaven.java:219)
	at org.apache.maven.DefaultMaven.doExecute(DefaultMaven.java:193)
	at org.apache.maven.DefaultMaven.execute(DefaultMaven.java:106)
	at org.apache.maven.cli.MavenCli.execute(MavenCli.java:862)
	at org.apache.maven.cli.MavenCli.doMain(MavenCli.java:286)
	at org.apache.maven.cli.MavenCli.main(MavenCli.java:197)
	at sun.reflect.NativeMethodAccessorImpl.invoke0(Native Method)
	at sun.reflect.NativeMethodAccessorImpl.invoke(NativeMethodAccessorImpl.java:62)
	at sun.reflect.DelegatingMethodAccessorImpl.invoke(DelegatingMethodAccessorImpl.java:43)
	at java.lang.reflect.Method.invoke(Method.java:498)
	at org.codehaus.plexus.classworlds.launcher.Launcher.launchEnhanced(Launcher.java:289)
	at org.codehaus.plexus.classworlds.launcher.Launcher.launch(Launcher.java:229)
	at org.codehaus.plexus.classworlds.launcher.Launcher.mainWithExitCode(Launcher.java:415)
	at org.codehaus.plexus.classworlds.launcher.Launcher.main(Launcher.java:356)
2017-03-15\T\20:47:11.023 [ERROR]   
2017-03-15\T\20:47:11.024 [ERROR]   The project org.apache.beam:beam-parent:0.7.0-SNAPSHOT
(<https://builds.apache.org/job/beam_PostCommit_Java_Version_Test/jdk=JDK%201.8%20(latest),label=beam/ws/pom.xml)>
has 1 error
2017-03-15\T\20:47:11.024 [ERROR]     Unresolveable build extension: Plugin kr.motd.maven:os-maven-plugin:1.4.0.Final
or one of its dependencies could not be resolved: The following artifacts could not be resolved:
org.apache.maven:maven-plugin-api:jar:3.2.1, org.apache.maven:maven-artifact:jar:3.2.1, org.eclipse.sisu:org.eclipse.sisu.plexus:jar:0.0.0.M5:
Could not transfer artifact org.apache.maven:maven-plugin-api:jar:3.2.1 from/to central (https://repo.maven.apache.org/maven2):
Connect to repo.maven.apache.org:443 [repo.maven.apache.org/151.101.44.215] failed: Connection
timed out (Connection timed out) -> [Help 2]
org.apache.maven.plugin.PluginManagerException: Plugin kr.motd.maven:os-maven-plugin:1.4.0.Final
or one of its dependencies could not be resolved: The following artifacts could not be resolved:
org.apache.maven:maven-plugin-api:jar:3.2.1, org.apache.maven:maven-artifact:jar:3.2.1, org.eclipse.sisu:org.eclipse.sisu.plexus:jar:0.0.0.M5:
Could not transfer artifact org.apache.maven:maven-plugin-api:jar:3.2.1 from/to central (https://repo.maven.apache.org/maven2):
Connect to repo.maven.apache.org:443 [repo.maven.apache.org/151.101.44.215] failed: Connection
timed out (Connection timed out)
	at org.apache.maven.plugin.internal.DefaultMavenPluginManager.setupExtensionsRealm(DefaultMavenPluginManager.java:874)
	at org.apache.maven.project.DefaultProjectBuildingHelper.createProjectRealm(DefaultProjectBuildingHelper.java:196)
	at org.apache.maven.project.DefaultModelBuildingListener.buildExtensionsAssembled(DefaultModelBuildingListener.java:111)
	at org.apache.maven.model.building.ModelBuildingEventCatapult$1.fire(ModelBuildingEventCatapult.java:44)
	at org.apache.maven.model.building.DefaultModelBuilder.fireEvent(DefaultModelBuilder.java:1270)
	at org.apache.maven.model.building.DefaultModelBuilder.build(DefaultModelBuilder.java:437)
	at org.apache.maven.model.building.DefaultModelBuilder.build(DefaultModelBuilder.java:417)
	at org.apache.maven.project.DefaultProjectBuilder.build(DefaultProjectBuilder.java:620)
	at org.apache.maven.project.DefaultProjectBuilder.build(DefaultProjectBuilder.java:411)
	at org.apache.maven.graph.DefaultGraphBuilder.collectProjects(DefaultGraphBuilder.java:419)
	at org.apache.maven.graph.DefaultGraphBuilder.getProjectsForMavenReactor(DefaultGraphBuilder.java:410)
	at org.apache.maven.graph.DefaultGraphBuilder.build(DefaultGraphBuilder.java:83)
	at org.apache.maven.DefaultMaven.buildGraph(DefaultMaven.java:491)
	at org.apache.maven.DefaultMaven.doExecute(DefaultMaven.java:219)
	at org.apache.maven.DefaultMaven.doExecute(DefaultMaven.java:193)
	at org.apache.maven.DefaultMaven.execute(DefaultMaven.java:106)
	at org.apache.maven.cli.MavenCli.execute(MavenCli.java:862)
	at org.apache.maven.cli.MavenCli.doMain(MavenCli.java:286)
	at org.apache.maven.cli.MavenCli.main(MavenCli.java:197)
	at sun.reflect.NativeMethodAccessorImpl.invoke0(Native Method)
	at sun.reflect.NativeMethodAccessorImpl.invoke(NativeMethodAccessorImpl.java:62)
	at sun.reflect.DelegatingMethodAccessorImpl.invoke(DelegatingMethodAccessorImpl.java:43)
	at java.lang.reflect.Method.invoke(Method.java:498)
	at org.codehaus.plexus.classworlds.launcher.Launcher.launchEnhanced(Launcher.java:289)
	at org.codehaus.plexus.classworlds.launcher.Launcher.launch(Launcher.java:229)
	at org.codehaus.plexus.classworlds.launcher.Launcher.mainWithExitCode(Launcher.java:415)
	at org.codehaus.plexus.classworlds.launcher.Launcher.main(Launcher.java:356)
Caused by: org.apache.maven.plugin.PluginResolutionException: Plugin kr.motd.maven:os-maven-plugin:1.4.0.Final
or one of its dependencies could not be resolved: The following artifacts could not be resolved:
org.apache.maven:maven-plugin-api:jar:3.2.1, org.apache.maven:maven-artifact:jar:3.2.1, org.eclipse.sisu:org.eclipse.sisu.plexus:jar:0.0.0.M5:
Could not transfer artifact org.apache.maven:maven-plugin-api:jar:3.2.1 from/to central (https://repo.maven.apache.org/maven2):
Connect to repo.maven.apache.org:443 [repo.maven.apache.org/151.101.44.215] failed: Connection
timed out (Connection timed out)
	at org.apache.maven.plugin.internal.DefaultPluginDependenciesResolver.resolveInternal(DefaultPluginDependenciesResolver.java:218)
	at org.apache.maven.plugin.internal.DefaultPluginDependenciesResolver.resolve(DefaultPluginDependenciesResolver.java:149)
	at org.apache.maven.plugin.internal.DefaultMavenPluginManager.resolveExtensionArtifacts(DefaultMavenPluginManager.java:940)
	at org.apache.maven.plugin.internal.DefaultMavenPluginManager.setupExtensionsRealm(DefaultMavenPluginManager.java:867)
	... 26 more
Caused by: org.eclipse.aether.resolution.ArtifactResolutionException: The following artifacts
could not be resolved: org.apache.maven:maven-plugin-api:jar:3.2.1, org.apache.maven:maven-artifact:jar:3.2.1,
org.eclipse.sisu:org.eclipse.sisu.plexus:jar:0.0.0.M5: Could not transfer artifact org.apache.maven:maven-plugin-api:jar:3.2.1
from/to central (https://repo.maven.apache.org/maven2): Connect to repo.maven.apache.org:443
[repo.maven.apache.org/151.101.44.215] failed: Connection timed out (Connection timed out)
	at org.eclipse.aether.internal.impl.DefaultArtifactResolver.resolve(DefaultArtifactResolver.java:444)
	at org.eclipse.aether.internal.impl.DefaultArtifactResolver.resolveArtifacts(DefaultArtifactResolver.java:246)
	at org.eclipse.aether.internal.impl.DefaultRepositorySystem.resolveDependencies(DefaultRepositorySystem.java:367)
	at org.apache.maven.plugin.internal.DefaultPluginDependenciesResolver.resolveInternal(DefaultPluginDependenciesResolver.java:210)
	... 29 more
Caused by: org.eclipse.aether.transfer.ArtifactTransferException: Could not transfer artifact
org.apache.maven:maven-plugin-api:jar:3.2.1 from/to central (https://repo.maven.apache.org/maven2):
Connect to repo.maven.apache.org:443 [repo.maven.apache.org/151.101.44.215] failed: Connection
timed out (Connection timed out)
	at org.eclipse.aether.connector.basic.ArtifactTransportListener.transferFailed(ArtifactTransportListener.java:43)
	at org.eclipse.aether.connector.basic.BasicRepositoryConnector$TaskRunner.run(BasicRepositoryConnector.java:355)
	at org.eclipse.aether.util.concurrency.RunnableErrorForwarder$1.run(RunnableErrorForwarder.java:67)
	at java.util.concurrent.ThreadPoolExecutor.runWorker(ThreadPoolExecutor.java:1142)
	at java.util.concurrent.ThreadPoolExecutor$Worker.run(ThreadPoolExecutor.java:617)
	at java.lang.Thread.run(Thread.java:745)
Caused by: org.apache.maven.wagon.TransferFailedException: Connect to repo.maven.apache.org:443
[repo.maven.apache.org/151.101.44.215] failed: Connection timed out (Connection timed out)
	at org.apache.maven.wagon.providers.http.AbstractHttpClientWagon.fillInputData(AbstractHttpClientWagon.java:1066)
	at org.apache.maven.wagon.providers.http.AbstractHttpClientWagon.fillInputData(AbstractHttpClientWagon.java:960)
	at org.apache.maven.wagon.StreamWagon.getInputStream(StreamWagon.java:116)
	at org.apache.maven.wagon.StreamWagon.getIfNewer(StreamWagon.java:88)
	at org.apache.maven.wagon.StreamWagon.get(StreamWagon.java:61)
	at org.eclipse.aether.transport.wagon.WagonTransporter$GetTaskRunner.run(WagonTransporter.java:560)
	at org.eclipse.aether.transport.wagon.WagonTransporter.execute(WagonTransporter.java:427)
	at org.eclipse.aether.transport.wagon.WagonTransporter.get(WagonTransporter.java:404)
	at org.eclipse.aether.connector.basic.BasicRepositoryConnector$GetTaskRunner.runTask(BasicRepositoryConnector.java:447)
	at org.eclipse.aether.connector.basic.BasicRepositoryConnector$TaskRunner.run(BasicRepositoryConnector.java:350)
	... 4 more
Caused by: org.apache.maven.wagon.providers.http.httpclient.conn.HttpHostConnectException:
Connect to repo.maven.apache.org:443 [repo.maven.apache.org/151.101.44.215] failed: Connection
timed out (Connection timed out)
	at org.apache.maven.wagon.providers.http.httpclient.impl.conn.HttpClientConnectionOperator.connect(HttpClientConnectionOperator.java:140)
	at org.apache.maven.wagon.providers.http.httpclient.impl.conn.PoolingHttpClientConnectionManager.connect(PoolingHttpClientConnectionManager.java:318)
	at org.apache.maven.wagon.providers.http.httpclient.impl.execchain.MainClientExec.establishRoute(MainClientExec.java:363)
	at org.apache.maven.wagon.providers.http.httpclient.impl.execchain.MainClientExec.execute(MainClientExec.java:219)
	at org.apache.maven.wagon.providers.http.httpclient.impl.execchain.ProtocolExec.execute(ProtocolExec.java:195)
	at org.apache.maven.wagon.providers.http.httpclient.impl.execchain.RetryExec.execute(RetryExec.java:86)
	at org.apache.maven.wagon.providers.http.httpclient.impl.execchain.RedirectExec.execute(RedirectExec.java:108)
	at org.apache.maven.wagon.providers.http.httpclient.impl.client.InternalHttpClient.doExecute(InternalHttpClient.java:184)
	at org.apache.maven.wagon.providers.http.httpclient.impl.client.CloseableHttpClient.execute(CloseableHttpClient.java:82)
	at org.apache.maven.wagon.providers.http.AbstractHttpClientWagon.execute(AbstractHttpClientWagon.java:832)
	at org.apache.maven.wagon.providers.http.AbstractHttpClientWagon.fillInputData(AbstractHttpClientWagon.java:983)
	... 13 more
Caused by: java.net.ConnectException: Connection timed out (Connection timed out)
	at java.net.PlainSocketImpl.socketConnect(Native Method)
	at java.net.AbstractPlainSocketImpl.doConnect(AbstractPlainSocketImpl.java:350)
	at java.net.AbstractPlainSocketImpl.connectToAddress(AbstractPlainSocketImpl.java:206)
	at java.net.AbstractPlainSocketImpl.connect(AbstractPlainSocketImpl.java:188)
	at java.net.SocksSocketImpl.connect(SocksSocketImpl.java:392)
	at java.net.Socket.connect(Socket.java:589)
	at org.apache.maven.wagon.providers.http.httpclient.conn.ssl.SSLConnectionSocketFactory.connectSocket(SSLConnectionSocketFactory.java:239)
	at org.apache.maven.wagon.providers.http.httpclient.impl.conn.HttpClientConnectionOperator.connect(HttpClientConnectionOperator.java:123)
	... 23 more
2017-03-15\T\20:47:11.025 [ERROR] 
2017-03-15\T\20:47:11.025 [ERROR] Re-run Maven using the -X switch to enable full debug logging.
2017-03-15\T\20:47:11.025 [ERROR] 
2017-03-15\T\20:47:11.025 [ERROR] For more information about the errors and possible solutions,
please read the following articles:
2017-03-15\T\20:47:11.025 [ERROR] [Help 1] http://cwiki.apache.org/confluence/display/MAVEN/ProjectBuildingException
2017-03-15\T\20:47:11.025 [ERROR] [Help 2] http://cwiki.apache.org/confluence/display/MAVEN/PluginManagerException
Build step 'Invoke top-level Maven targets' marked build as failure

Mime
View raw message