beam-commits mailing list archives

Site index · List index
Message view « Date » · « Thread »
Top « Date » · « Thread »
From Apache Jenkins Server <jenk...@builds.apache.org>
Subject Build failed in Jenkins: beam_PostCommit_Java_RunnableOnService_Flink #2022
Date Wed, 22 Mar 2017 21:37:09 GMT
See <https://builds.apache.org/job/beam_PostCommit_Java_RunnableOnService_Flink/2022/display/redirect?page=changes>

Changes:

[chamikara] BeamFileSystem implementation instead of IOChannelFactory

------------------------------------------
[...truncated 661.80 KB...]
Running org.apache.beam.runners.core.construction.UnsupportedOverrideFactoryTest
Tests run: 3, Failures: 0, Errors: 0, Skipped: 0, Time elapsed: 0.017 sec - in org.apache.beam.runners.core.construction.UnsupportedOverrideFactoryTest
Running org.apache.beam.runners.core.construction.PTransformMatchersTest
Tests run: 18, Failures: 0, Errors: 0, Skipped: 0, Time elapsed: 0.146 sec - in org.apache.beam.runners.core.construction.PTransformMatchersTest
Running org.apache.beam.runners.core.construction.ReplacementOutputsTest
Tests run: 10, Failures: 0, Errors: 0, Skipped: 0, Time elapsed: 0.044 sec - in org.apache.beam.runners.core.construction.ReplacementOutputsTest
Running org.apache.beam.runners.core.construction.ForwardingPTransformTest
Tests run: 5, Failures: 0, Errors: 0, Skipped: 0, Time elapsed: 0.16 sec - in org.apache.beam.runners.core.construction.ForwardingPTransformTest

Results :

Tests run: 40, Failures: 0, Errors: 0, Skipped: 0

[JENKINS] Recording test results
2017-03-22T21:36:44.552 [INFO] 
2017-03-22T21:36:44.552 [INFO] --- build-helper-maven-plugin:3.0.0:regex-properties (render-artifact-id)
@ beam-runners-core-construction-java ---
2017-03-22T21:36:44.692 [INFO] 
2017-03-22T21:36:44.693 [INFO] --- maven-jar-plugin:3.0.2:jar (default-jar) @ beam-runners-core-construction-java
---
2017-03-22T21:36:44.699 [INFO] Building jar: <https://builds.apache.org/job/beam_PostCommit_Java_RunnableOnService_Flink/ws/runners/core-construction-java/target/beam-runners-core-construction-java-0.7.0-SNAPSHOT.jar>
2017-03-22T21:36:44.845 [INFO] 
2017-03-22T21:36:44.845 [INFO] --- maven-site-plugin:3.5.1:attach-descriptor (attach-descriptor)
@ beam-runners-core-construction-java ---
2017-03-22T21:36:44.896 [INFO] 
2017-03-22T21:36:44.896 [INFO] --- maven-shade-plugin:3.0.0:shade (bundle-and-repackage) @
beam-runners-core-construction-java ---
2017-03-22T21:36:44.899 [INFO] Excluding org.apache.beam:beam-sdks-java-core:jar:0.7.0-SNAPSHOT
from the shaded jar.
2017-03-22T21:36:44.899 [INFO] Excluding org.apache.beam:beam-sdks-common-runner-api:jar:0.7.0-SNAPSHOT
from the shaded jar.
2017-03-22T21:36:44.899 [INFO] Excluding io.grpc:grpc-auth:jar:1.0.1 from the shaded jar.
2017-03-22T21:36:44.899 [INFO] Excluding io.grpc:grpc-core:jar:1.0.1 from the shaded jar.
2017-03-22T21:36:44.899 [INFO] Excluding io.grpc:grpc-context:jar:1.0.1 from the shaded jar.
2017-03-22T21:36:44.899 [INFO] Excluding io.grpc:grpc-netty:jar:1.0.1 from the shaded jar.
2017-03-22T21:36:44.899 [INFO] Excluding io.netty:netty-codec-http2:jar:4.1.3.Final from the
shaded jar.
2017-03-22T21:36:44.899 [INFO] Excluding io.netty:netty-codec-http:jar:4.1.3.Final from the
shaded jar.
2017-03-22T21:36:44.899 [INFO] Excluding io.grpc:grpc-stub:jar:1.0.1 from the shaded jar.
2017-03-22T21:36:44.899 [INFO] Excluding io.grpc:grpc-all:jar:1.0.1 from the shaded jar.
2017-03-22T21:36:44.899 [INFO] Excluding io.grpc:grpc-protobuf:jar:1.0.1 from the shaded jar.
2017-03-22T21:36:44.899 [INFO] Excluding com.google.protobuf:protobuf-java-util:jar:3.0.0
from the shaded jar.
2017-03-22T21:36:44.899 [INFO] Excluding com.google.code.gson:gson:jar:2.3 from the shaded
jar.
2017-03-22T21:36:44.899 [INFO] Excluding io.grpc:grpc-protobuf-nano:jar:1.0.1 from the shaded
jar.
2017-03-22T21:36:44.899 [INFO] Excluding com.google.protobuf.nano:protobuf-javanano:jar:3.0.0-alpha-5
from the shaded jar.
2017-03-22T21:36:44.899 [INFO] Excluding io.grpc:grpc-okhttp:jar:1.0.1 from the shaded jar.
2017-03-22T21:36:44.900 [INFO] Excluding com.squareup.okio:okio:jar:1.6.0 from the shaded
jar.
2017-03-22T21:36:44.900 [INFO] Excluding com.squareup.okhttp:okhttp:jar:2.5.0 from the shaded
jar.
2017-03-22T21:36:44.900 [INFO] Excluding io.grpc:grpc-protobuf-lite:jar:1.0.1 from the shaded
jar.
2017-03-22T21:36:44.900 [INFO] Excluding com.google.protobuf:protobuf-lite:jar:3.0.1 from
the shaded jar.
2017-03-22T21:36:44.900 [INFO] Excluding com.google.auth:google-auth-library-credentials:jar:0.6.0
from the shaded jar.
2017-03-22T21:36:44.900 [INFO] Excluding com.google.auth:google-auth-library-oauth2-http:jar:0.6.0
from the shaded jar.
2017-03-22T21:36:44.900 [INFO] Excluding io.netty:netty-handler:jar:4.1.6.Final from the shaded
jar.
2017-03-22T21:36:44.900 [INFO] Excluding io.netty:netty-buffer:jar:4.1.6.Final from the shaded
jar.
2017-03-22T21:36:44.900 [INFO] Excluding io.netty:netty-common:jar:4.1.6.Final from the shaded
jar.
2017-03-22T21:36:44.900 [INFO] Excluding io.netty:netty-transport:jar:4.1.6.Final from the
shaded jar.
2017-03-22T21:36:44.900 [INFO] Excluding io.netty:netty-resolver:jar:4.1.6.Final from the
shaded jar.
2017-03-22T21:36:44.900 [INFO] Excluding io.netty:netty-codec:jar:4.1.6.Final from the shaded
jar.
2017-03-22T21:36:44.900 [INFO] Excluding com.google.api.grpc:grpc-google-pubsub-v1:jar:0.1.0
from the shaded jar.
2017-03-22T21:36:44.900 [INFO] Excluding com.google.api.grpc:grpc-google-common-protos:jar:0.1.0
from the shaded jar.
2017-03-22T21:36:44.900 [INFO] Excluding com.google.api.grpc:grpc-google-iam-v1:jar:0.1.0
from the shaded jar.
2017-03-22T21:36:44.900 [INFO] Excluding com.google.api-client:google-api-client:jar:1.22.0
from the shaded jar.
2017-03-22T21:36:44.900 [INFO] Excluding com.google.apis:google-api-services-bigquery:jar:v2-rev295-1.22.0
from the shaded jar.
2017-03-22T21:36:44.900 [INFO] Excluding com.google.apis:google-api-services-cloudresourcemanager:jar:v1-rev6-1.22.0
from the shaded jar.
2017-03-22T21:36:44.900 [INFO] Excluding com.google.apis:google-api-services-pubsub:jar:v1-rev10-1.22.0
from the shaded jar.
2017-03-22T21:36:44.900 [INFO] Excluding com.google.apis:google-api-services-storage:jar:v1-rev71-1.22.0
from the shaded jar.
2017-03-22T21:36:44.900 [INFO] Excluding com.google.http-client:google-http-client:jar:1.22.0
from the shaded jar.
2017-03-22T21:36:44.900 [INFO] Excluding org.apache.httpcomponents:httpclient:jar:4.0.1 from
the shaded jar.
2017-03-22T21:36:44.900 [INFO] Excluding org.apache.httpcomponents:httpcore:jar:4.0.1 from
the shaded jar.
2017-03-22T21:36:44.900 [INFO] Excluding commons-logging:commons-logging:jar:1.1.1 from the
shaded jar.
2017-03-22T21:36:44.900 [INFO] Excluding commons-codec:commons-codec:jar:1.3 from the shaded
jar.
2017-03-22T21:36:44.900 [INFO] Excluding com.google.http-client:google-http-client-jackson:jar:1.22.0
from the shaded jar.
2017-03-22T21:36:44.900 [INFO] Excluding com.google.http-client:google-http-client-jackson2:jar:1.22.0
from the shaded jar.
2017-03-22T21:36:44.900 [INFO] Excluding com.google.http-client:google-http-client-protobuf:jar:1.22.0
from the shaded jar.
2017-03-22T21:36:44.900 [INFO] Excluding com.google.oauth-client:google-oauth-client:jar:1.22.0
from the shaded jar.
2017-03-22T21:36:44.900 [INFO] Excluding com.google.cloud.bigdataoss:gcsio:jar:1.4.5 from
the shaded jar.
2017-03-22T21:36:44.900 [INFO] Excluding com.google.api-client:google-api-client-java6:jar:1.22.0
from the shaded jar.
2017-03-22T21:36:44.900 [INFO] Excluding com.google.api-client:google-api-client-jackson2:jar:1.22.0
from the shaded jar.
2017-03-22T21:36:44.900 [INFO] Excluding com.google.oauth-client:google-oauth-client-java6:jar:1.22.0
from the shaded jar.
2017-03-22T21:36:44.900 [INFO] Excluding com.google.cloud.bigdataoss:util:jar:1.4.5 from the
shaded jar.
2017-03-22T21:36:44.901 [INFO] Excluding com.google.protobuf:protobuf-java:jar:3.1.0 from
the shaded jar.
2017-03-22T21:36:44.901 [INFO] Excluding com.google.code.findbugs:jsr305:jar:3.0.1 from the
shaded jar.
2017-03-22T21:36:44.901 [INFO] Excluding com.fasterxml.jackson.core:jackson-core:jar:2.7.2
from the shaded jar.
2017-03-22T21:36:44.901 [INFO] Excluding com.fasterxml.jackson.core:jackson-annotations:jar:2.7.2
from the shaded jar.
2017-03-22T21:36:44.901 [INFO] Excluding com.fasterxml.jackson.core:jackson-databind:jar:2.7.2
from the shaded jar.
2017-03-22T21:36:44.901 [INFO] Excluding org.slf4j:slf4j-api:jar:1.7.14 from the shaded jar.
2017-03-22T21:36:44.901 [INFO] Excluding net.bytebuddy:byte-buddy:jar:1.6.8 from the shaded
jar.
2017-03-22T21:36:44.901 [INFO] Excluding org.apache.avro:avro:jar:1.8.1 from the shaded jar.
2017-03-22T21:36:44.901 [INFO] Excluding org.codehaus.jackson:jackson-core-asl:jar:1.9.13
from the shaded jar.
2017-03-22T21:36:44.901 [INFO] Excluding org.codehaus.jackson:jackson-mapper-asl:jar:1.9.13
from the shaded jar.
2017-03-22T21:36:44.901 [INFO] Excluding com.thoughtworks.paranamer:paranamer:jar:2.7 from
the shaded jar.
2017-03-22T21:36:44.901 [INFO] Excluding org.tukaani:xz:jar:1.5 from the shaded jar.
2017-03-22T21:36:44.901 [INFO] Excluding org.xerial.snappy:snappy-java:jar:1.1.2.1 from the
shaded jar.
2017-03-22T21:36:44.901 [INFO] Excluding org.apache.commons:commons-compress:jar:1.9 from
the shaded jar.
2017-03-22T21:36:44.901 [INFO] Excluding org.apache.commons:commons-lang3:jar:3.5 from the
shaded jar.
2017-03-22T21:36:44.901 [INFO] Excluding joda-time:joda-time:jar:2.4 from the shaded jar.
2017-03-22T21:36:44.901 [INFO] Including com.google.guava:guava:jar:20.0 in the shaded jar.
2017-03-22T21:36:46.077 [INFO] Replacing original artifact with shaded artifact.
2017-03-22T21:36:46.077 [INFO] Replacing <https://builds.apache.org/job/beam_PostCommit_Java_RunnableOnService_Flink/ws/runners/core-construction-java/target/beam-runners-core-construction-java-0.7.0-SNAPSHOT.jar>
with <https://builds.apache.org/job/beam_PostCommit_Java_RunnableOnService_Flink/ws/runners/core-construction-java/target/beam-runners-core-construction-java-0.7.0-SNAPSHOT-shaded.jar>
2017-03-22T21:36:46.077 [INFO] Dependency-reduced POM written at: <https://builds.apache.org/job/beam_PostCommit_Java_RunnableOnService_Flink/ws/runners/core-construction-java/dependency-reduced-pom.xml>
2017-03-22T21:36:46.267 [INFO] 
2017-03-22T21:36:46.267 [INFO] --- maven-jar-plugin:3.0.2:test-jar (default-test-jar) @ beam-runners-core-construction-java
---
2017-03-22T21:36:46.273 [INFO] Building jar: <https://builds.apache.org/job/beam_PostCommit_Java_RunnableOnService_Flink/ws/runners/core-construction-java/target/beam-runners-core-construction-java-0.7.0-SNAPSHOT-tests.jar>
2017-03-22T21:36:46.332 [INFO] 
2017-03-22T21:36:46.332 [INFO] --- maven-surefire-plugin:2.19.1:test (runnable-on-service-tests)
@ beam-runners-core-construction-java ---
2017-03-22T21:36:46.360 [INFO] Surefire report directory: <https://builds.apache.org/job/beam_PostCommit_Java_RunnableOnService_Flink/ws/runners/core-construction-java/target/surefire-reports>
2017-03-22T21:36:46.361 [INFO] Using configured provider org.apache.maven.surefire.junitcore.JUnitCoreProvider
2017-03-22T21:36:46.361 [INFO] parallel='all', perCoreThreadCount=true, threadCount=4, useUnlimitedThreads=false,
threadCountSuites=0, threadCountClasses=0, threadCountMethods=0, parallelOptimized=true

-------------------------------------------------------
 T E S T S
-------------------------------------------------------

Results :

Tests run: 0, Failures: 0, Errors: 0, Skipped: 0

[JENKINS] Recording test results
2017-03-22T21:36:47.193 [INFO] 
2017-03-22T21:36:47.193 [INFO] --- maven-dependency-plugin:3.0.0:analyze-only (default) @
beam-runners-core-construction-java ---
2017-03-22T21:36:47.236 [INFO] No dependency problems found
[JENKINS] Archiving disabled
2017-03-22T21:36:47.923 [INFO]                                                           
             
2017-03-22T21:36:47.923 [INFO] ------------------------------------------------------------------------
2017-03-22T21:36:47.923 [INFO] Building Apache Beam :: Runners :: Core Java 0.7.0-SNAPSHOT
2017-03-22T21:36:47.923 [INFO] ------------------------------------------------------------------------
2017-03-22T21:36:47.937 [INFO] 
2017-03-22T21:36:47.937 [INFO] --- maven-clean-plugin:3.0.0:clean (default-clean) @ beam-runners-core-java
---
2017-03-22T21:36:47.939 [INFO] Deleting <https://builds.apache.org/job/beam_PostCommit_Java_RunnableOnService_Flink/ws/runners/core-java>
(includes = [**/*.pyc, **/*.egg-info/], excludes = [])
2017-03-22T21:36:47.991 [INFO] 
2017-03-22T21:36:47.991 [INFO] --- maven-enforcer-plugin:1.4.1:enforce (enforce) @ beam-runners-core-java
---
2017-03-22T21:36:48.705 [INFO] 
2017-03-22T21:36:48.705 [INFO] --- jacoco-maven-plugin:0.7.8:prepare-agent (default) @ beam-runners-core-java
---
2017-03-22T21:36:48.706 [INFO] argLine set to -javaagent:<https://builds.apache.org/job/beam_PostCommit_Java_RunnableOnService_Flink/ws/.repository/org/jacoco/org.jacoco.agent/0.7.8/org.jacoco.agent-0.7.8-runtime.jar=destfile=/home/jenkins/jenkins-slave/workspace/beam_PostCommit_Java_RunnableOnService_Flink/runners/core-java/target/jacoco.exec,excludes=**/AutoValue_*.class,dumponexit=true,output=file>
2017-03-22T21:36:48.755 [INFO] 
2017-03-22T21:36:48.755 [INFO] --- maven-remote-resources-plugin:1.5:process (process-resource-bundles)
@ beam-runners-core-java ---
2017-03-22T21:36:49.274 [INFO] 
2017-03-22T21:36:49.275 [INFO] --- maven-resources-plugin:2.7:resources (default-resources)
@ beam-runners-core-java ---
2017-03-22T21:36:49.276 [INFO] Using 'UTF-8' encoding to copy filtered resources.
2017-03-22T21:36:49.276 [INFO] skip non existing resourceDirectory <https://builds.apache.org/job/beam_PostCommit_Java_RunnableOnService_Flink/ws/runners/core-java/src/main/resources>
2017-03-22T21:36:49.276 [INFO] Copying 3 resources
2017-03-22T21:36:49.365 [INFO] 
2017-03-22T21:36:49.365 [INFO] --- maven-compiler-plugin:3.6.1:compile (default-compile) @
beam-runners-core-java ---
2017-03-22T21:36:49.380 [INFO] Changes detected - recompiling the module!
2017-03-22T21:36:49.380 [INFO] Compiling 86 source files to <https://builds.apache.org/job/beam_PostCommit_Java_RunnableOnService_Flink/ws/runners/core-java/target/classes>
2017-03-22T21:36:50.583 [WARNING] bootstrap class path not set in conjunction with -source
1.7
2017-03-22T21:36:50.583 [INFO] <https://builds.apache.org/job/beam_PostCommit_Java_RunnableOnService_Flink/ws/runners/core-java/src/main/java/org/apache/beam/runners/core/InMemoryStateInternals.java>:
Some input files use or override a deprecated API.
2017-03-22T21:36:50.583 [INFO] <https://builds.apache.org/job/beam_PostCommit_Java_RunnableOnService_Flink/ws/runners/core-java/src/main/java/org/apache/beam/runners/core/InMemoryStateInternals.java>:
Recompile with -Xlint:deprecation for details.
2017-03-22T21:36:50.583 [INFO] <https://builds.apache.org/job/beam_PostCommit_Java_RunnableOnService_Flink/ws/runners/core-java/src/main/java/org/apache/beam/runners/core/StatefulDoFnRunner.java>:
Some input files use unchecked or unsafe operations.
2017-03-22T21:36:50.583 [INFO] <https://builds.apache.org/job/beam_PostCommit_Java_RunnableOnService_Flink/ws/runners/core-java/src/main/java/org/apache/beam/runners/core/StatefulDoFnRunner.java>:
Recompile with -Xlint:unchecked for details.
2017-03-22T21:36:50.633 [INFO] 
2017-03-22T21:36:50.633 [INFO] --- maven-resources-plugin:2.7:testResources (default-testResources)
@ beam-runners-core-java ---
2017-03-22T21:36:50.634 [INFO] Using 'UTF-8' encoding to copy filtered resources.
2017-03-22T21:36:50.634 [INFO] skip non existing resourceDirectory <https://builds.apache.org/job/beam_PostCommit_Java_RunnableOnService_Flink/ws/runners/core-java/src/test/resources>
2017-03-22T21:36:50.635 [INFO] Copying 3 resources
2017-03-22T21:36:50.723 [INFO] 
2017-03-22T21:36:50.724 [INFO] --- maven-compiler-plugin:3.6.1:testCompile (default-testCompile)
@ beam-runners-core-java ---
2017-03-22T21:36:50.739 [INFO] Changes detected - recompiling the module!
2017-03-22T21:36:50.740 [INFO] Compiling 47 source files to <https://builds.apache.org/job/beam_PostCommit_Java_RunnableOnService_Flink/ws/runners/core-java/target/test-classes>
2017-03-22T21:36:51.616 [INFO] <https://builds.apache.org/job/beam_PostCommit_Java_RunnableOnService_Flink/ws/runners/core-java/src/test/java/org/apache/beam/runners/core/triggers/TriggerStateMachineTester.java>:
Some input files use or override a deprecated API.
2017-03-22T21:36:51.616 [INFO] <https://builds.apache.org/job/beam_PostCommit_Java_RunnableOnService_Flink/ws/runners/core-java/src/test/java/org/apache/beam/runners/core/triggers/TriggerStateMachineTester.java>:
Recompile with -Xlint:deprecation for details.
2017-03-22T21:36:51.616 [INFO] <https://builds.apache.org/job/beam_PostCommit_Java_RunnableOnService_Flink/ws/runners/core-java/src/test/java/org/apache/beam/runners/core/InMemoryStateInternalsTest.java>:
Some input files use unchecked or unsafe operations.
2017-03-22T21:36:51.616 [INFO] <https://builds.apache.org/job/beam_PostCommit_Java_RunnableOnService_Flink/ws/runners/core-java/src/test/java/org/apache/beam/runners/core/InMemoryStateInternalsTest.java>:
Recompile with -Xlint:unchecked for details.
2017-03-22T21:36:51.666 [INFO] 
2017-03-22T21:36:51.666 [INFO] --- maven-checkstyle-plugin:2.17:check (default) @ beam-runners-core-java
---
2017-03-22T21:37:00.174 [INFO] Starting audit...
[ERROR] <https://builds.apache.org/job/beam_PostCommit_Java_RunnableOnService_Flink/ws/runners/core-java/src/test/java/org/apache/beam/runners/core/SimpleDoFnRunnerTest.java>:21:15:
Unused import: org.hamcrest.Matchers.equalTo. [UnusedImports]
Audit done.
2017-03-22T21:37:00.174 [INFO] There is 1 error reported by Checkstyle 6.19 with beam/checkstyle.xml
ruleset.
2017-03-22T21:37:00.176 [ERROR] src/test/java/org/apache/beam/runners/core/SimpleDoFnRunnerTest.java:[21,15]
(imports) UnusedImports: Unused import: org.hamcrest.Matchers.equalTo.
[JENKINS] Archiving disabled
[JENKINS] Archiving disabled
[JENKINS] Archiving disabled
[JENKINS] Archiving disabled
[JENKINS] Archiving disabled
[JENKINS] Archiving disabled
[JENKINS] Archiving disabled
[JENKINS] Archiving disabled
[JENKINS] Archiving disabled
[JENKINS] Archiving disabled
[JENKINS] Archiving disabled
[JENKINS] Archiving disabled
[JENKINS] Archiving disabled
[JENKINS] Archiving disabled
2017-03-22T21:37:04.224 [INFO] ------------------------------------------------------------------------
2017-03-22T21:37:04.224 [INFO] Reactor Summary:
2017-03-22T21:37:04.224 [INFO] 
2017-03-22T21:37:04.224 [INFO] Apache Beam :: Parent .............................. SUCCESS
[ 19.444 s]
2017-03-22T21:37:04.224 [INFO] Apache Beam :: SDKs :: Java :: Build Tools ......... SUCCESS
[  9.838 s]
2017-03-22T21:37:04.224 [INFO] Apache Beam :: SDKs ................................ SUCCESS
[  2.294 s]
2017-03-22T21:37:04.224 [INFO] Apache Beam :: SDKs :: Common ...................... SUCCESS
[  1.238 s]
2017-03-22T21:37:04.224 [INFO] Apache Beam :: SDKs :: Common :: Fn API ............ SUCCESS
[ 10.986 s]
2017-03-22T21:37:04.224 [INFO] Apache Beam :: SDKs :: Common :: Runner API ........ SUCCESS
[  3.629 s]
2017-03-22T21:37:04.224 [INFO] Apache Beam :: SDKs :: Java ........................ SUCCESS
[  1.308 s]
2017-03-22T21:37:04.224 [INFO] Apache Beam :: SDKs :: Java :: Core ................ SUCCESS
[02:03 min]
2017-03-22T21:37:04.224 [INFO] Apache Beam :: Runners ............................. SUCCESS
[  1.744 s]
2017-03-22T21:37:04.224 [INFO] Apache Beam :: Runners :: Core Java Construction ... SUCCESS
[  7.587 s]
2017-03-22T21:37:04.224 [INFO] Apache Beam :: Runners :: Core Java ................ FAILURE
[ 12.464 s]
2017-03-22T21:37:04.224 [INFO] Apache Beam :: Runners :: Flink .................... SKIPPED
2017-03-22T21:37:04.224 [INFO] Apache Beam :: Runners :: Flink :: Core ............ SKIPPED
2017-03-22T21:37:04.224 [INFO] ------------------------------------------------------------------------
2017-03-22T21:37:04.224 [INFO] BUILD FAILURE
2017-03-22T21:37:04.224 [INFO] ------------------------------------------------------------------------
2017-03-22T21:37:04.225 [INFO] Total time: 03:45 min
2017-03-22T21:37:04.225 [INFO] Finished at: 2017-03-22T21:37:04+00:00
2017-03-22T21:37:04.716 [INFO] Final Memory: 108M/1436M
2017-03-22T21:37:04.716 [INFO] ------------------------------------------------------------------------
Waiting for Jenkins to finish collecting data
2017-03-22T21:37:06.149 [ERROR] Failed to execute goal org.apache.maven.plugins:maven-checkstyle-plugin:2.17:check
(default) on project beam-runners-core-java: You have 1 Checkstyle violation. -> [Help
1]
org.apache.maven.lifecycle.LifecycleExecutionException: Failed to execute goal org.apache.maven.plugins:maven-checkstyle-plugin:2.17:check
(default) on project beam-runners-core-java: You have 1 Checkstyle violation.
	at org.apache.maven.lifecycle.internal.MojoExecutor.execute(MojoExecutor.java:212)
	at org.apache.maven.lifecycle.internal.MojoExecutor.execute(MojoExecutor.java:153)
	at org.apache.maven.lifecycle.internal.MojoExecutor.execute(MojoExecutor.java:145)
	at org.apache.maven.lifecycle.internal.LifecycleModuleBuilder.buildProject(LifecycleModuleBuilder.java:116)
	at org.apache.maven.lifecycle.internal.LifecycleModuleBuilder.buildProject(LifecycleModuleBuilder.java:80)
	at org.apache.maven.lifecycle.internal.builder.singlethreaded.SingleThreadedBuilder.build(SingleThreadedBuilder.java:51)
	at org.apache.maven.lifecycle.internal.LifecycleStarter.execute(LifecycleStarter.java:128)
	at org.apache.maven.DefaultMaven.doExecute(DefaultMaven.java:307)
	at org.apache.maven.DefaultMaven.doExecute(DefaultMaven.java:193)
	at org.apache.maven.DefaultMaven.execute(DefaultMaven.java:106)
	at org.jvnet.hudson.maven3.launcher.Maven33Launcher.main(Maven33Launcher.java:129)
	at sun.reflect.NativeMethodAccessorImpl.invoke0(Native Method)
	at sun.reflect.NativeMethodAccessorImpl.invoke(NativeMethodAccessorImpl.java:62)
	at sun.reflect.DelegatingMethodAccessorImpl.invoke(DelegatingMethodAccessorImpl.java:43)
	at java.lang.reflect.Method.invoke(Method.java:498)
	at org.codehaus.plexus.classworlds.launcher.Launcher.launchStandard(Launcher.java:330)
	at org.codehaus.plexus.classworlds.launcher.Launcher.launch(Launcher.java:238)
	at jenkins.maven3.agent.Maven33Main.launch(Maven33Main.java:176)
	at sun.reflect.NativeMethodAccessorImpl.invoke0(Native Method)
	at sun.reflect.NativeMethodAccessorImpl.invoke(NativeMethodAccessorImpl.java:62)
	at sun.reflect.DelegatingMethodAccessorImpl.invoke(DelegatingMethodAccessorImpl.java:43)
	at java.lang.reflect.Method.invoke(Method.java:498)
	at hudson.maven.Maven3Builder.call(Maven3Builder.java:139)
	at hudson.maven.Maven3Builder.call(Maven3Builder.java:70)
	at hudson.remoting.UserRequest.perform(UserRequest.java:153)
	at hudson.remoting.UserRequest.perform(UserRequest.java:50)
	at hudson.remoting.Request$2.run(Request.java:336)
	at hudson.remoting.InterceptingExecutorService$1.call(InterceptingExecutorService.java:68)
	at java.util.concurrent.FutureTask.run(FutureTask.java:266)
	at java.util.concurrent.ThreadPoolExecutor.runWorker(ThreadPoolExecutor.java:1142)
	at java.util.concurrent.ThreadPoolExecutor$Worker.run(ThreadPoolExecutor.java:617)
	at java.lang.Thread.run(Thread.java:745)
Caused by: org.apache.maven.plugin.MojoFailureException: You have 1 Checkstyle violation.
	at org.apache.maven.plugin.checkstyle.CheckstyleViolationCheckMojo.execute(CheckstyleViolationCheckMojo.java:588)
	at org.apache.maven.plugin.DefaultBuildPluginManager.executeMojo(DefaultBuildPluginManager.java:134)
	at org.apache.maven.lifecycle.internal.MojoExecutor.execute(MojoExecutor.java:208)
	... 31 more
2017-03-22T21:37:06.150 [ERROR] 
2017-03-22T21:37:06.150 [ERROR] Re-run Maven using the -X switch to enable full debug logging.
2017-03-22T21:37:06.150 [ERROR] 
2017-03-22T21:37:06.150 [ERROR] For more information about the errors and possible solutions,
please read the following articles:
2017-03-22T21:37:06.150 [ERROR] [Help 1] http://cwiki.apache.org/confluence/display/MAVEN/MojoFailureException
2017-03-22T21:37:06.151 [ERROR] 
2017-03-22T21:37:06.151 [ERROR] After correcting the problems, you can resume the build with
the command
2017-03-22T21:37:06.151 [ERROR]   mvn <goals> -rf :beam-runners-core-java
channel stopped

Mime
View raw message