beam-commits mailing list archives

Site index · List index
Message view « Date » · « Thread »
Top « Date » · « Thread »
From Apache Jenkins Server <jenk...@builds.apache.org>
Subject Build failed in Jenkins: beam_PostCommit_Java_MavenInstall #2943
Date Sat, 18 Mar 2017 06:39:28 GMT
See <https://builds.apache.org/job/beam_PostCommit_Java_MavenInstall/2943/display/redirect>

------------------------------------------
[...truncated 2.15 MB...]
2017-03-18T06:37:40.222 [INFO] Installing <https://builds.apache.org/job/beam_PostCommit_Java_MavenInstall/ws/sdks/java/javadoc/target/javadoc.jar>
to <https://builds.apache.org/job/beam_PostCommit_Java_MavenInstall/ws/.repository/org/apache/beam/beam-sdks-java-javadoc/0.7.0-SNAPSHOT/beam-sdks-java-javadoc-0.7.0-SNAPSHOT.jar>
[JENKINS] Archiving disabled
2017-03-18T06:37:40.852 [INFO]                                                           
             
2017-03-18T06:37:40.852 [INFO] ------------------------------------------------------------------------
2017-03-18T06:37:40.853 [INFO] Building Apache Beam :: Parent 0.7.0-SNAPSHOT
2017-03-18T06:37:40.853 [INFO] ------------------------------------------------------------------------
2017-03-18T06:37:40.854 [WARNING] The POM for org.eclipse.m2e:lifecycle-mapping:jar:1.0.0
is missing, no dependency information available
2017-03-18T06:37:40.854 [WARNING] Failed to retrieve plugin descriptor for org.eclipse.m2e:lifecycle-mapping:1.0.0:
Plugin org.eclipse.m2e:lifecycle-mapping:1.0.0 or one of its dependencies could not be resolved:
Failure to find org.eclipse.m2e:lifecycle-mapping:jar:1.0.0 in https://repo.maven.apache.org/maven2
was cached in the local repository, resolution will not be reattempted until the update interval
of central has elapsed or updates are forced
2017-03-18T06:37:40.854 [INFO] 
2017-03-18T06:37:40.854 [INFO] --- coveralls-maven-plugin:4.3.0:report (default-cli) @ beam-parent
---
2017-03-18T06:37:40.857 [INFO] Downloading: https://repo.maven.apache.org/maven2/org/apache/httpcomponents/httpmime/4.5.2/httpmime-4.5.2.pom
2017-03-18T06:37:40.883 [INFO] Downloaded: https://repo.maven.apache.org/maven2/org/apache/httpcomponents/httpmime/4.5.2/httpmime-4.5.2.pom
(5 KB at 179.6 KB/sec)
2017-03-18T06:37:40.886 [INFO] Downloading: https://repo.maven.apache.org/maven2/com/fasterxml/jackson/core/jackson-core/2.8.3/jackson-core-2.8.3.pom
2017-03-18T06:37:40.911 [INFO] Downloaded: https://repo.maven.apache.org/maven2/com/fasterxml/jackson/core/jackson-core/2.8.3/jackson-core-2.8.3.pom
(6 KB at 211.5 KB/sec)
2017-03-18T06:37:40.914 [INFO] Downloading: https://repo.maven.apache.org/maven2/com/fasterxml/jackson/core/jackson-annotations/2.8.3/jackson-annotations-2.8.3.pom
2017-03-18T06:37:40.940 [INFO] Downloaded: https://repo.maven.apache.org/maven2/com/fasterxml/jackson/core/jackson-annotations/2.8.3/jackson-annotations-2.8.3.pom
(2 KB at 69.4 KB/sec)
2017-03-18T06:37:40.942 [INFO] Downloading: https://repo.maven.apache.org/maven2/com/fasterxml/jackson/core/jackson-databind/2.8.3/jackson-databind-2.8.3.pom
2017-03-18T06:37:40.967 [INFO] Downloaded: https://repo.maven.apache.org/maven2/com/fasterxml/jackson/core/jackson-databind/2.8.3/jackson-databind-2.8.3.pom
(6 KB at 212.0 KB/sec)
2017-03-18T06:37:40.970 [INFO] Downloading: https://repo.maven.apache.org/maven2/org/eclipse/jgit/org.eclipse.jgit/4.5.0.201609210915-r/org.eclipse.jgit-4.5.0.201609210915-r.pom
2017-03-18T06:37:40.996 [INFO] Downloaded: https://repo.maven.apache.org/maven2/org/eclipse/jgit/org.eclipse.jgit/4.5.0.201609210915-r/org.eclipse.jgit-4.5.0.201609210915-r.pom
(10 KB at 356.9 KB/sec)
2017-03-18T06:37:40.997 [INFO] Downloading: https://repo.maven.apache.org/maven2/org/eclipse/jgit/org.eclipse.jgit-parent/4.5.0.201609210915-r/org.eclipse.jgit-parent-4.5.0.201609210915-r.pom
2017-03-18T06:37:41.025 [INFO] Downloaded: https://repo.maven.apache.org/maven2/org/eclipse/jgit/org.eclipse.jgit-parent/4.5.0.201609210915-r/org.eclipse.jgit-parent-4.5.0.201609210915-r.pom
(27 KB at 978.7 KB/sec)
2017-03-18T06:37:41.027 [INFO] Downloading: https://repo.maven.apache.org/maven2/com/jcraft/jsch/0.1.53/jsch-0.1.53.pom
2017-03-18T06:37:41.052 [INFO] Downloaded: https://repo.maven.apache.org/maven2/com/jcraft/jsch/0.1.53/jsch-0.1.53.pom
(4 KB at 126.4 KB/sec)
2017-03-18T06:37:41.053 [INFO] Downloading: https://repo.maven.apache.org/maven2/org/sonatype/oss/oss-parent/6/oss-parent-6.pom
2017-03-18T06:37:41.078 [INFO] Downloaded: https://repo.maven.apache.org/maven2/org/sonatype/oss/oss-parent/6/oss-parent-6.pom
(5 KB at 188.7 KB/sec)
2017-03-18T06:37:41.080 [INFO] Downloading: https://repo.maven.apache.org/maven2/com/googlecode/javaewah/JavaEWAH/0.7.9/JavaEWAH-0.7.9.pom
2017-03-18T06:37:41.105 [INFO] Downloaded: https://repo.maven.apache.org/maven2/com/googlecode/javaewah/JavaEWAH/0.7.9/JavaEWAH-0.7.9.pom
(5 KB at 169.7 KB/sec)
2017-03-18T06:37:41.107 [INFO] Downloading: https://repo.maven.apache.org/maven2/org/slf4j/slf4j-api/1.7.21/slf4j-api-1.7.21.pom
2017-03-18T06:37:41.132 [INFO] Downloaded: https://repo.maven.apache.org/maven2/org/slf4j/slf4j-api/1.7.21/slf4j-api-1.7.21.pom
(3 KB at 108.4 KB/sec)
2017-03-18T06:37:41.133 [INFO] Downloading: https://repo.maven.apache.org/maven2/org/slf4j/slf4j-parent/1.7.21/slf4j-parent-1.7.21.pom
2017-03-18T06:37:41.159 [INFO] Downloaded: https://repo.maven.apache.org/maven2/org/slf4j/slf4j-parent/1.7.21/slf4j-parent-1.7.21.pom
(14 KB at 507.2 KB/sec)
2017-03-18T06:37:41.162 [INFO] Downloading: https://repo.maven.apache.org/maven2/org/codehaus/plexus/plexus-utils/2.0.7/plexus-utils-2.0.7.pom
2017-03-18T06:37:41.187 [INFO] Downloaded: https://repo.maven.apache.org/maven2/org/codehaus/plexus/plexus-utils/2.0.7/plexus-utils-2.0.7.pom
(3 KB at 109.8 KB/sec)
2017-03-18T06:37:41.188 [INFO] Downloading: https://repo.maven.apache.org/maven2/org/sonatype/sisu/sisu-inject-plexus/1.4.3.2/sisu-inject-plexus-1.4.3.2.pom
2017-03-18T06:37:41.213 [INFO] Downloaded: https://repo.maven.apache.org/maven2/org/sonatype/sisu/sisu-inject-plexus/1.4.3.2/sisu-inject-plexus-1.4.3.2.pom
(6 KB at 203.5 KB/sec)
2017-03-18T06:37:41.215 [INFO] Downloading: https://repo.maven.apache.org/maven2/org/sonatype/sisu/inject/guice-plexus/1.4.3.2/guice-plexus-1.4.3.2.pom
2017-03-18T06:37:41.240 [INFO] Downloaded: https://repo.maven.apache.org/maven2/org/sonatype/sisu/inject/guice-plexus/1.4.3.2/guice-plexus-1.4.3.2.pom
(3 KB at 118.5 KB/sec)
2017-03-18T06:37:41.241 [INFO] Downloading: https://repo.maven.apache.org/maven2/org/sonatype/sisu/inject/guice-bean/1.4.3.2/guice-bean-1.4.3.2.pom
2017-03-18T06:37:41.266 [INFO] Downloaded: https://repo.maven.apache.org/maven2/org/sonatype/sisu/inject/guice-bean/1.4.3.2/guice-bean-1.4.3.2.pom
(3 KB at 98.7 KB/sec)
2017-03-18T06:37:41.267 [INFO] Downloading: https://repo.maven.apache.org/maven2/org/sonatype/sisu/sisu-inject/1.4.3.2/sisu-inject-1.4.3.2.pom
2017-03-18T06:37:41.293 [INFO] Downloaded: https://repo.maven.apache.org/maven2/org/sonatype/sisu/sisu-inject/1.4.3.2/sisu-inject-1.4.3.2.pom
(2 KB at 45.2 KB/sec)
2017-03-18T06:37:41.294 [INFO] Downloading: https://repo.maven.apache.org/maven2/org/sonatype/sisu/sisu-parent/1.4.3.2/sisu-parent-1.4.3.2.pom
2017-03-18T06:37:41.320 [INFO] Downloaded: https://repo.maven.apache.org/maven2/org/sonatype/sisu/sisu-parent/1.4.3.2/sisu-parent-1.4.3.2.pom
(8 KB at 303.6 KB/sec)
2017-03-18T06:37:41.322 [INFO] Downloading: https://repo.maven.apache.org/maven2/org/sonatype/sisu/sisu-inject-bean/1.4.3.2/sisu-inject-bean-1.4.3.2.pom
2017-03-18T06:37:41.348 [INFO] Downloaded: https://repo.maven.apache.org/maven2/org/sonatype/sisu/sisu-inject-bean/1.4.3.2/sisu-inject-bean-1.4.3.2.pom
(6 KB at 199.0 KB/sec)
2017-03-18T06:37:41.350 [INFO] Downloading: https://repo.maven.apache.org/maven2/org/sonatype/sisu/sisu-guice/2.9.2/sisu-guice-2.9.2.pom
2017-03-18T06:37:41.375 [INFO] Downloaded: https://repo.maven.apache.org/maven2/org/sonatype/sisu/sisu-guice/2.9.2/sisu-guice-2.9.2.pom
(8 KB at 287.1 KB/sec)
2017-03-18T06:37:41.377 [INFO] Downloading: https://repo.maven.apache.org/maven2/org/sonatype/sisu/inject/guice-parent/2.9.2/guice-parent-2.9.2.pom
2017-03-18T06:37:41.403 [INFO] Downloaded: https://repo.maven.apache.org/maven2/org/sonatype/sisu/inject/guice-parent/2.9.2/guice-parent-2.9.2.pom
(12 KB at 459.9 KB/sec)
2017-03-18T06:37:41.406 [INFO] Downloading: https://repo.maven.apache.org/maven2/org/slf4j/jcl-over-slf4j/1.7.21/jcl-over-slf4j-1.7.21.pom
2017-03-18T06:37:41.431 [INFO] Downloaded: https://repo.maven.apache.org/maven2/org/slf4j/jcl-over-slf4j/1.7.21/jcl-over-slf4j-1.7.21.pom
(963 B at 37.6 KB/sec)
2017-03-18T06:37:41.436 [INFO] Downloading: https://repo.maven.apache.org/maven2/org/apache/httpcomponents/httpmime/4.5.2/httpmime-4.5.2.jar
2017-03-18T06:37:41.436 [INFO] Downloading: https://repo.maven.apache.org/maven2/com/fasterxml/jackson/core/jackson-core/2.8.3/jackson-core-2.8.3.jar
2017-03-18T06:37:41.436 [INFO] Downloading: https://repo.maven.apache.org/maven2/com/fasterxml/jackson/core/jackson-annotations/2.8.3/jackson-annotations-2.8.3.jar
2017-03-18T06:37:41.440 [INFO] Downloading: https://repo.maven.apache.org/maven2/org/eclipse/jgit/org.eclipse.jgit/4.5.0.201609210915-r/org.eclipse.jgit-4.5.0.201609210915-r.jar
2017-03-18T06:37:41.440 [INFO] Downloading: https://repo.maven.apache.org/maven2/com/fasterxml/jackson/core/jackson-databind/2.8.3/jackson-databind-2.8.3.jar
2017-03-18T06:37:41.469 [INFO] Downloaded: https://repo.maven.apache.org/maven2/org/apache/httpcomponents/httpmime/4.5.2/httpmime-4.5.2.jar
(41 KB at 1252.1 KB/sec)
2017-03-18T06:37:41.469 [INFO] Downloading: https://repo.maven.apache.org/maven2/com/jcraft/jsch/0.1.53/jsch-0.1.53.jar
2017-03-18T06:37:41.475 [INFO] Downloaded: https://repo.maven.apache.org/maven2/com/fasterxml/jackson/core/jackson-annotations/2.8.3/jackson-annotations-2.8.3.jar
(55 KB at 1393.5 KB/sec)
2017-03-18T06:37:41.475 [INFO] Downloading: https://repo.maven.apache.org/maven2/com/googlecode/javaewah/JavaEWAH/0.7.9/JavaEWAH-0.7.9.jar
2017-03-18T06:37:41.496 [INFO] Downloaded: https://repo.maven.apache.org/maven2/com/fasterxml/jackson/core/jackson-core/2.8.3/jackson-core-2.8.3.jar
(275 KB at 4574.8 KB/sec)
2017-03-18T06:37:41.497 [INFO] Downloading: https://repo.maven.apache.org/maven2/org/codehaus/plexus/plexus-utils/2.0.7/plexus-utils-2.0.7.jar
2017-03-18T06:37:41.535 [INFO] Downloaded: https://repo.maven.apache.org/maven2/com/googlecode/javaewah/JavaEWAH/0.7.9/JavaEWAH-0.7.9.jar
(123 KB at 1286.5 KB/sec)
2017-03-18T06:37:41.535 [INFO] Downloading: https://repo.maven.apache.org/maven2/org/sonatype/sisu/sisu-inject-plexus/1.4.3.2/sisu-inject-plexus-1.4.3.2.jar
2017-03-18T06:37:41.536 [INFO] Downloaded: https://repo.maven.apache.org/maven2/com/jcraft/jsch/0.1.53/jsch-0.1.53.jar
(274 KB at 2850.4 KB/sec)
2017-03-18T06:37:41.536 [INFO] Downloading: https://repo.maven.apache.org/maven2/org/sonatype/sisu/sisu-inject-bean/1.4.3.2/sisu-inject-bean-1.4.3.2.jar
2017-03-18T06:37:41.564 [INFO] Downloaded: https://repo.maven.apache.org/maven2/org/codehaus/plexus/plexus-utils/2.0.7/plexus-utils-2.0.7.jar
(219 KB at 1763.7 KB/sec)
2017-03-18T06:37:41.565 [INFO] Downloading: https://repo.maven.apache.org/maven2/org/sonatype/sisu/sisu-guice/2.9.2/sisu-guice-2.9.2-no_aop.jar
2017-03-18T06:37:41.583 [INFO] Downloaded: https://repo.maven.apache.org/maven2/org/sonatype/sisu/sisu-inject-bean/1.4.3.2/sisu-inject-bean-1.4.3.2.jar
(157 KB at 1095.6 KB/sec)
2017-03-18T06:37:41.583 [INFO] Downloading: https://repo.maven.apache.org/maven2/org/slf4j/slf4j-api/1.7.21/slf4j-api-1.7.21.jar
2017-03-18T06:37:41.595 [INFO] Downloaded: https://repo.maven.apache.org/maven2/org/sonatype/sisu/sisu-inject-plexus/1.4.3.2/sisu-inject-plexus-1.4.3.2.jar
(201 KB at 1290.8 KB/sec)
2017-03-18T06:37:41.595 [INFO] Downloading: https://repo.maven.apache.org/maven2/org/slf4j/jcl-over-slf4j/1.7.21/jcl-over-slf4j-1.7.21.jar
2017-03-18T06:37:41.602 [INFO] Downloaded: https://repo.maven.apache.org/maven2/com/fasterxml/jackson/core/jackson-databind/2.8.3/jackson-databind-2.8.3.jar
(1205 KB at 7257.8 KB/sec)
2017-03-18T06:37:41.613 [INFO] Downloaded: https://repo.maven.apache.org/maven2/org/slf4j/slf4j-api/1.7.21/slf4j-api-1.7.21.jar
(41 KB at 233.2 KB/sec)
2017-03-18T06:37:41.622 [INFO] Downloaded: https://repo.maven.apache.org/maven2/org/slf4j/jcl-over-slf4j/1.7.21/jcl-over-slf4j-1.7.21.jar
(17 KB at 88.7 KB/sec)
2017-03-18T06:37:41.635 [INFO] Downloaded: https://repo.maven.apache.org/maven2/org/sonatype/sisu/sisu-guice/2.9.2/sisu-guice-2.9.2-no_aop.jar
(469 KB at 2403.0 KB/sec)
2017-03-18T06:37:41.694 [INFO] Downloaded: https://repo.maven.apache.org/maven2/org/eclipse/jgit/org.eclipse.jgit/4.5.0.201609210915-r/org.eclipse.jgit-4.5.0.201609210915-r.jar
(2324 KB at 9040.3 KB/sec)
2017-03-18T06:37:42.133 [INFO] Starting Coveralls job for jenkins (2943 / https://builds.apache.org/job/beam_PostCommit_Java_MavenInstall/2943/)
2017-03-18T06:37:42.133 [INFO] Using repository token <secret>
2017-03-18T06:37:42.133 [INFO] Git commit 3f0fe91 in master
2017-03-18T06:37:42.133 [INFO] Writing Coveralls data to <https://builds.apache.org/job/beam_PostCommit_Java_MavenInstall/ws/target/coveralls.json...>
2017-03-18T06:37:42.179 [INFO] Processing coverage report from <https://builds.apache.org/job/beam_PostCommit_Java_MavenInstall/ws/sdks/java/core/target/site/jacoco/jacoco.xml>
2017-03-18T06:37:42.507 [INFO] Processing coverage report from <https://builds.apache.org/job/beam_PostCommit_Java_MavenInstall/ws/sdks/java/java8tests/target/site/jacoco/jacoco.xml>
2017-03-18T06:37:42.507 [INFO] Processing coverage report from <https://builds.apache.org/job/beam_PostCommit_Java_MavenInstall/ws/runners/core-java/target/site/jacoco/jacoco.xml>
2017-03-18T06:37:42.626 [INFO] Processing coverage report from <https://builds.apache.org/job/beam_PostCommit_Java_MavenInstall/ws/runners/direct-java/target/site/jacoco/jacoco.xml>
2017-03-18T06:37:42.718 [INFO] Processing coverage report from <https://builds.apache.org/job/beam_PostCommit_Java_MavenInstall/ws/runners/google-cloud-dataflow-java/target/site/jacoco/jacoco.xml>
2017-03-18T06:37:42.790 [INFO] Processing coverage report from <https://builds.apache.org/job/beam_PostCommit_Java_MavenInstall/ws/examples/java/target/site/jacoco/jacoco.xml>
2017-03-18T06:37:42.833 [INFO] Processing coverage report from <https://builds.apache.org/job/beam_PostCommit_Java_MavenInstall/ws/examples/java8/target/site/jacoco/jacoco.xml>
2017-03-18T06:37:42.881 [INFO] Successfully wrote Coveralls data in 748ms
2017-03-18T06:37:42.881 [INFO] Gathered code coverage metrics for 515 source files with 121902
lines of code:
2017-03-18T06:37:42.881 [INFO] - 30458 relevant lines
2017-03-18T06:37:42.881 [INFO] - 21359 covered lines
2017-03-18T06:37:42.881 [INFO] - 9099 missed lines
2017-03-18T06:37:42.882 [INFO] Submitting Coveralls data to API
2017-03-18T06:38:42.708 [ERROR] Submission failed in 59826ms while handling I/O operations
[JENKINS] Archiving disabled
[JENKINS] Archiving disabled
[JENKINS] Archiving disabled
[JENKINS] Archiving disabled
[JENKINS] Archiving disabled
[JENKINS] Archiving disabled
[JENKINS] Archiving disabled
[JENKINS] Archiving disabled
[JENKINS] Archiving disabled
[JENKINS] Archiving disabled
[JENKINS] Archiving disabled
[JENKINS] Archiving disabled
[JENKINS] Archiving disabled
[JENKINS] Archiving disabled
[JENKINS] Archiving disabled
[JENKINS] Archiving disabled
[JENKINS] Archiving disabled
[JENKINS] Archiving disabled
[JENKINS] Archiving disabled
[JENKINS] Archiving disabled
[JENKINS] Archiving disabled
[JENKINS] Archiving disabled
[JENKINS] Archiving disabled
[JENKINS] Archiving disabled
[JENKINS] Archiving disabled
[JENKINS] Archiving disabled
[JENKINS] Archiving disabled
[JENKINS] Archiving disabled
[JENKINS] Archiving disabled
[JENKINS] Archiving disabled
[JENKINS] Archiving disabled
[JENKINS] Archiving disabled
[JENKINS] Archiving disabled
[JENKINS] Archiving disabled
[JENKINS] Archiving disabled
[JENKINS] Archiving disabled
[JENKINS] Archiving disabled
[JENKINS] Archiving disabled
[JENKINS] Archiving disabled
[JENKINS] Archiving disabled
[JENKINS] Archiving disabled
[JENKINS] Archiving disabled
[JENKINS] Archiving disabled
2017-03-18T06:38:59.114 [INFO] ------------------------------------------------------------------------
2017-03-18T06:38:59.114 [INFO] Reactor Summary:
2017-03-18T06:38:59.114 [INFO] 
2017-03-18T06:38:59.114 [INFO] Apache Beam :: Parent .............................. FAILURE
[01:02 min]
2017-03-18T06:38:59.114 [INFO] Apache Beam :: SDKs :: Java :: Build Tools ......... SUCCESS
[ 13.022 s]
2017-03-18T06:38:59.114 [INFO] Apache Beam :: SDKs ................................ SUCCESS
[  4.260 s]
2017-03-18T06:38:59.114 [INFO] Apache Beam :: SDKs :: Common ...................... SUCCESS
[  1.323 s]
2017-03-18T06:38:59.114 [INFO] Apache Beam :: SDKs :: Common :: Fn API ............ SUCCESS
[ 13.140 s]
2017-03-18T06:38:59.114 [INFO] Apache Beam :: SDKs :: Common :: Runner API ........ SUCCESS
[ 10.157 s]
2017-03-18T06:38:59.114 [INFO] Apache Beam :: SDKs :: Java ........................ SUCCESS
[  2.077 s]
2017-03-18T06:38:59.114 [INFO] Apache Beam :: SDKs :: Java :: Core ................ SUCCESS
[02:24 min]
2017-03-18T06:38:59.114 [INFO] Apache Beam :: Runners ............................. SUCCESS
[  1.664 s]
2017-03-18T06:38:59.114 [INFO] Apache Beam :: Runners :: Core Java Construction ... SUCCESS
[ 14.250 s]
2017-03-18T06:38:59.114 [INFO] Apache Beam :: Runners :: Core Java ................ SUCCESS
[ 41.588 s]
2017-03-18T06:38:59.114 [INFO] Apache Beam :: Runners :: Direct Java .............. SUCCESS
[02:27 min]
2017-03-18T06:38:59.114 [INFO] Apache Beam :: SDKs :: Java :: IO .................. SUCCESS
[  1.815 s]
2017-03-18T06:38:59.114 [INFO] Apache Beam :: SDKs :: Java :: IO :: Elasticsearch . SUCCESS
[ 28.164 s]
2017-03-18T06:38:59.114 [INFO] Apache Beam :: Runners :: Google Cloud Dataflow .... SUCCESS
[ 25.999 s]
2017-03-18T06:38:59.114 [INFO] Apache Beam :: SDKs :: Java :: IO :: Google Cloud Platform
SUCCESS [06:03 min]
2017-03-18T06:38:59.114 [INFO] Apache Beam :: SDKs :: Java :: IO :: Hadoop Common . SUCCESS
[ 16.475 s]
2017-03-18T06:38:59.114 [INFO] Apache Beam :: SDKs :: Java :: IO :: HBase ......... SUCCESS
[ 22.342 s]
2017-03-18T06:38:59.115 [INFO] Apache Beam :: SDKs :: Java :: IO :: HDFS .......... SUCCESS
[ 20.118 s]
2017-03-18T06:38:59.115 [INFO] Apache Beam :: SDKs :: Java :: IO :: JDBC .......... SUCCESS
[ 20.075 s]
2017-03-18T06:38:59.115 [INFO] Apache Beam :: SDKs :: Java :: IO :: JMS ........... SUCCESS
[ 15.866 s]
2017-03-18T06:38:59.115 [INFO] Apache Beam :: SDKs :: Java :: IO :: Kafka ......... SUCCESS
[ 16.851 s]
2017-03-18T06:38:59.115 [INFO] Apache Beam :: SDKs :: Java :: IO :: Kinesis ....... SUCCESS
[ 19.369 s]
2017-03-18T06:38:59.115 [INFO] Apache Beam :: SDKs :: Java :: IO :: MongoDB ....... SUCCESS
[ 26.033 s]
2017-03-18T06:38:59.115 [INFO] Apache Beam :: SDKs :: Java :: IO :: MQTT .......... SUCCESS
[ 15.984 s]
2017-03-18T06:38:59.115 [INFO] Apache Beam :: SDKs :: Java :: Maven Archetypes .... SUCCESS
[  1.592 s]
2017-03-18T06:38:59.115 [INFO] Apache Beam :: SDKs :: Java :: Maven Archetypes :: Starter
SUCCESS [ 12.682 s]
2017-03-18T06:38:59.115 [INFO] Apache Beam :: SDKs :: Java :: Maven Archetypes :: Examples
SUCCESS [ 18.018 s]
2017-03-18T06:38:59.115 [INFO] Apache Beam :: SDKs :: Java :: Maven Archetypes :: Examples
- Java 8 SUCCESS [ 20.569 s]
2017-03-18T06:38:59.115 [INFO] Apache Beam :: SDKs :: Java :: Extensions .......... SUCCESS
[  1.512 s]
2017-03-18T06:38:59.115 [INFO] Apache Beam :: SDKs :: Java :: Extensions :: Jackson SUCCESS
[ 10.763 s]
2017-03-18T06:38:59.115 [INFO] Apache Beam :: SDKs :: Java :: Extensions :: Join library SUCCESS
[ 12.643 s]
2017-03-18T06:38:59.115 [INFO] Apache Beam :: SDKs :: Java :: Extensions :: Sorter  SUCCESS
[ 25.826 s]
2017-03-18T06:38:59.115 [INFO] Apache Beam :: SDKs :: Java :: Harness ............. SUCCESS
[ 28.736 s]
2017-03-18T06:38:59.115 [INFO] Apache Beam :: SDKs :: Java :: Java 8 Tests ........ SUCCESS
[  8.966 s]
2017-03-18T06:38:59.115 [INFO] Apache Beam :: SDKs :: Python ...................... SUCCESS
[04:43 min]
2017-03-18T06:38:59.115 [INFO] Apache Beam :: Runners :: Flink .................... SUCCESS
[  1.436 s]
2017-03-18T06:38:59.115 [INFO] Apache Beam :: Runners :: Flink :: Core ............ SUCCESS
[ 49.560 s]
2017-03-18T06:38:59.115 [INFO] Apache Beam :: Runners :: Flink :: Examples ........ SUCCESS
[ 15.060 s]
2017-03-18T06:38:59.115 [INFO] Apache Beam :: Runners :: Spark .................... SUCCESS
[03:01 min]
2017-03-18T06:38:59.115 [INFO] Apache Beam :: Runners :: Apex ..................... SUCCESS
[ 58.109 s]
2017-03-18T06:38:59.115 [INFO] Apache Beam :: Examples ............................ SUCCESS
[  1.746 s]
2017-03-18T06:38:59.115 [INFO] Apache Beam :: Examples :: Java .................... SUCCESS
[06:12 min]
2017-03-18T06:38:59.115 [INFO] Apache Beam :: Examples :: Java 8 .................. SUCCESS
[ 22.245 s]
2017-03-18T06:38:59.115 [INFO] Apache Beam :: SDKs :: Java :: Aggregated Javadoc .. SUCCESS
[ 21.094 s]
2017-03-18T06:38:59.115 [INFO] ------------------------------------------------------------------------
2017-03-18T06:38:59.115 [INFO] BUILD FAILURE
2017-03-18T06:38:59.115 [INFO] ------------------------------------------------------------------------
2017-03-18T06:38:59.115 [INFO] Total time: 37:56 min
2017-03-18T06:38:59.115 [INFO] Finished at: 2017-03-18T06:38:59+00:00
2017-03-18T06:38:59.842 [INFO] Final Memory: 286M/1339M
2017-03-18T06:38:59.842 [INFO] ------------------------------------------------------------------------
Waiting for Jenkins to finish collecting data
2017-03-18T06:39:26.300 [ERROR] Failed to execute goal org.eluder.coveralls:coveralls-maven-plugin:4.3.0:report
(default-cli) on project beam-parent: I/O operation failed: Report submission to Coveralls
API failed with HTTP status 504: Gateway Time-out (Coveralls API internal error) -> [Help
1]
org.apache.maven.lifecycle.LifecycleExecutionException: Failed to execute goal org.eluder.coveralls:coveralls-maven-plugin:4.3.0:report
(default-cli) on project beam-parent: I/O operation failed
	at org.apache.maven.lifecycle.internal.MojoExecutor.execute(MojoExecutor.java:212)
	at org.apache.maven.lifecycle.internal.MojoExecutor.execute(MojoExecutor.java:153)
	at org.apache.maven.lifecycle.internal.MojoExecutor.execute(MojoExecutor.java:145)
	at org.apache.maven.lifecycle.internal.LifecycleModuleBuilder.buildProject(LifecycleModuleBuilder.java:116)
	at org.apache.maven.lifecycle.internal.LifecycleModuleBuilder.buildProject(LifecycleModuleBuilder.java:80)
	at org.apache.maven.lifecycle.internal.builder.singlethreaded.SingleThreadedBuilder.build(SingleThreadedBuilder.java:51)
	at org.apache.maven.lifecycle.internal.LifecycleStarter.execute(LifecycleStarter.java:128)
	at org.apache.maven.DefaultMaven.doExecute(DefaultMaven.java:307)
	at org.apache.maven.DefaultMaven.doExecute(DefaultMaven.java:193)
	at org.apache.maven.DefaultMaven.execute(DefaultMaven.java:106)
	at org.jvnet.hudson.maven3.launcher.Maven33Launcher.main(Maven33Launcher.java:129)
	at sun.reflect.NativeMethodAccessorImpl.invoke0(Native Method)
	at sun.reflect.NativeMethodAccessorImpl.invoke(NativeMethodAccessorImpl.java:62)
	at sun.reflect.DelegatingMethodAccessorImpl.invoke(DelegatingMethodAccessorImpl.java:43)
	at java.lang.reflect.Method.invoke(Method.java:498)
	at org.codehaus.plexus.classworlds.launcher.Launcher.launchStandard(Launcher.java:330)
	at org.codehaus.plexus.classworlds.launcher.Launcher.launch(Launcher.java:238)
	at jenkins.maven3.agent.Maven33Main.launch(Maven33Main.java:176)
	at sun.reflect.NativeMethodAccessorImpl.invoke0(Native Method)
	at sun.reflect.NativeMethodAccessorImpl.invoke(NativeMethodAccessorImpl.java:62)
	at sun.reflect.DelegatingMethodAccessorImpl.invoke(DelegatingMethodAccessorImpl.java:43)
	at java.lang.reflect.Method.invoke(Method.java:498)
	at hudson.maven.Maven3Builder.call(Maven3Builder.java:139)
	at hudson.maven.Maven3Builder.call(Maven3Builder.java:70)
	at hudson.remoting.UserRequest.perform(UserRequest.java:153)
	at hudson.remoting.UserRequest.perform(UserRequest.java:50)
	at hudson.remoting.Request$2.run(Request.java:336)
	at hudson.remoting.InterceptingExecutorService$1.call(InterceptingExecutorService.java:68)
	at java.util.concurrent.FutureTask.run(FutureTask.java:266)
	at java.util.concurrent.ThreadPoolExecutor.runWorker(ThreadPoolExecutor.java:1142)
	at java.util.concurrent.ThreadPoolExecutor$Worker.run(ThreadPoolExecutor.java:617)
	at java.lang.Thread.run(Thread.java:745)
Caused by: org.apache.maven.plugin.MojoFailureException: I/O operation failed
	at org.eluder.coveralls.maven.plugin.CoverallsReportMojo.execute(CoverallsReportMojo.java:259)
	at org.apache.maven.plugin.DefaultBuildPluginManager.executeMojo(DefaultBuildPluginManager.java:134)
	at org.apache.maven.lifecycle.internal.MojoExecutor.execute(MojoExecutor.java:208)
	... 31 more
Caused by: java.io.IOException: Report submission to Coveralls API failed with HTTP status
504: Gateway Time-out (Coveralls API internal error)
	at org.eluder.coveralls.maven.plugin.httpclient.CoverallsClient.parseResponse(CoverallsClient.java:108)
	at org.eluder.coveralls.maven.plugin.httpclient.CoverallsClient.submit(CoverallsClient.java:85)
	at org.eluder.coveralls.maven.plugin.CoverallsReportMojo.submitData(CoverallsReportMojo.java:400)
	at org.eluder.coveralls.maven.plugin.CoverallsReportMojo.execute(CoverallsReportMojo.java:254)
	... 33 more
Caused by: java.io.IOException: Coveralls API internal error
	at org.eluder.coveralls.maven.plugin.httpclient.CoverallsClient.parseResponse(CoverallsClient.java:97)
	... 36 more
2017-03-18T06:39:26.301 [ERROR] 
2017-03-18T06:39:26.301 [ERROR] Re-run Maven using the -X switch to enable full debug logging.
2017-03-18T06:39:26.301 [ERROR] 
2017-03-18T06:39:26.301 [ERROR] For more information about the errors and possible solutions,
please read the following articles:
2017-03-18T06:39:26.301 [ERROR] [Help 1] http://cwiki.apache.org/confluence/display/MAVEN/MojoFailureException
channel stopped

Mime
View raw message