beam-commits mailing list archives

Site index · List index
Message view « Date » · « Thread »
Top « Date » · « Thread »
From Apache Jenkins Server <>
Subject Build failed in Jenkins: beam_PostCommit_Java_Version_Test » OpenJDK 7 (on Ubuntu only) #3
Date Thu, 09 Mar 2017 02:32:10 GMT
See <>

Started by upstream project "beam_PostCommit_Java_Version_Test" build number 3
originally caused by:
 GitHub pull request #2204 of commit 80556b4d0f97def67d28d1923afff5b4b04b0386, no merge conflicts.
[EnvInject] - Loading node environment variables.
Building remotely on beam1 (beam) in workspace <>
Cloning the remote Git repository
Cloning repository
 > git init <>
# timeout=10
Fetching upstream changes from
 > git --version # timeout=10
 > git fetch --tags --progress +refs/heads/*:refs/remotes/origin/*
 > git config remote.origin.url # timeout=10
 > git config --add remote.origin.fetch +refs/heads/*:refs/remotes/origin/* # timeout=10
 > git config remote.origin.url # timeout=10
Fetching upstream changes from
 > git fetch --tags --progress +refs/heads/*:refs/remotes/origin/*
Checking out Revision 079d91c0573d4ae5366a01c5f6655d0d854b2b24 (refs/remotes/origin/pr/2204/merge)
 > git config core.sparsecheckout # timeout=10
 > git checkout -f 079d91c0573d4ae5366a01c5f6655d0d854b2b24
First time build. Skipping changelog.
Cleaning workspace
 > git rev-parse --verify HEAD # timeout=10
Resetting working tree
 > git reset --hard # timeout=10
 > git clean -fdx # timeout=10
[EnvInject] - Executing scripts and injecting environment variables after the SCM step.
[EnvInject] - Injecting as environment variables the properties content 

[EnvInject] - Variables injected successfully.
[OpenJDK 7 (on Ubuntu only)] $ /home/jenkins/tools/maven/apache-maven-3.3.3/bin/mvn -f pom.xml -DghprbTriggerAuthorLogin=markflyhigh -DghprbGhRepository=apache/beam
-DghprbTargetBranch=master -DghprbPullId=2204 -DghprbCredentialsId=56783412-83e6-4ab7-965c-3f8c3b9dd8f1
-DghprbAuthorRepoGitUrl= "-DghprbTriggerAuthor=Mark
Liu" -DghprbPullAuthorEmail= -DghprbPullLink= -Dsha1=origin/pr/2204/merge
"-Djdk=OpenJDK 7 (on Ubuntu only)" -DghprbPullAuthorLoginMention=@markflyhigh "-DghprbPullDescription=GitHub
pull request #2204 of commit 80556b4d0f97def67d28d1923afff5b4b04b0386, no merge conflicts."
-DghprbActualCommit=80556b4d0f97def67d28d1923afff5b4b04b0386 -DghprbPullAuthorLogin=markflyhigh
-DghprbSourceBranch=jenkins_java_sdk_version_test "-DghprbActualCommitAuthor=Mark Liu" -DghprbTriggerAuthorLoginMention=@markflyhigh
"-DghprbPullLongDescription=Be sure to do all of the following to help us incorporate your
contribution\r\nquickly and easily:\r\n\r\n - [x] Make sure the PR title is formatted like:\r\n
  `[BEAM-<Jira issue #>] Description of pull request`\r\n - [ ] Make sure tests pass
via `mvn clean verify`. (Even better, enable\r\n       Travis-CI on your fork and ensure the
whole test matrix passes).\r\n - [ ] Replace `<Jira issue #>` in the title with the
actual Jira issue\r\n       number, if there is one.\r\n - [ ] If this contribution is large,
please file an Apache\r\n       [Individual Contributor License Agreement](\r\n\r\n---\r\n\r\nJava
JDK version tests in Jenkins." -DghprbTriggerAuthorEmail= -DGIT_BRANCH=jenkins_java_sdk_version_test
"-DghprbPullTitle=This PR is only for test purpose - Do not merge!" "-DghprbCommentBody=Run
Java Versions Test" "-Dmaven.repo.local=<">
-B -e -P release clean install -pl !sdks/python coveralls:report -DrepoToken=**** -B -e -P
release clean verify coveralls:report -pl examples/java -DrepoToken=**** -DskipITs=false -Dit.test=WordCountIT
'-DintegrationTestPipelineOptions=[ "--project=apache-beam-testing", "--tempRoot=gs://temp-storage-for-end-to-end-tests",
/home/jenkins/tools/maven/apache-maven-3.3.3/bin/mvn: 200: local: 7: bad variable name
2017-03-09\T\02:32:00.186 [INFO] Error stacktraces are turned on.
2017-03-09\T\02:32:00.276 [INFO] Scanning for projects...
2017-03-09\T\02:32:01.642 [INFO] Downloading:
2017-03-09\T\02:32:02.320 [INFO] Downloaded:
(16 KB at 22.3 KB/sec)
2017-03-09\T\02:32:03.391 [INFO] Downloading:
2017-03-09\T\02:32:03.427 [INFO] Downloaded:
(7 KB at 167.9 KB/sec)
2017-03-09\T\02:32:03.433 [INFO] Downloading:
2017-03-09\T\02:32:03.476 [INFO] Downloaded:
(7 KB at 149.2 KB/sec)
2017-03-09\T\02:32:03.490 [INFO] Downloading:
2017-03-09\T\02:32:03.522 [INFO] Downloaded:
(4 KB at 103.2 KB/sec)
2017-03-09\T\02:32:03.526 [INFO] Downloading:
2017-03-09\T\02:32:03.587 [INFO] Downloaded:
(23 KB at 361.6 KB/sec)
2017-03-09\T\02:32:03.593 [INFO] Downloading:
2017-03-09\T\02:32:03.642 [INFO] Downloaded:
(32 KB at 649.4 KB/sec)
2017-03-09\T\02:32:03.647 [INFO] Downloading:
2017-03-09\T\02:32:03.692 [INFO] Downloaded:
(14 KB at 310.1 KB/sec)
2017-03-09\T\02:32:03.711 [INFO] Downloading:
2017-03-09\T\02:32:03.744 [INFO] Downloaded:
(5 KB at 118.9 KB/sec)
2017-03-09\T\02:32:03.751 [INFO] Downloading:
2017-03-09\T\02:32:03.788 [INFO] Downloaded:
(4 KB at 89.6 KB/sec)
2017-03-09\T\02:32:03.791 [INFO] Downloading:
2017-03-09\T\02:32:03.827 [INFO] Downloaded:
(20 KB at 554.6 KB/sec)
2017-03-09\T\02:32:03.831 [INFO] Downloading:
2017-03-09\T\02:32:03.860 [INFO] Downloaded:
(7 KB at 227.6 KB/sec)
2017-03-09\T\02:32:03.863 [INFO] Downloading:
2017-03-09\T\02:32:03.912 [INFO] Downloaded:
(14 KB at 275.9 KB/sec)
2017-03-09\T\02:32:03.917 [INFO] Downloading:
2017-03-09\T\02:32:03.948 [INFO] Downloaded:
(2 KB at 62.1 KB/sec)
2017-03-09\T\02:32:03.962 [INFO] Downloading:
2017-03-09\T\02:32:03.996 [INFO] Downloaded:
(5 KB at 138.7 KB/sec)
2017-03-09\T\02:32:04.009 [INFO] Downloading:
2017-03-09\T\02:32:04.044 [INFO] Downloaded:
(13 KB at 358.2 KB/sec)
2017-03-09\T\02:32:04.048 [INFO] Downloading:
2017-03-09\T\02:32:04.094 [INFO] Downloaded:
(5 KB at 102.4 KB/sec)
2017-03-09\T\02:32:04.100 [INFO] Downloading:
2017-03-09\T\02:32:04.131 [INFO] Downloaded:
(2 KB at 45.2 KB/sec)
2017-03-09\T\02:32:04.136 [INFO] Downloading:
2017-03-09\T\02:32:04.167 [INFO] Downloaded:
(3 KB at 74.2 KB/sec)
2017-03-09\T\02:32:04.169 [INFO] Downloading:
2017-03-09\T\02:32:04.204 [INFO] Downloaded:
(8 KB at 227.1 KB/sec)
2017-03-09\T\02:32:04.207 [INFO] Downloading:
2017-03-09\T\02:32:04.244 [INFO] Downloaded:
(21 KB at 546.1 KB/sec)
2017-03-09\T\02:32:04.260 [INFO] Downloading:
2017-03-09\T\02:32:04.291 [INFO] Downloaded:
(1023 B at 29.4 KB/sec)
2017-03-09\T\02:32:04.296 [INFO] Downloading:
2017-03-09\T\02:32:04.328 [INFO] Downloaded:
(612 B at 18.7 KB/sec)
2017-03-09\T\02:32:04.332 [INFO] Downloading:
2017-03-09\T\02:32:04.364 [INFO] Downloaded:
(6 KB at 164.3 KB/sec)
2017-03-09\T\02:32:04.367 [INFO] Downloading:
2017-03-09\T\02:32:04.399 [INFO] Downloaded:
(2 KB at 59.8 KB/sec)
2017-03-09\T\02:32:04.407 [INFO] Downloading:
2017-03-09\T\02:32:04.443 [INFO] Downloaded:
(965 B at 26.2 KB/sec)
2017-03-09\T\02:32:04.449 [INFO] Downloading:
2017-03-09\T\02:32:04.496 [INFO] Downloaded:
(10 KB at 210.9 KB/sec)
2017-03-09\T\02:32:04.500 [INFO] Downloading:
2017-03-09\T\02:32:04.543 [INFO] Downloaded:
(11 KB at 248.1 KB/sec)
2017-03-09\T\02:32:04.555 [INFO] Downloading:
2017-03-09\T\02:32:04.593 [INFO] Downloaded:
(363 B at 9.3 KB/sec)
2017-03-09\T\02:32:04.597 [INFO] Downloading:
2017-03-09\T\02:32:04.641 [INFO] Downloaded:
(3 KB at 55.9 KB/sec)
2017-03-09\T\02:32:04.644 [INFO] Downloading:
2017-03-09\T\02:32:04.696 [INFO] Downloaded:
(14 KB at 262.8 KB/sec)
2017-03-09\T\02:32:04.702 [INFO] Downloading:
2017-03-09\T\02:32:04.729 [INFO] Downloaded:
(815 B at 29.5 KB/sec)
2017-03-09\T\02:32:04.734 [INFO] Downloading:
2017-03-09\T\02:32:04.768 [INFO] Downloaded:
(5 KB at 121.8 KB/sec)
2017-03-09\T\02:32:04.771 [INFO] Downloading:
2017-03-09\T\02:32:04.804 [INFO] Downloaded:
(17 KB at 511.8 KB/sec)
2017-03-09\T\02:32:04.807 [INFO] Downloading:
2017-03-09\T\02:32:04.836 [INFO] Downloaded:
(4 KB at 130.8 KB/sec)
2017-03-09\T\02:32:04.840 [INFO] Downloading:
2017-03-09\T\02:32:04.869 [INFO] Downloaded:
(4 KB at 135.8 KB/sec)
2017-03-09\T\02:32:04.872 [INFO] Downloading:
2017-03-09\T\02:32:04.900 [INFO] Downloaded:
(9 KB at 291.5 KB/sec)
2017-03-09\T\02:32:04.903 [INFO] Downloading:
2017-03-09\T\02:32:04.933 [INFO] Downloaded:
(9 KB at 263.5 KB/sec)
2017-03-09\T\02:32:04.953 [INFO] Downloading:
2017-03-09\T\02:32:04.953 [INFO] Downloading:
2017-03-09\T\02:32:04.957 [INFO] Downloading:
2017-03-09\T\02:32:04.957 [INFO] Downloading:
2017-03-09\T\02:32:04.958 [INFO] Downloading:
2017-03-09\T\02:32:05.010 [INFO] Downloaded:
(45 KB at 785.2 KB/sec)
2017-03-09\T\02:32:05.010 [INFO] Downloading:
2017-03-09\T\02:32:05.033 [INFO] Downloaded:
(29 KB at 346.0 KB/sec)
2017-03-09\T\02:32:05.033 [INFO] Downloading:
2017-03-09\T\02:32:05.038 [INFO] Downloaded:
(53 KB at 623.7 KB/sec)
2017-03-09\T\02:32:05.038 [INFO] Downloading:
2017-03-09\T\02:32:05.050 [INFO] Downloaded:
(44 KB at 471.6 KB/sec)
2017-03-09\T\02:32:05.050 [INFO] Downloading:
2017-03-09\T\02:32:05.060 [INFO] Downloaded:
(6 KB at 55.4 KB/sec)
2017-03-09\T\02:32:05.060 [INFO] Downloading:
2017-03-09\T\02:32:05.071 [INFO] Downloaded:
(157 KB at 1323.0 KB/sec)
2017-03-09\T\02:32:05.071 [INFO] Downloading:
2017-03-09\T\02:32:05.090 [INFO] Downloaded:
(3 KB at 18.3 KB/sec)
2017-03-09\T\02:32:05.090 [INFO] Downloading:
2017-03-09\T\02:32:05.090 [INFO] Downloaded:
(192 KB at 1411.3 KB/sec)
2017-03-09\T\02:32:05.092 [INFO] Downloading:
2017-03-09\T\02:32:05.110 [INFO] Downloaded:
(33 KB at 212.1 KB/sec)
2017-03-09\T\02:32:05.111 [INFO] Downloading:
2017-03-09\T\02:32:05.129 [INFO] Downloaded:
(5 KB at 25.5 KB/sec)
2017-03-09\T\02:32:05.129 [INFO] Downloading:
2017-03-09\T\02:32:05.137 [INFO] Downloaded:
(5 KB at 23.0 KB/sec)
2017-03-09\T\02:32:05.138 [INFO] Downloading:
2017-03-09\T\02:32:05.160 [INFO] Downloaded:
(285 KB at 1408.7 KB/sec)
2017-03-09\T\02:32:05.170 [INFO] Downloaded:
(46 KB at 216.8 KB/sec)
2017-03-09\T\02:32:05.190 [INFO] Downloaded:
(350 KB at 1504.5 KB/sec)
2017-03-09\T\02:32:05.234 [INFO] Downloaded:
(246 KB at 890.9 KB/sec)
2017-03-09\T\02:32:05.331 [INFO] Downloaded:
(1467 KB at 3920.8 KB/sec)
2017-03-09\T\02:32:05.464 [INFO] Downloading:
2017-03-09\T\02:32:05.491 [INFO] Downloaded:
(2 KB at 56.7 KB/sec)
2017-03-09\T\02:32:05.492 [INFO] Downloading:
2017-03-09\T\02:32:05.519 [INFO] Downloaded:
(13 KB at 477.4 KB/sec)
2017-03-09\T\02:32:05.521 [INFO] Downloading:
2017-03-09\T\02:32:05.554 [INFO] Downloaded:
(39 KB at 1177.3 KB/sec)
2017-03-09\T\02:32:05.557 [INFO] Downloading:
2017-03-09\T\02:32:05.585 [INFO] Downloaded:
(16 KB at 537.0 KB/sec)
2017-03-09\T\02:32:05.590 [INFO] Downloading:
2017-03-09\T\02:32:05.590 [INFO] Downloading:
2017-03-09\T\02:32:05.619 [INFO] Downloaded:
(8 KB at 253.7 KB/sec)
2017-03-09\T\02:32:05.659 [INFO] Downloaded:
(165 KB at 2351.7 KB/sec)
2017-03-09\T\02:32:05.761 [WARNING] 
2017-03-09\T\02:32:05.761 [WARNING] Some problems were encountered while building the effective
model for org.apache.beam:beam-runners-google-cloud-dataflow-java:jar:0.7.0-SNAPSHOT
2017-03-09\T\02:32:05.761 [WARNING] 'dependencies.dependency.(groupId:artifactId:type:classifier)'
must be unique: org.apache.beam:beam-runners-core-construction-java:jar -> duplicate declaration
of version (?) @ org.apache.beam:beam-runners-google-cloud-dataflow-java:[unknown-version],
line 360, column 19
2017-03-09\T\02:32:05.761 [WARNING] 
2017-03-09\T\02:32:05.761 [WARNING] It is highly recommended to fix these problems because
they threaten the stability of your build.
2017-03-09\T\02:32:05.761 [WARNING] 
2017-03-09\T\02:32:05.761 [WARNING] For this reason, future Maven versions might no longer
support building such malformed projects.
2017-03-09\T\02:32:05.761 [WARNING] 
2017-03-09\T\02:32:05.788 [ERROR] [ERROR] Could not find the selected project in the reactor:
sdks/python @ 
2017-03-09\T\02:32:05.810 [ERROR] Could not find the selected project in the reactor: sdks/python
-> [Help 1]
org.apache.maven.MavenExecutionException: Could not find the selected project in the reactor:
	at org.apache.maven.graph.DefaultGraphBuilder.trimExcludedProjects(
	at org.apache.maven.graph.DefaultGraphBuilder.dependencyGraph(
	at org.apache.maven.DefaultMaven.buildGraph(
	at org.apache.maven.DefaultMaven.doExecute(
	at org.apache.maven.DefaultMaven.doExecute(
	at org.apache.maven.DefaultMaven.execute(
	at org.apache.maven.cli.MavenCli.execute(
	at org.apache.maven.cli.MavenCli.doMain(
	at org.apache.maven.cli.MavenCli.main(
	at sun.reflect.NativeMethodAccessorImpl.invoke0(Native Method)
	at sun.reflect.NativeMethodAccessorImpl.invoke(
	at sun.reflect.DelegatingMethodAccessorImpl.invoke(
	at java.lang.reflect.Method.invoke(
	at org.codehaus.plexus.classworlds.launcher.Launcher.launchEnhanced(
	at org.codehaus.plexus.classworlds.launcher.Launcher.launch(
	at org.codehaus.plexus.classworlds.launcher.Launcher.mainWithExitCode(
	at org.codehaus.plexus.classworlds.launcher.Launcher.main(
2017-03-09\T\02:32:05.810 [ERROR] 
2017-03-09\T\02:32:05.810 [ERROR] Re-run Maven using the -X switch to enable full debug logging.
2017-03-09\T\02:32:05.810 [ERROR] 
2017-03-09\T\02:32:05.811 [ERROR] For more information about the errors and possible solutions,
please read the following articles:
2017-03-09\T\02:32:05.811 [ERROR] [Help 1]
Build step 'Invoke top-level Maven targets' marked build as failure

View raw message