beam-commits mailing list archives

Site index · List index
Message view « Date » · « Thread »
Top « Date » · « Thread »
From Apache Jenkins Server <jenk...@builds.apache.org>
Subject Build failed in Jenkins: beam_PostCommit_Java_RunnableOnService_Spark #1197
Date Fri, 10 Mar 2017 19:48:25 GMT
See <https://builds.apache.org/job/beam_PostCommit_Java_RunnableOnService_Spark/1197/display/redirect>

------------------------------------------
[...truncated 635.00 KB...]
2017-03-10T19:46:20.852 [INFO] Downloaded: https://repo.maven.apache.org/maven2/com/typesafe/akka/akka-actor_2.10/2.3.11/akka-actor_2.10-2.3.11.jar
(2596 KB at 2460.5 KB/sec)
2017-03-10T19:46:20.852 [INFO] Downloading: https://repo.maven.apache.org/maven2/io/netty/netty-all/4.0.29.Final/netty-all-4.0.29.Final.jar
2017-03-10T19:46:20.865 [INFO] Downloaded: https://repo.maven.apache.org/maven2/org/scala-lang/scalap/2.10.0/scalap-2.10.0.jar
(835 KB at 781.8 KB/sec)
2017-03-10T19:46:20.865 [INFO] Downloading: https://repo.maven.apache.org/maven2/com/clearspring/analytics/stream/2.7.0/stream-2.7.0.jar
2017-03-10T19:46:20.936 [INFO] Downloaded: https://repo.maven.apache.org/maven2/com/clearspring/analytics/stream/2.7.0/stream-2.7.0.jar
(171 KB at 149.5 KB/sec)
2017-03-10T19:46:20.936 [INFO] Downloading: https://repo.maven.apache.org/maven2/io/dropwizard/metrics/metrics-jvm/3.1.2/metrics-jvm-3.1.2.jar
2017-03-10T19:46:20.941 [INFO] Downloaded: https://repo.maven.apache.org/maven2/org/apache/mesos/mesos/0.21.1/mesos-0.21.1-shaded-protobuf.jar
(1248 KB at 1090.9 KB/sec)
2017-03-10T19:46:20.941 [INFO] Downloading: https://repo.maven.apache.org/maven2/io/dropwizard/metrics/metrics-json/3.1.2/metrics-json-3.1.2.jar
2017-03-10T19:46:20.968 [INFO] Downloaded: https://repo.maven.apache.org/maven2/io/dropwizard/metrics/metrics-jvm/3.1.2/metrics-jvm-3.1.2.jar
(39 KB at 32.8 KB/sec)
2017-03-10T19:46:20.968 [INFO] Downloading: https://repo.maven.apache.org/maven2/io/dropwizard/metrics/metrics-graphite/3.1.2/metrics-graphite-3.1.2.jar
2017-03-10T19:46:20.969 [INFO] Downloaded: https://repo.maven.apache.org/maven2/io/dropwizard/metrics/metrics-json/3.1.2/metrics-json-3.1.2.jar
(16 KB at 13.2 KB/sec)
2017-03-10T19:46:20.969 [INFO] Downloading: https://repo.maven.apache.org/maven2/com/fasterxml/jackson/module/jackson-module-scala_2.10/2.4.4/jackson-module-scala_2.10-2.4.4.jar
2017-03-10T19:46:20.998 [INFO] Downloaded: https://repo.maven.apache.org/maven2/io/dropwizard/metrics/metrics-graphite/3.1.2/metrics-graphite-3.1.2.jar
(21 KB at 17.0 KB/sec)
2017-03-10T19:46:20.998 [INFO] Downloading: https://repo.maven.apache.org/maven2/org/scala-lang/scala-reflect/2.10.4/scala-reflect-2.10.4.jar
2017-03-10T19:46:21.069 [INFO] Downloaded: https://repo.maven.apache.org/maven2/com/fasterxml/jackson/module/jackson-module-scala_2.10/2.4.4/jackson-module-scala_2.10-2.4.4.jar
(537 KB at 421.8 KB/sec)
2017-03-10T19:46:21.069 [INFO] Downloading: https://repo.maven.apache.org/maven2/org/apache/ivy/ivy/2.4.0/ivy-2.4.0.jar
2017-03-10T19:46:21.120 [INFO] Downloaded: https://repo.maven.apache.org/maven2/io/netty/netty-all/4.0.29.Final/netty-all-4.0.29.Final.jar
(2007 KB at 1516.8 KB/sec)
2017-03-10T19:46:21.120 [INFO] Downloading: https://repo.maven.apache.org/maven2/org/tachyonproject/tachyon-client/0.8.2/tachyon-client-0.8.2.jar
2017-03-10T19:46:21.262 [INFO] Downloaded: https://repo.maven.apache.org/maven2/org/apache/spark/spark-core_2.10/1.6.3/spark-core_2.10-1.6.3.jar
(10968 KB at 7460.6 KB/sec)
2017-03-10T19:46:21.263 [INFO] Downloading: https://repo.maven.apache.org/maven2/org/tachyonproject/tachyon-underfs-hdfs/0.8.2/tachyon-underfs-hdfs-0.8.2.jar
2017-03-10T19:46:21.263 [INFO] Downloaded: https://repo.maven.apache.org/maven2/org/apache/ivy/ivy/2.4.0/ivy-2.4.0.jar
(1253 KB at 854.3 KB/sec)
2017-03-10T19:46:21.264 [INFO] Downloading: https://repo.maven.apache.org/maven2/org/tachyonproject/tachyon-underfs-s3/0.8.2/tachyon-underfs-s3-0.8.2.jar
2017-03-10T19:46:21.298 [INFO] Downloaded: https://repo.maven.apache.org/maven2/org/tachyonproject/tachyon-underfs-hdfs/0.8.2/tachyon-underfs-hdfs-0.8.2.jar
(11 KB at 7.2 KB/sec)
2017-03-10T19:46:21.298 [INFO] Downloading: https://repo.maven.apache.org/maven2/org/tachyonproject/tachyon-underfs-local/0.8.2/tachyon-underfs-local-0.8.2.jar
2017-03-10T19:46:21.327 [INFO] Downloaded: https://repo.maven.apache.org/maven2/org/tachyonproject/tachyon-underfs-local/0.8.2/tachyon-underfs-local-0.8.2.jar
(8 KB at 4.6 KB/sec)
2017-03-10T19:46:21.327 [INFO] Downloading: https://repo.maven.apache.org/maven2/net/razorvine/pyrolite/4.9/pyrolite-4.9.jar
2017-03-10T19:46:21.368 [INFO] Downloaded: https://repo.maven.apache.org/maven2/net/razorvine/pyrolite/4.9/pyrolite-4.9.jar
(92 KB at 58.1 KB/sec)
2017-03-10T19:46:21.368 [INFO] Downloaded: https://repo.maven.apache.org/maven2/org/tachyonproject/tachyon-underfs-s3/0.8.2/tachyon-underfs-s3-0.8.2.jar
(494 KB at 314.2 KB/sec)
2017-03-10T19:46:21.368 [INFO] Downloading: https://repo.maven.apache.org/maven2/org/spark-project/spark/unused/1.0.0/unused-1.0.0.jar
2017-03-10T19:46:21.369 [INFO] Downloading: https://repo.maven.apache.org/maven2/net/sf/py4j/py4j/0.9/py4j-0.9.jar
2017-03-10T19:46:21.395 [INFO] Downloaded: https://repo.maven.apache.org/maven2/org/spark-project/spark/unused/1.0.0/unused-1.0.0.jar
(3 KB at 1.7 KB/sec)
2017-03-10T19:46:21.396 [INFO] Downloading: https://repo.maven.apache.org/maven2/org/apache/spark/spark-streaming_2.10/1.6.3/spark-streaming_2.10-1.6.3.jar
2017-03-10T19:46:21.408 [INFO] Downloaded: https://repo.maven.apache.org/maven2/net/sf/py4j/py4j/0.9/py4j-0.9.jar
(83 KB at 51.2 KB/sec)
2017-03-10T19:46:21.408 [INFO] Downloading: https://repo.maven.apache.org/maven2/org/apache/spark/spark-network-common_2.10/1.6.3/spark-network-common_2.10-1.6.3.jar
2017-03-10T19:46:21.410 [INFO] Downloaded: https://repo.maven.apache.org/maven2/org/scala-lang/scala-reflect/2.10.4/scala-reflect-2.10.4.jar
(3129 KB at 1939.5 KB/sec)
2017-03-10T19:46:21.410 [INFO] Downloading: https://repo.maven.apache.org/maven2/org/apache/hadoop/hadoop-common/2.2.0/hadoop-common-2.2.0.jar
2017-03-10T19:46:21.680 [INFO] Downloaded: https://repo.maven.apache.org/maven2/org/apache/spark/spark-streaming_2.10/1.6.3/spark-streaming_2.10-1.6.3.jar
(2005 KB at 1064.5 KB/sec)
2017-03-10T19:46:21.680 [INFO] Downloading: https://repo.maven.apache.org/maven2/org/apache/hadoop/hadoop-annotations/2.2.0/hadoop-annotations-2.2.0.jar
2017-03-10T19:46:21.708 [INFO] Downloaded: https://repo.maven.apache.org/maven2/org/apache/hadoop/hadoop-annotations/2.2.0/hadoop-annotations-2.2.0.jar
(17 KB at 8.6 KB/sec)
2017-03-10T19:46:21.708 [INFO] Downloading: https://repo.maven.apache.org/maven2/org/apache/commons/commons-math/2.1/commons-math-2.1.jar
2017-03-10T19:46:21.788 [INFO] Downloaded: https://repo.maven.apache.org/maven2/org/tachyonproject/tachyon-client/0.8.2/tachyon-client-0.8.2.jar
(2238 KB at 1123.8 KB/sec)
2017-03-10T19:46:21.788 [INFO] Downloading: https://repo.maven.apache.org/maven2/stax/stax-api/1.0.1/stax-api-1.0.1.jar
2017-03-10T19:46:21.795 [INFO] Downloaded: https://repo.maven.apache.org/maven2/org/apache/hadoop/hadoop-common/2.2.0/hadoop-common-2.2.0.jar
(2672 KB at 1337.1 KB/sec)
2017-03-10T19:46:21.795 [INFO] Downloading: https://repo.maven.apache.org/maven2/tomcat/jasper-compiler/5.5.23/jasper-compiler-5.5.23.jar
2017-03-10T19:46:21.818 [INFO] Downloaded: https://repo.maven.apache.org/maven2/stax/stax-api/1.0.1/stax-api-1.0.1.jar
(26 KB at 12.8 KB/sec)
2017-03-10T19:46:21.818 [INFO] Downloading: https://repo.maven.apache.org/maven2/tomcat/jasper-runtime/5.5.23/jasper-runtime-5.5.23.jar
2017-03-10T19:46:21.833 [INFO] Downloaded: https://repo.maven.apache.org/maven2/org/apache/spark/spark-network-common_2.10/1.6.3/spark-network-common_2.10-1.6.3.jar
(2298 KB at 1128.4 KB/sec)
2017-03-10T19:46:21.833 [INFO] Downloading: https://repo.maven.apache.org/maven2/commons-el/commons-el/1.0/commons-el-1.0.jar
2017-03-10T19:46:21.842 [INFO] Downloaded: https://repo.maven.apache.org/maven2/org/apache/commons/commons-math/2.1/commons-math-2.1.jar
(813 KB at 397.5 KB/sec)
2017-03-10T19:46:21.842 [INFO] Downloading: https://repo.maven.apache.org/maven2/org/codehaus/jackson/jackson-core-asl/1.8.8/jackson-core-asl-1.8.8.jar
2017-03-10T19:46:21.856 [INFO] Downloaded: https://repo.maven.apache.org/maven2/tomcat/jasper-runtime/5.5.23/jasper-runtime-5.5.23.jar
(76 KB at 36.4 KB/sec)
2017-03-10T19:46:21.856 [INFO] Downloading: https://repo.maven.apache.org/maven2/org/codehaus/jackson/jackson-mapper-asl/1.8.8/jackson-mapper-asl-1.8.8.jar
2017-03-10T19:46:21.866 [INFO] Downloaded: https://repo.maven.apache.org/maven2/tomcat/jasper-compiler/5.5.23/jasper-compiler-5.5.23.jar
(399 KB at 192.6 KB/sec)
2017-03-10T19:46:21.866 [INFO] Downloading: https://repo.maven.apache.org/maven2/org/apache/hadoop/hadoop-auth/2.2.0/hadoop-auth-2.2.0.jar
2017-03-10T19:46:21.877 [INFO] Downloaded: https://repo.maven.apache.org/maven2/commons-el/commons-el/1.0/commons-el-1.0.jar
(110 KB at 52.7 KB/sec)
2017-03-10T19:46:21.878 [INFO] Downloading: https://repo.maven.apache.org/maven2/org/apache/hadoop/hadoop-mapreduce-client-core/2.2.0/hadoop-mapreduce-client-core-2.2.0.jar
2017-03-10T19:46:21.893 [INFO] Downloaded: https://repo.maven.apache.org/maven2/org/codehaus/jackson/jackson-core-asl/1.8.8/jackson-core-asl-1.8.8.jar
(223 KB at 106.0 KB/sec)
2017-03-10T19:46:21.893 [INFO] Downloading: https://repo.maven.apache.org/maven2/org/apache/hadoop/hadoop-yarn-common/2.2.0/hadoop-yarn-common-2.2.0.jar
2017-03-10T19:46:21.899 [INFO] Downloaded: https://repo.maven.apache.org/maven2/org/apache/hadoop/hadoop-auth/2.2.0/hadoop-auth-2.2.0.jar
(49 KB at 23.1 KB/sec)
2017-03-10T19:46:21.899 [INFO] Downloading: https://repo.maven.apache.org/maven2/com/sun/jersey/jersey-test-framework/jersey-test-framework-grizzly2/1.9/jersey-test-framework-grizzly2-1.9.jar
2017-03-10T19:46:21.935 [INFO] Downloaded: https://repo.maven.apache.org/maven2/com/sun/jersey/jersey-test-framework/jersey-test-framework-grizzly2/1.9/jersey-test-framework-grizzly2-1.9.jar
(13 KB at 5.9 KB/sec)
2017-03-10T19:46:21.935 [INFO] Downloading: https://repo.maven.apache.org/maven2/com/sun/jersey/jersey-test-framework/jersey-test-framework-core/1.9/jersey-test-framework-core-1.9.jar
2017-03-10T19:46:21.955 [INFO] Downloaded: https://repo.maven.apache.org/maven2/org/codehaus/jackson/jackson-mapper-asl/1.8.8/jackson-mapper-asl-1.8.8.jar
(653 KB at 302.5 KB/sec)
2017-03-10T19:46:21.955 [INFO] Downloading: https://repo.maven.apache.org/maven2/javax/servlet/javax.servlet-api/3.0.1/javax.servlet-api-3.0.1.jar
2017-03-10T19:46:21.966 [INFO] Downloaded: https://repo.maven.apache.org/maven2/com/sun/jersey/jersey-test-framework/jersey-test-framework-core/1.9/jersey-test-framework-core-1.9.jar
(28 KB at 12.7 KB/sec)
2017-03-10T19:46:21.966 [INFO] Downloading: https://repo.maven.apache.org/maven2/com/sun/jersey/jersey-grizzly2/1.9/jersey-grizzly2-1.9.jar
2017-03-10T19:46:21.994 [INFO] Downloaded: https://repo.maven.apache.org/maven2/javax/servlet/javax.servlet-api/3.0.1/javax.servlet-api-3.0.1.jar
(84 KB at 37.9 KB/sec)
2017-03-10T19:46:21.994 [INFO] Downloading: https://repo.maven.apache.org/maven2/org/glassfish/grizzly/grizzly-http/2.1.2/grizzly-http-2.1.2.jar
2017-03-10T19:46:21.995 [INFO] Downloaded: https://repo.maven.apache.org/maven2/com/sun/jersey/jersey-grizzly2/1.9/jersey-grizzly2-1.9.jar
(18 KB at 7.8 KB/sec)
2017-03-10T19:46:21.996 [INFO] Downloading: https://repo.maven.apache.org/maven2/org/glassfish/grizzly/grizzly-framework/2.1.2/grizzly-framework-2.1.2.jar
2017-03-10T19:46:22.056 [INFO] Downloaded: https://repo.maven.apache.org/maven2/org/glassfish/grizzly/grizzly-http/2.1.2/grizzly-http-2.1.2.jar
(248 KB at 109.4 KB/sec)
2017-03-10T19:46:22.056 [INFO] Downloading: https://repo.maven.apache.org/maven2/org/glassfish/gmbal/gmbal-api-only/3.0.0-b023/gmbal-api-only-3.0.0-b023.jar
2017-03-10T19:46:22.075 [INFO] Downloaded: https://repo.maven.apache.org/maven2/org/apache/hadoop/hadoop-yarn-common/2.2.0/hadoop-yarn-common-2.2.0.jar
(1272 KB at 558.0 KB/sec)
2017-03-10T19:46:22.075 [INFO] Downloading: https://repo.maven.apache.org/maven2/org/glassfish/external/management-api/3.0.0-b012/management-api-3.0.0-b012.jar
2017-03-10T19:46:22.085 [INFO] Downloaded: https://repo.maven.apache.org/maven2/org/glassfish/gmbal/gmbal-api-only/3.0.0-b023/gmbal-api-only-3.0.0-b023.jar
(22 KB at 9.3 KB/sec)
2017-03-10T19:46:22.086 [INFO] Downloading: https://repo.maven.apache.org/maven2/org/glassfish/grizzly/grizzly-http-server/2.1.2/grizzly-http-server-2.1.2.jar
2017-03-10T19:46:22.104 [INFO] Downloaded: https://repo.maven.apache.org/maven2/org/apache/hadoop/hadoop-mapreduce-client-core/2.2.0/hadoop-mapreduce-client-core-2.2.0.jar
(1421 KB at 615.9 KB/sec)
2017-03-10T19:46:22.104 [INFO] Downloading: https://repo.maven.apache.org/maven2/org/glassfish/grizzly/grizzly-rcm/2.1.2/grizzly-rcm-2.1.2.jar
2017-03-10T19:46:22.105 [INFO] Downloaded: https://repo.maven.apache.org/maven2/org/glassfish/external/management-api/3.0.0-b012/management-api-3.0.0-b012.jar
(42 KB at 17.9 KB/sec)
2017-03-10T19:46:22.105 [INFO] Downloading: https://repo.maven.apache.org/maven2/org/glassfish/grizzly/grizzly-http-servlet/2.1.2/grizzly-http-servlet-2.1.2.jar
2017-03-10T19:46:22.128 [INFO] Downloaded: https://repo.maven.apache.org/maven2/org/glassfish/grizzly/grizzly-http-server/2.1.2/grizzly-http-server-2.1.2.jar
(194 KB at 83.1 KB/sec)
2017-03-10T19:46:22.128 [INFO] Downloading: https://repo.maven.apache.org/maven2/org/glassfish/javax.servlet/3.1/javax.servlet-3.1.jar
2017-03-10T19:46:22.130 [INFO] Downloaded: https://repo.maven.apache.org/maven2/org/glassfish/grizzly/grizzly-framework/2.1.2/grizzly-framework-2.1.2.jar
(675 KB at 289.1 KB/sec)
2017-03-10T19:46:22.131 [INFO] Downloading: https://repo.maven.apache.org/maven2/com/fasterxml/jackson/core/jackson-core/2.4.4/jackson-core-2.4.4.jar
2017-03-10T19:46:22.131 [INFO] Downloaded: https://repo.maven.apache.org/maven2/org/glassfish/grizzly/grizzly-rcm/2.1.2/grizzly-rcm-2.1.2.jar
(8 KB at 3.4 KB/sec)
2017-03-10T19:46:22.132 [INFO] Downloading: https://repo.maven.apache.org/maven2/com/fasterxml/jackson/core/jackson-annotations/2.4.4/jackson-annotations-2.4.4.jar
2017-03-10T19:46:22.165 [INFO] Downloaded: https://repo.maven.apache.org/maven2/org/glassfish/grizzly/grizzly-http-servlet/2.1.2/grizzly-http-servlet-2.1.2.jar
(330 KB at 138.9 KB/sec)
2017-03-10T19:46:22.165 [INFO] Downloading: https://repo.maven.apache.org/maven2/com/fasterxml/jackson/core/jackson-databind/2.4.4/jackson-databind-2.4.4.jar
2017-03-10T19:46:22.166 [INFO] Downloaded: https://repo.maven.apache.org/maven2/com/fasterxml/jackson/core/jackson-annotations/2.4.4/jackson-annotations-2.4.4.jar
(38 KB at 15.9 KB/sec)
2017-03-10T19:46:22.166 [INFO] Downloading: https://repo.maven.apache.org/maven2/jline/jline/0.9.94/jline-0.9.94.jar
2017-03-10T19:46:22.166 [INFO] Downloaded: https://repo.maven.apache.org/maven2/org/glassfish/javax.servlet/3.1/javax.servlet-3.1.jar
(82 KB at 34.6 KB/sec)
2017-03-10T19:46:22.167 [INFO] Downloading: https://repo.maven.apache.org/maven2/org/scala-lang/scala-library/2.10.5/scala-library-2.10.5.jar
2017-03-10T19:46:22.188 [INFO] Downloaded: https://repo.maven.apache.org/maven2/com/fasterxml/jackson/core/jackson-core/2.4.4/jackson-core-2.4.4.jar
(221 KB at 92.0 KB/sec)
2017-03-10T19:46:22.189 [INFO] Downloading: https://repo.maven.apache.org/maven2/org/apache/avro/avro-mapred/1.8.1/avro-mapred-1.8.1-hadoop2.jar
2017-03-10T19:46:22.213 [INFO] Downloaded: https://repo.maven.apache.org/maven2/jline/jline/0.9.94/jline-0.9.94.jar
(86 KB at 35.3 KB/sec)
2017-03-10T19:46:22.213 [INFO] Downloading: https://repo.maven.apache.org/maven2/org/apache/avro/avro-ipc/1.8.1/avro-ipc-1.8.1.jar
2017-03-10T19:46:22.241 [INFO] Downloaded: https://repo.maven.apache.org/maven2/org/apache/avro/avro-mapred/1.8.1/avro-mapred-1.8.1-hadoop2.jar
(182 KB at 74.4 KB/sec)
2017-03-10T19:46:22.241 [INFO] Downloading: https://repo.maven.apache.org/maven2/io/dropwizard/metrics/metrics-core/3.1.2/metrics-core-3.1.2.jar
2017-03-10T19:46:22.276 [INFO] Downloaded: https://repo.maven.apache.org/maven2/org/apache/avro/avro-ipc/1.8.1/avro-ipc-1.8.1.jar
(129 KB at 52.0 KB/sec)
2017-03-10T19:46:22.276 [INFO] Downloading: https://repo.maven.apache.org/maven2/org/apache/kafka/kafka_2.10/0.9.0.1/kafka_2.10-0.9.0.1.jar
2017-03-10T19:46:22.285 [INFO] Downloaded: https://repo.maven.apache.org/maven2/io/dropwizard/metrics/metrics-core/3.1.2/metrics-core-3.1.2.jar
(110 KB at 44.2 KB/sec)
2017-03-10T19:46:22.285 [INFO] Downloading: https://repo.maven.apache.org/maven2/com/101tec/zkclient/0.7/zkclient-0.7.jar
2017-03-10T19:46:22.304 [INFO] Downloaded: https://repo.maven.apache.org/maven2/com/fasterxml/jackson/core/jackson-databind/2.4.4/jackson-databind-2.4.4.jar
(1052 KB at 419.5 KB/sec)
2017-03-10T19:46:22.304 [INFO] Downloading: https://repo.maven.apache.org/maven2/com/yammer/metrics/metrics-core/2.2.0/metrics-core-2.2.0.jar
2017-03-10T19:46:22.324 [INFO] Downloaded: https://repo.maven.apache.org/maven2/com/101tec/zkclient/0.7/zkclient-0.7.jar
(73 KB at 28.5 KB/sec)
2017-03-10T19:46:22.324 [INFO] Downloading: https://repo.maven.apache.org/maven2/net/sf/jopt-simple/jopt-simple/3.2/jopt-simple-3.2.jar
2017-03-10T19:46:22.344 [INFO] Downloaded: https://repo.maven.apache.org/maven2/com/yammer/metrics/metrics-core/2.2.0/metrics-core-2.2.0.jar
(81 KB at 31.5 KB/sec)
2017-03-10T19:46:22.344 [INFO] Downloading: https://repo.maven.apache.org/maven2/com/fasterxml/jackson/dataformat/jackson-dataformat-yaml/2.4.4/jackson-dataformat-yaml-2.4.4.jar
2017-03-10T19:46:22.357 [INFO] Downloaded: https://repo.maven.apache.org/maven2/net/sf/jopt-simple/jopt-simple/3.2/jopt-simple-3.2.jar
(52 KB at 20.3 KB/sec)
2017-03-10T19:46:22.357 [INFO] Downloading: https://repo.maven.apache.org/maven2/org/yaml/snakeyaml/1.12/snakeyaml-1.12.jar
2017-03-10T19:46:22.439 [INFO] Downloaded: https://repo.maven.apache.org/maven2/com/fasterxml/jackson/dataformat/jackson-dataformat-yaml/2.4.4/jackson-dataformat-yaml-2.4.4.jar
(314 KB at 118.6 KB/sec)
2017-03-10T19:46:22.440 [INFO] Downloaded: https://repo.maven.apache.org/maven2/org/scala-lang/scala-compiler/2.10.0/scala-compiler-2.10.0.jar
(13818 KB at 5228.1 KB/sec)
2017-03-10T19:46:22.450 [INFO] Downloaded: https://repo.maven.apache.org/maven2/org/yaml/snakeyaml/1.12/snakeyaml-1.12.jar
(265 KB at 99.7 KB/sec)
2017-03-10T19:46:22.745 [INFO] Downloaded: https://repo.maven.apache.org/maven2/org/apache/kafka/kafka_2.10/0.9.0.1/kafka_2.10-0.9.0.1.jar
(4859 KB at 1648.5 KB/sec)
2017-03-10T19:46:22.811 [INFO] Downloaded: https://repo.maven.apache.org/maven2/org/scala-lang/scala-library/2.10.5/scala-library-2.10.5.jar
(6964 KB at 2310.4 KB/sec)
2017-03-10T19:46:22.835 [INFO] 
2017-03-10T19:46:22.835 [INFO] --- maven-clean-plugin:3.0.0:clean (default-clean) @ beam-runners-spark
---
2017-03-10T19:46:22.838 [INFO] Deleting <https://builds.apache.org/job/beam_PostCommit_Java_RunnableOnService_Spark/ws/runners/spark>
(includes = [**/*.pyc, **/*.egg-info/], excludes = [])
2017-03-10T19:46:22.892 [INFO] 
2017-03-10T19:46:22.892 [INFO] --- maven-enforcer-plugin:1.4.1:enforce (enforce) @ beam-runners-spark
---
2017-03-10T19:46:25.373 [INFO] Downloading: https://repo.maven.apache.org/maven2/commons-codec/commons-codec/1.9/commons-codec-1.9.jar
2017-03-10T19:46:25.422 [INFO] Downloaded: https://repo.maven.apache.org/maven2/commons-codec/commons-codec/1.9/commons-codec-1.9.jar
(258 KB at 5260.8 KB/sec)
2017-03-10T19:46:27.225 [INFO] 
2017-03-10T19:46:27.225 [INFO] --- maven-remote-resources-plugin:1.5:process (process-resource-bundles)
@ beam-runners-spark ---
2017-03-10T19:46:27.748 [INFO] 
2017-03-10T19:46:27.748 [INFO] --- maven-resources-plugin:2.7:resources (default-resources)
@ beam-runners-spark ---
2017-03-10T19:46:27.749 [INFO] Using 'UTF-8' encoding to copy filtered resources.
2017-03-10T19:46:27.749 [INFO] skip non existing resourceDirectory <https://builds.apache.org/job/beam_PostCommit_Java_RunnableOnService_Spark/ws/runners/spark/src/main/resources>
2017-03-10T19:46:27.750 [INFO] Copying 3 resources
2017-03-10T19:46:27.843 [INFO] 
2017-03-10T19:46:27.843 [INFO] --- maven-compiler-plugin:3.6.1:compile (default-compile) @
beam-runners-spark ---
2017-03-10T19:46:27.868 [INFO] Changes detected - recompiling the module!
2017-03-10T19:46:27.869 [INFO] Compiling 91 source files to <https://builds.apache.org/job/beam_PostCommit_Java_RunnableOnService_Spark/ws/runners/spark/target/classes>
2017-03-10T19:46:29.623 [INFO] <https://builds.apache.org/job/beam_PostCommit_Java_RunnableOnService_Spark/ws/runners/spark/src/main/java/org/apache/beam/runners/spark/stateful/SparkStateInternals.java>:
Some input files use or override a deprecated API.
2017-03-10T19:46:29.623 [INFO] <https://builds.apache.org/job/beam_PostCommit_Java_RunnableOnService_Spark/ws/runners/spark/src/main/java/org/apache/beam/runners/spark/stateful/SparkStateInternals.java>:
Recompile with -Xlint:deprecation for details.
2017-03-10T19:46:29.623 [INFO] <https://builds.apache.org/job/beam_PostCommit_Java_RunnableOnService_Spark/ws/runners/spark/src/main/java/org/apache/beam/runners/spark/stateful/StateSpecFunctions.java>:
Some input files use unchecked or unsafe operations.
2017-03-10T19:46:29.623 [INFO] <https://builds.apache.org/job/beam_PostCommit_Java_RunnableOnService_Spark/ws/runners/spark/src/main/java/org/apache/beam/runners/spark/stateful/StateSpecFunctions.java>:
Recompile with -Xlint:unchecked for details.
2017-03-10T19:46:29.623 [INFO] Some messages have been simplified; recompile with -Xdiags:verbose
to get full output
2017-03-10T19:46:29.623 [INFO] -------------------------------------------------------------
2017-03-10T19:46:29.623 [WARNING] COMPILATION WARNING : 
2017-03-10T19:46:29.623 [INFO] -------------------------------------------------------------
2017-03-10T19:46:29.623 [WARNING] bootstrap class path not set in conjunction with -source
1.7
2017-03-10T19:46:29.623 [INFO] 1 warning
2017-03-10T19:46:29.623 [INFO] -------------------------------------------------------------
2017-03-10T19:46:29.623 [INFO] -------------------------------------------------------------
2017-03-10T19:46:29.623 [ERROR] COMPILATION ERROR : 
2017-03-10T19:46:29.623 [INFO] -------------------------------------------------------------
2017-03-10T19:46:29.623 [ERROR] <https://builds.apache.org/job/beam_PostCommit_Java_RunnableOnService_Spark/ws/runners/spark/src/main/java/org/apache/beam/runners/spark/SparkNativePipelineVisitor.java>:[58,49]
incompatible types: org.apache.spark.api.java.JavaSparkContext cannot be converted to org.apache.beam.runners.spark.SparkPipelineOptions
2017-03-10T19:46:29.623 [INFO] 1 error
2017-03-10T19:46:29.623 [INFO] -------------------------------------------------------------
[JENKINS] Archiving disabled
[JENKINS] Archiving disabled
[JENKINS] Archiving disabled
[JENKINS] Archiving disabled
[JENKINS] Archiving disabled
[JENKINS] Archiving disabled
[JENKINS] Archiving disabled
[JENKINS] Archiving disabled
[JENKINS] Archiving disabled
[JENKINS] Archiving disabled
[JENKINS] Archiving disabled
[JENKINS] Archiving disabled
[JENKINS] Archiving disabled
[JENKINS] Archiving disabled
[JENKINS] Archiving disabled
[JENKINS] Archiving disabled
[JENKINS] Archiving disabled
2017-03-10T19:46:37.601 [INFO] ------------------------------------------------------------------------
2017-03-10T19:46:37.601 [INFO] Reactor Summary:
2017-03-10T19:46:37.601 [INFO] 
2017-03-10T19:46:37.601 [INFO] Apache Beam :: Parent .............................. SUCCESS
[ 16.830 s]
2017-03-10T19:46:37.601 [INFO] Apache Beam :: SDKs :: Java :: Build Tools ......... SUCCESS
[  3.447 s]
2017-03-10T19:46:37.602 [INFO] Apache Beam :: SDKs ................................ SUCCESS
[  2.603 s]
2017-03-10T19:46:37.602 [INFO] Apache Beam :: SDKs :: Common ...................... SUCCESS
[  0.955 s]
2017-03-10T19:46:37.602 [INFO] Apache Beam :: SDKs :: Common :: Fn API ............ SUCCESS
[  8.581 s]
2017-03-10T19:46:37.602 [INFO] Apache Beam :: SDKs :: Common :: Runner API ........ SUCCESS
[  3.082 s]
2017-03-10T19:46:37.602 [INFO] Apache Beam :: SDKs :: Java ........................ SUCCESS
[  2.090 s]
2017-03-10T19:46:37.602 [INFO] Apache Beam :: SDKs :: Java :: Core ................ SUCCESS
[01:56 min]
2017-03-10T19:46:37.602 [INFO] Apache Beam :: Runners ............................. SUCCESS
[  2.194 s]
2017-03-10T19:46:37.602 [INFO] Apache Beam :: Runners :: Core Java Construction ... SUCCESS
[  8.310 s]
2017-03-10T19:46:37.603 [INFO] Apache Beam :: Runners :: Core Java ................ SUCCESS
[ 35.340 s]
2017-03-10T19:46:37.603 [INFO] Apache Beam :: Runners :: Direct Java .............. SUCCESS
[02:19 min]
2017-03-10T19:46:37.603 [INFO] Apache Beam :: SDKs :: Java :: IO .................. SUCCESS
[  0.869 s]
2017-03-10T19:46:37.603 [INFO] Apache Beam :: SDKs :: Java :: IO :: Hadoop Common . SUCCESS
[ 11.308 s]
2017-03-10T19:46:37.603 [INFO] Apache Beam :: SDKs :: Java :: IO :: Kafka ......... SUCCESS
[ 16.515 s]
2017-03-10T19:46:37.603 [INFO] Apache Beam :: Runners :: Spark .................... FAILURE
[ 14.814 s]
2017-03-10T19:46:37.603 [INFO] ------------------------------------------------------------------------
2017-03-10T19:46:37.603 [INFO] BUILD FAILURE
2017-03-10T19:46:37.603 [INFO] ------------------------------------------------------------------------
2017-03-10T19:46:37.604 [INFO] Total time: 06:57 min
2017-03-10T19:46:37.604 [INFO] Finished at: 2017-03-10T19:46:37+00:00
2017-03-10T19:46:38.325 [INFO] Final Memory: 135M/1709M
2017-03-10T19:46:38.325 [INFO] ------------------------------------------------------------------------
Waiting for Jenkins to finish collecting data
2017-03-10T19:48:17.333 [ERROR] Failed to execute goal org.apache.maven.plugins:maven-compiler-plugin:3.6.1:compile
(default-compile) on project beam-runners-spark: Compilation failure
2017-03-10T19:48:17.333 [ERROR] <https://builds.apache.org/job/beam_PostCommit_Java_RunnableOnService_Spark/ws/runners/spark/src/main/java/org/apache/beam/runners/spark/SparkNativePipelineVisitor.java>:[58,49]
incompatible types: org.apache.spark.api.java.JavaSparkContext cannot be converted to org.apache.beam.runners.spark.SparkPipelineOptions
2017-03-10T19:48:17.333 [ERROR] -> [Help 1]
org.apache.maven.lifecycle.LifecycleExecutionException: Failed to execute goal org.apache.maven.plugins:maven-compiler-plugin:3.6.1:compile
(default-compile) on project beam-runners-spark: Compilation failure
<https://builds.apache.org/job/beam_PostCommit_Java_RunnableOnService_Spark/ws/runners/spark/src/main/java/org/apache/beam/runners/spark/SparkNativePipelineVisitor.java>:[58,49]
incompatible types: org.apache.spark.api.java.JavaSparkContext cannot be converted to org.apache.beam.runners.spark.SparkPipelineOptions

	at org.apache.maven.lifecycle.internal.MojoExecutor.execute(MojoExecutor.java:212)
	at org.apache.maven.lifecycle.internal.MojoExecutor.execute(MojoExecutor.java:153)
	at org.apache.maven.lifecycle.internal.MojoExecutor.execute(MojoExecutor.java:145)
	at org.apache.maven.lifecycle.internal.LifecycleModuleBuilder.buildProject(LifecycleModuleBuilder.java:116)
	at org.apache.maven.lifecycle.internal.LifecycleModuleBuilder.buildProject(LifecycleModuleBuilder.java:80)
	at org.apache.maven.lifecycle.internal.builder.singlethreaded.SingleThreadedBuilder.build(SingleThreadedBuilder.java:51)
	at org.apache.maven.lifecycle.internal.LifecycleStarter.execute(LifecycleStarter.java:128)
	at org.apache.maven.DefaultMaven.doExecute(DefaultMaven.java:307)
	at org.apache.maven.DefaultMaven.doExecute(DefaultMaven.java:193)
	at org.apache.maven.DefaultMaven.execute(DefaultMaven.java:106)
	at org.jvnet.hudson.maven3.launcher.Maven33Launcher.main(Maven33Launcher.java:129)
	at sun.reflect.NativeMethodAccessorImpl.invoke0(Native Method)
	at sun.reflect.NativeMethodAccessorImpl.invoke(NativeMethodAccessorImpl.java:62)
	at sun.reflect.DelegatingMethodAccessorImpl.invoke(DelegatingMethodAccessorImpl.java:43)
	at java.lang.reflect.Method.invoke(Method.java:498)
	at org.codehaus.plexus.classworlds.launcher.Launcher.launchStandard(Launcher.java:330)
	at org.codehaus.plexus.classworlds.launcher.Launcher.launch(Launcher.java:238)
	at jenkins.maven3.agent.Maven33Main.launch(Maven33Main.java:176)
	at sun.reflect.NativeMethodAccessorImpl.invoke0(Native Method)
	at sun.reflect.NativeMethodAccessorImpl.invoke(NativeMethodAccessorImpl.java:62)
	at sun.reflect.DelegatingMethodAccessorImpl.invoke(DelegatingMethodAccessorImpl.java:43)
	at java.lang.reflect.Method.invoke(Method.java:498)
	at hudson.maven.Maven3Builder.call(Maven3Builder.java:139)
	at hudson.maven.Maven3Builder.call(Maven3Builder.java:70)
	at hudson.remoting.UserRequest.perform(UserRequest.java:153)
	at hudson.remoting.UserRequest.perform(UserRequest.java:50)
	at hudson.remoting.Request$2.run(Request.java:336)
	at hudson.remoting.InterceptingExecutorService$1.call(InterceptingExecutorService.java:68)
	at java.util.concurrent.FutureTask.run(FutureTask.java:266)
	at java.util.concurrent.ThreadPoolExecutor.runWorker(ThreadPoolExecutor.java:1142)
	at java.util.concurrent.ThreadPoolExecutor$Worker.run(ThreadPoolExecutor.java:617)
	at java.lang.Thread.run(Thread.java:745)
Caused by: org.apache.maven.plugin.compiler.CompilationFailureException: Compilation failure
<https://builds.apache.org/job/beam_PostCommit_Java_RunnableOnService_Spark/ws/runners/spark/src/main/java/org/apache/beam/runners/spark/SparkNativePipelineVisitor.java>:[58,49]
incompatible types: org.apache.spark.api.java.JavaSparkContext cannot be converted to org.apache.beam.runners.spark.SparkPipelineOptions

	at org.apache.maven.plugin.compiler.AbstractCompilerMojo.execute(AbstractCompilerMojo.java:1029)
	at org.apache.maven.plugin.compiler.CompilerMojo.execute(CompilerMojo.java:137)
	at org.apache.maven.plugin.DefaultBuildPluginManager.executeMojo(DefaultBuildPluginManager.java:134)
	at org.apache.maven.lifecycle.internal.MojoExecutor.execute(MojoExecutor.java:208)
	... 31 more
2017-03-10T19:48:17.334 [ERROR] 
2017-03-10T19:48:17.334 [ERROR] Re-run Maven using the -X switch to enable full debug logging.
2017-03-10T19:48:17.334 [ERROR] 
2017-03-10T19:48:17.334 [ERROR] For more information about the errors and possible solutions,
please read the following articles:
2017-03-10T19:48:17.334 [ERROR] [Help 1] http://cwiki.apache.org/confluence/display/MAVEN/MojoFailureException
2017-03-10T19:48:17.335 [ERROR] 
2017-03-10T19:48:17.335 [ERROR] After correcting the problems, you can resume the build with
the command
2017-03-10T19:48:17.335 [ERROR]   mvn <goals> -rf :beam-runners-spark
channel stopped

Mime
View raw message