beam-commits mailing list archives

Site index · List index
Message view « Date » · « Thread »
Top « Date » · « Thread »
From Apache Jenkins Server <jenk...@builds.apache.org>
Subject Build failed in Jenkins: beam_PostCommit_Java_Version_Test » JDK 1.7 (latest),beam #20
Date Wed, 15 Mar 2017 20:41:17 GMT
See <https://builds.apache.org/job/beam_PostCommit_Java_Version_Test/jdk=JDK%201.7%20(latest),label=beam/20/display/redirect?page=changes>

Changes:

[aljoscha.krettek] [BEAM-1689] Apply changes for Flink's StatefulDoFnRunner to the primary

[tgroh] Stop Double-finalizing checkpoints in the DirectRunner

[tgroh] Prevent Double-Close in UnboundedReadEvaluatorFactory

[altay] [BEAM-1694] Fix docstring inaccuracies in Python-SDK

[davor] [BEAM-1092] Shade commonly used libraries (e.g. Guava) to avoid class

[davor] [BEAM-1092] Replace hyphens in artifactId with dots in shading

[tgroh] Remove two unused fields

[tgroh] Condense BigQueryIO.Read.Bound into BigQueryIO.Read

[tgroh] Condense BigQueryIO.Write.Bound into BigQueryIO.Write

[tgroh] Makes NameUtils recognize AutoValue classes

[tgroh] Use AutoValue for BigQueryIO.Read

[tgroh] Use AutoValue for BigQueryIO.Write

[tgroh] Simplify configuration of StreamWithDedup

[tgroh] Replace BigQueryIO.Read.from() with BigQueryIO.read().from()

[tgroh] Replace BigQueryIO.Write.to() with BigQueryIO.write().to()

[jbonofre] [BEAM-1660] Update JdbcIO JavaDoc about withCoder() use to ensure the

[altay] [BEAM-547] Version should be accessed from pom file

[tgroh] Add Create.TimestampedValues.withType

[davor] Add ValueProvider options for DatastoreIO

[altay] Add ValueProvider class for FileBasedSource I/O Transforms

[davor] Increment shade-plugin version back to 3.0.0

------------------------------------------
[...truncated 1.62 MB...]
declare -x NODE_LABELS="beam beam2"
declare -x NODE_NAME="beam2"
declare -x OLDPWD
declare -x PATH="/home/jenkins/tools/java/latest1.7/bin:/usr/local/sbin:/usr/local/bin:/usr/sbin:/usr/bin:/sbin:/bin:/usr/games:/usr/local/games"
declare -x PWD="<https://builds.apache.org/job/beam_PostCommit_Java_Version_Test/jdk=JDK%201.7%20(latest),label=beam/ws/">
declare -x ROOT_BUILD_CAUSE="SCMTRIGGER"
declare -x ROOT_BUILD_CAUSE_SCMTRIGGER="true"
declare -x RUN_CHANGES_DISPLAY_URL="https://builds.apache.org/job/beam_PostCommit_Java_Version_Test/jdk=JDK%201.7%20(latest),label=beam/20/display/redirect?page=changes"
declare -x RUN_DISPLAY_URL="https://builds.apache.org/job/beam_PostCommit_Java_Version_Test/jdk=JDK%201.7%20(latest),label=beam/20/display/redirect"
declare -x SHELL="/bin/bash"
declare -x SHLVL="2"
declare -x SPARK_LOCAL_IP="127.0.0.1"
declare -x SSH_CLIENT="140.211.11.14 48418 22"
declare -x SSH_CONNECTION="140.211.11.14 48418 10.128.0.2 22"
declare -x USER="jenkins"
declare -x WORKSPACE="<https://builds.apache.org/job/beam_PostCommit_Java_Version_Test/jdk=JDK%201.7%20(latest),label=beam/ws/">
declare -x XDG_RUNTIME_DIR="/run/user/9997"
declare -x XDG_SESSION_ID="68"
declare -x XFILESEARCHPATH="/usr/dt/app-defaults/%L/Dt"
declare -x jdk="JDK 1.7 (latest)"
declare -x label="beam"
declare -x sha1="master"
[beam] $ /home/jenkins/tools/maven/apache-maven-3.3.3/bin/mvn -f pom.xml -Dsha1=master "-Djdk=JDK
1.7 (latest)" -Dlabel=beam "-Dmaven.repo.local=<https://builds.apache.org/job/beam_PostCommit_Java_Version_Test/jdk=JDK%201.7%20(latest),label=beam/ws/.repository">
-B -e -P dataflow-runner clean install -DskipITs=false '-DintegrationTestPipelineOptions=[
"--project=apache-beam-testing", "--tempRoot=gs://temp-storage-for-end-to-end-tests", "--runner=org.apache.beam.runners.dataflow.testing.TestDataflowRunner"
]'
/home/jenkins/tools/maven/apache-maven-3.3.3/bin/mvn: 200: local: 1.7: bad variable name
2017-03-15\T\20:39:05.104 [INFO] Error stacktraces are turned on.
2017-03-15\T\20:39:05.152 [INFO] Scanning for projects...
2017-03-15\T\20:39:05.369 [INFO] Downloading: https://repo.maven.apache.org/maven2/org/apache/apache/18/apache-18.pom
2017-03-15\T\20:39:05.661 [INFO] Downloaded: https://repo.maven.apache.org/maven2/org/apache/apache/18/apache-18.pom
(16 KB at 51.7 KB/sec)
2017-03-15\T\20:39:06.116 [INFO] Downloading: https://repo.maven.apache.org/maven2/kr/motd/maven/os-maven-plugin/1.4.0.Final/os-maven-plugin-1.4.0.Final.pom
2017-03-15\T\20:39:06.148 [INFO] Downloaded: https://repo.maven.apache.org/maven2/kr/motd/maven/os-maven-plugin/1.4.0.Final/os-maven-plugin-1.4.0.Final.pom
(7 KB at 188.9 KB/sec)
2017-03-15\T\20:39:06.152 [INFO] Downloading: https://repo.maven.apache.org/maven2/org/sonatype/oss/oss-parent/9/oss-parent-9.pom
2017-03-15\T\20:39:06.184 [INFO] Downloaded: https://repo.maven.apache.org/maven2/org/sonatype/oss/oss-parent/9/oss-parent-9.pom
(7 KB at 200.5 KB/sec)
2017-03-15\T\20:39:06.204 [INFO] Downloading: https://repo.maven.apache.org/maven2/org/apache/maven/maven-plugin-api/3.2.1/maven-plugin-api-3.2.1.pom
2017-03-15\T\20:39:06.234 [INFO] Downloaded: https://repo.maven.apache.org/maven2/org/apache/maven/maven-plugin-api/3.2.1/maven-plugin-api-3.2.1.pom
(4 KB at 110.1 KB/sec)
2017-03-15\T\20:39:06.236 [INFO] Downloading: https://repo.maven.apache.org/maven2/org/apache/maven/maven/3.2.1/maven-3.2.1.pom
2017-03-15\T\20:39:06.275 [INFO] Downloaded: https://repo.maven.apache.org/maven2/org/apache/maven/maven/3.2.1/maven-3.2.1.pom
(23 KB at 565.6 KB/sec)
2017-03-15\T\20:39:06.278 [INFO] Downloading: https://repo.maven.apache.org/maven2/org/apache/maven/maven-parent/23/maven-parent-23.pom
2017-03-15\T\20:39:06.315 [INFO] Downloaded: https://repo.maven.apache.org/maven2/org/apache/maven/maven-parent/23/maven-parent-23.pom
(32 KB at 860.1 KB/sec)
2017-03-15\T\20:39:06.319 [INFO] Downloading: https://repo.maven.apache.org/maven2/org/apache/apache/13/apache-13.pom
2017-03-15\T\20:39:06.350 [INFO] Downloaded: https://repo.maven.apache.org/maven2/org/apache/apache/13/apache-13.pom
(14 KB at 454.9 KB/sec)
2017-03-15\T\20:39:06.356 [INFO] Downloading: https://repo.maven.apache.org/maven2/org/apache/maven/maven-model/3.2.1/maven-model-3.2.1.pom
2017-03-15\T\20:39:06.385 [INFO] Downloaded: https://repo.maven.apache.org/maven2/org/apache/maven/maven-model/3.2.1/maven-model-3.2.1.pom
(5 KB at 139.4 KB/sec)
2017-03-15\T\20:39:06.389 [INFO] Downloading: https://repo.maven.apache.org/maven2/org/codehaus/plexus/plexus-utils/3.0.17/plexus-utils-3.0.17.pom
2017-03-15\T\20:39:06.418 [INFO] Downloaded: https://repo.maven.apache.org/maven2/org/codehaus/plexus/plexus-utils/3.0.17/plexus-utils-3.0.17.pom
(4 KB at 114.3 KB/sec)
2017-03-15\T\20:39:06.420 [INFO] Downloading: https://repo.maven.apache.org/maven2/org/codehaus/plexus/plexus/3.3.1/plexus-3.3.1.pom
2017-03-15\T\20:39:06.451 [INFO] Downloaded: https://repo.maven.apache.org/maven2/org/codehaus/plexus/plexus/3.3.1/plexus-3.3.1.pom
(20 KB at 644.1 KB/sec)
2017-03-15\T\20:39:06.454 [INFO] Downloading: https://repo.maven.apache.org/maven2/org/sonatype/spice/spice-parent/17/spice-parent-17.pom
2017-03-15\T\20:39:06.482 [INFO] Downloaded: https://repo.maven.apache.org/maven2/org/sonatype/spice/spice-parent/17/spice-parent-17.pom
(7 KB at 244.5 KB/sec)
2017-03-15\T\20:39:06.484 [INFO] Downloading: https://repo.maven.apache.org/maven2/org/sonatype/forge/forge-parent/10/forge-parent-10.pom
2017-03-15\T\20:39:06.514 [INFO] Downloaded: https://repo.maven.apache.org/maven2/org/sonatype/forge/forge-parent/10/forge-parent-10.pom
(14 KB at 441.4 KB/sec)
2017-03-15\T\20:39:06.518 [INFO] Downloading: https://repo.maven.apache.org/maven2/org/apache/maven/maven-artifact/3.2.1/maven-artifact-3.2.1.pom
2017-03-15\T\20:39:06.546 [INFO] Downloaded: https://repo.maven.apache.org/maven2/org/apache/maven/maven-artifact/3.2.1/maven-artifact-3.2.1.pom
(2 KB at 68.7 KB/sec)
2017-03-15\T\20:39:06.552 [INFO] Downloading: https://repo.maven.apache.org/maven2/org/eclipse/sisu/org.eclipse.sisu.plexus/0.0.0.M5/org.eclipse.sisu.plexus-0.0.0.M5.pom
2017-03-15\T\20:39:06.580 [INFO] Downloaded: https://repo.maven.apache.org/maven2/org/eclipse/sisu/org.eclipse.sisu.plexus/0.0.0.M5/org.eclipse.sisu.plexus-0.0.0.M5.pom
(5 KB at 168.5 KB/sec)
2017-03-15\T\20:39:06.582 [INFO] Downloading: https://repo.maven.apache.org/maven2/org/eclipse/sisu/sisu-plexus/0.0.0.M5/sisu-plexus-0.0.0.M5.pom
2017-03-15\T\20:39:06.613 [INFO] Downloaded: https://repo.maven.apache.org/maven2/org/eclipse/sisu/sisu-plexus/0.0.0.M5/sisu-plexus-0.0.0.M5.pom
(13 KB at 415.9 KB/sec)
2017-03-15\T\20:39:06.616 [INFO] Downloading: https://repo.maven.apache.org/maven2/org/sonatype/oss/oss-parent/7/oss-parent-7.pom
2017-03-15\T\20:39:06.644 [INFO] Downloaded: https://repo.maven.apache.org/maven2/org/sonatype/oss/oss-parent/7/oss-parent-7.pom
(5 KB at 168.2 KB/sec)
2017-03-15\T\20:39:06.647 [INFO] Downloading: https://repo.maven.apache.org/maven2/javax/enterprise/cdi-api/1.0/cdi-api-1.0.pom
2017-03-15\T\20:39:06.676 [INFO] Downloaded: https://repo.maven.apache.org/maven2/javax/enterprise/cdi-api/1.0/cdi-api-1.0.pom
(2 KB at 50.0 KB/sec)
2017-03-15\T\20:39:06.678 [INFO] Downloading: https://repo.maven.apache.org/maven2/org/jboss/weld/weld-api-parent/1.0/weld-api-parent-1.0.pom
2017-03-15\T\20:39:06.717 [INFO] Downloaded: https://repo.maven.apache.org/maven2/org/jboss/weld/weld-api-parent/1.0/weld-api-parent-1.0.pom
(3 KB at 57.5 KB/sec)
2017-03-15\T\20:39:06.719 [INFO] Downloading: https://repo.maven.apache.org/maven2/org/jboss/weld/weld-api-bom/1.0/weld-api-bom-1.0.pom
2017-03-15\T\20:39:06.750 [INFO] Downloaded: https://repo.maven.apache.org/maven2/org/jboss/weld/weld-api-bom/1.0/weld-api-bom-1.0.pom
(8 KB at 249.1 KB/sec)
2017-03-15\T\20:39:06.752 [INFO] Downloading: https://repo.maven.apache.org/maven2/org/jboss/weld/weld-parent/6/weld-parent-6.pom
2017-03-15\T\20:39:06.785 [INFO] Downloaded: https://repo.maven.apache.org/maven2/org/jboss/weld/weld-parent/6/weld-parent-6.pom
(21 KB at 631.5 KB/sec)
2017-03-15\T\20:39:06.790 [INFO] Downloading: https://repo.maven.apache.org/maven2/javax/annotation/jsr250-api/1.0/jsr250-api-1.0.pom
2017-03-15\T\20:39:06.819 [INFO] Downloaded: https://repo.maven.apache.org/maven2/javax/annotation/jsr250-api/1.0/jsr250-api-1.0.pom
(1023 B at 35.7 KB/sec)
2017-03-15\T\20:39:06.821 [INFO] Downloading: https://repo.maven.apache.org/maven2/javax/inject/javax.inject/1/javax.inject-1.pom
2017-03-15\T\20:39:06.850 [INFO] Downloaded: https://repo.maven.apache.org/maven2/javax/inject/javax.inject/1/javax.inject-1.pom
(612 B at 21.3 KB/sec)
2017-03-15\T\20:39:06.864 [INFO] Downloading: https://repo.maven.apache.org/maven2/com/google/guava/guava/10.0.1/guava-10.0.1.pom
2017-03-15\T\20:39:06.893 [INFO] Downloaded: https://repo.maven.apache.org/maven2/com/google/guava/guava/10.0.1/guava-10.0.1.pom
(6 KB at 175.3 KB/sec)
2017-03-15\T\20:39:06.895 [INFO] Downloading: https://repo.maven.apache.org/maven2/com/google/guava/guava-parent/10.0.1/guava-parent-10.0.1.pom
2017-03-15\T\20:39:06.924 [INFO] Downloaded: https://repo.maven.apache.org/maven2/com/google/guava/guava-parent/10.0.1/guava-parent-10.0.1.pom
(2 KB at 66.0 KB/sec)
2017-03-15\T\20:39:06.927 [INFO] Downloading: https://repo.maven.apache.org/maven2/com/google/code/findbugs/jsr305/1.3.9/jsr305-1.3.9.pom
2017-03-15\T\20:39:06.954 [INFO] Downloaded: https://repo.maven.apache.org/maven2/com/google/code/findbugs/jsr305/1.3.9/jsr305-1.3.9.pom
(965 B at 34.9 KB/sec)
2017-03-15\T\20:39:06.956 [INFO] Downloading: https://repo.maven.apache.org/maven2/org/sonatype/sisu/sisu-guice/3.1.0/sisu-guice-3.1.0.pom
2017-03-15\T\20:39:06.985 [INFO] Downloaded: https://repo.maven.apache.org/maven2/org/sonatype/sisu/sisu-guice/3.1.0/sisu-guice-3.1.0.pom
(10 KB at 341.8 KB/sec)
2017-03-15\T\20:39:06.988 [INFO] Downloading: https://repo.maven.apache.org/maven2/org/sonatype/sisu/inject/guice-parent/3.1.0/guice-parent-3.1.0.pom
2017-03-15\T\20:39:07.027 [INFO] Downloaded: https://repo.maven.apache.org/maven2/org/sonatype/sisu/inject/guice-parent/3.1.0/guice-parent-3.1.0.pom
(11 KB at 273.6 KB/sec)
2017-03-15\T\20:39:07.031 [INFO] Downloading: https://repo.maven.apache.org/maven2/aopalliance/aopalliance/1.0/aopalliance-1.0.pom
2017-03-15\T\20:39:07.058 [INFO] Downloaded: https://repo.maven.apache.org/maven2/aopalliance/aopalliance/1.0/aopalliance-1.0.pom
(363 B at 13.1 KB/sec)
2017-03-15\T\20:39:07.061 [INFO] Downloading: https://repo.maven.apache.org/maven2/org/eclipse/sisu/org.eclipse.sisu.inject/0.0.0.M5/org.eclipse.sisu.inject-0.0.0.M5.pom
2017-03-15\T\20:39:07.088 [INFO] Downloaded: https://repo.maven.apache.org/maven2/org/eclipse/sisu/org.eclipse.sisu.inject/0.0.0.M5/org.eclipse.sisu.inject-0.0.0.M5.pom
(3 KB at 91.1 KB/sec)
2017-03-15\T\20:39:07.090 [INFO] Downloading: https://repo.maven.apache.org/maven2/org/eclipse/sisu/sisu-inject/0.0.0.M5/sisu-inject-0.0.0.M5.pom
2017-03-15\T\20:39:07.121 [INFO] Downloaded: https://repo.maven.apache.org/maven2/org/eclipse/sisu/sisu-inject/0.0.0.M5/sisu-inject-0.0.0.M5.pom
(14 KB at 440.9 KB/sec)
2017-03-15\T\20:39:07.136 [INFO] Downloading: https://repo.maven.apache.org/maven2/org/codehaus/plexus/plexus-component-annotations/1.5.5/plexus-component-annotations-1.5.5.pom
2017-03-15\T\20:39:07.162 [INFO] Downloaded: https://repo.maven.apache.org/maven2/org/codehaus/plexus/plexus-component-annotations/1.5.5/plexus-component-annotations-1.5.5.pom
(815 B at 30.6 KB/sec)
2017-03-15\T\20:39:07.164 [INFO] Downloading: https://repo.maven.apache.org/maven2/org/codehaus/plexus/plexus-containers/1.5.5/plexus-containers-1.5.5.pom
2017-03-15\T\20:39:07.192 [INFO] Downloaded: https://repo.maven.apache.org/maven2/org/codehaus/plexus/plexus-containers/1.5.5/plexus-containers-1.5.5.pom
(5 KB at 147.9 KB/sec)
2017-03-15\T\20:39:07.194 [INFO] Downloading: https://repo.maven.apache.org/maven2/org/codehaus/plexus/plexus/2.0.7/plexus-2.0.7.pom
2017-03-15\T\20:39:07.224 [INFO] Downloaded: https://repo.maven.apache.org/maven2/org/codehaus/plexus/plexus/2.0.7/plexus-2.0.7.pom
(17 KB at 563.0 KB/sec)
2017-03-15\T\20:39:07.228 [INFO] Downloading: https://repo.maven.apache.org/maven2/org/codehaus/plexus/plexus-classworlds/2.4/plexus-classworlds-2.4.pom
2017-03-15\T\20:39:07.255 [INFO] Downloaded: https://repo.maven.apache.org/maven2/org/codehaus/plexus/plexus-classworlds/2.4/plexus-classworlds-2.4.pom
(4 KB at 140.4 KB/sec)
2017-03-15\T\20:39:07.258 [INFO] Downloading: https://repo.maven.apache.org/maven2/org/codehaus/plexus/plexus-utils/2.1/plexus-utils-2.1.pom
2017-03-15\T\20:39:07.285 [INFO] Downloaded: https://repo.maven.apache.org/maven2/org/codehaus/plexus/plexus-utils/2.1/plexus-utils-2.1.pom
(4 KB at 145.9 KB/sec)
2017-03-15\T\20:39:07.298 [INFO] Downloading: https://repo.maven.apache.org/maven2/org/sonatype/spice/spice-parent/16/spice-parent-16.pom
2017-03-15\T\20:39:07.328 [INFO] Downloaded: https://repo.maven.apache.org/maven2/org/sonatype/spice/spice-parent/16/spice-parent-16.pom
(9 KB at 272.1 KB/sec)
2017-03-15\T\20:39:07.330 [INFO] Downloading: https://repo.maven.apache.org/maven2/org/sonatype/forge/forge-parent/5/forge-parent-5.pom
2017-03-15\T\20:39:07.358 [INFO] Downloaded: https://repo.maven.apache.org/maven2/org/sonatype/forge/forge-parent/5/forge-parent-5.pom
(9 KB at 291.7 KB/sec)
2017-03-15\T\20:39:07.396 [INFO] Downloading: https://repo.maven.apache.org/maven2/kr/motd/maven/os-maven-plugin/1.4.0.Final/os-maven-plugin-1.4.0.Final.jar
2017-03-15\T\20:39:07.396 [INFO] Downloading: https://repo.maven.apache.org/maven2/org/apache/maven/maven-plugin-api/3.2.1/maven-plugin-api-3.2.1.jar
2017-03-15\T\20:39:07.408 [INFO] Downloading: https://repo.maven.apache.org/maven2/org/apache/maven/maven-model/3.2.1/maven-model-3.2.1.jar
2017-03-15\T\20:39:07.408 [INFO] Downloading: https://repo.maven.apache.org/maven2/org/apache/maven/maven-artifact/3.2.1/maven-artifact-3.2.1.jar
2017-03-15\T\20:39:07.410 [INFO] Downloading: https://repo.maven.apache.org/maven2/org/eclipse/sisu/org.eclipse.sisu.plexus/0.0.0.M5/org.eclipse.sisu.plexus-0.0.0.M5.jar
2017-03-15\T\20:39:07.450 [INFO] Downloaded: https://repo.maven.apache.org/maven2/org/apache/maven/maven-plugin-api/3.2.1/maven-plugin-api-3.2.1.jar
(45 KB at 678.1 KB/sec)
2017-03-15\T\20:39:07.450 [INFO] Downloading: https://repo.maven.apache.org/maven2/javax/enterprise/cdi-api/1.0/cdi-api-1.0.jar
2017-03-15\T\20:39:07.482 [INFO] Downloaded: https://repo.maven.apache.org/maven2/org/apache/maven/maven-artifact/3.2.1/maven-artifact-3.2.1.jar
(53 KB at 616.4 KB/sec)
2017-03-15\T\20:39:07.482 [INFO] Downloading: https://repo.maven.apache.org/maven2/javax/annotation/jsr250-api/1.0/jsr250-api-1.0.jar
2017-03-15\T\20:39:07.489 [INFO] Downloaded: https://repo.maven.apache.org/maven2/javax/enterprise/cdi-api/1.0/cdi-api-1.0.jar
(44 KB at 555.1 KB/sec)
2017-03-15\T\20:39:07.489 [INFO] Downloading: https://repo.maven.apache.org/maven2/javax/inject/javax.inject/1/javax.inject-1.jar
2017-03-15\T\20:39:07.509 [INFO] Downloaded: https://repo.maven.apache.org/maven2/javax/annotation/jsr250-api/1.0/jsr250-api-1.0.jar
(6 KB at 57.1 KB/sec)
2017-03-15\T\20:39:07.509 [INFO] Downloading: https://repo.maven.apache.org/maven2/com/google/guava/guava/10.0.1/guava-10.0.1.jar
2017-03-15\T\20:39:07.515 [INFO] Downloaded: https://repo.maven.apache.org/maven2/javax/inject/javax.inject/1/javax.inject-1.jar
(3 KB at 23.0 KB/sec)
2017-03-15\T\20:39:07.516 [INFO] Downloading: https://repo.maven.apache.org/maven2/com/google/code/findbugs/jsr305/1.3.9/jsr305-1.3.9.jar
2017-03-15\T\20:39:07.550 [INFO] Downloaded: https://repo.maven.apache.org/maven2/com/google/code/findbugs/jsr305/1.3.9/jsr305-1.3.9.jar
(33 KB at 228.7 KB/sec)
2017-03-15\T\20:39:07.550 [INFO] Downloading: https://repo.maven.apache.org/maven2/org/sonatype/sisu/sisu-guice/3.1.0/sisu-guice-3.1.0-no_aop.jar
2017-03-15\T\20:39:07.653 [INFO] Downloaded: https://repo.maven.apache.org/maven2/org/sonatype/sisu/sisu-guice/3.1.0/sisu-guice-3.1.0-no_aop.jar
(350 KB at 1430.5 KB/sec)
2017-03-15\T\20:39:07.653 [INFO] Downloading: https://repo.maven.apache.org/maven2/aopalliance/aopalliance/1.0/aopalliance-1.0.jar
2017-03-15\T\20:39:07.679 [INFO] Downloaded: https://repo.maven.apache.org/maven2/aopalliance/aopalliance/1.0/aopalliance-1.0.jar
(5 KB at 16.2 KB/sec)
2017-03-15\T\20:39:07.679 [INFO] Downloading: https://repo.maven.apache.org/maven2/org/eclipse/sisu/org.eclipse.sisu.inject/0.0.0.M5/org.eclipse.sisu.inject-0.0.0.M5.jar
2017-03-15\T\20:39:07.759 [INFO] Downloaded: https://repo.maven.apache.org/maven2/org/eclipse/sisu/org.eclipse.sisu.inject/0.0.0.M5/org.eclipse.sisu.inject-0.0.0.M5.jar
(285 KB at 815.4 KB/sec)
2017-03-15\T\20:39:07.759 [INFO] Downloading: https://repo.maven.apache.org/maven2/org/codehaus/plexus/plexus-component-annotations/1.5.5/plexus-component-annotations-1.5.5.jar
2017-03-15\T\20:39:07.762 [INFO] Downloaded: https://repo.maven.apache.org/maven2/com/google/guava/guava/10.0.1/guava-10.0.1.jar
(1467 KB at 4154.1 KB/sec)
2017-03-15\T\20:39:07.762 [INFO] Downloading: https://repo.maven.apache.org/maven2/org/codehaus/plexus/plexus-classworlds/2.4/plexus-classworlds-2.4.jar
2017-03-15\T\20:39:07.785 [INFO] Downloaded: https://repo.maven.apache.org/maven2/org/codehaus/plexus/plexus-component-annotations/1.5.5/plexus-component-annotations-1.5.5.jar
(5 KB at 10.9 KB/sec)
2017-03-15\T\20:39:07.785 [INFO] Downloading: https://repo.maven.apache.org/maven2/org/codehaus/plexus/plexus-utils/3.0.17/plexus-utils-3.0.17.jar
2017-03-15\T\20:39:07.806 [INFO] Downloaded: https://repo.maven.apache.org/maven2/org/codehaus/plexus/plexus-classworlds/2.4/plexus-classworlds-2.4.jar
(46 KB at 115.8 KB/sec)
2017-03-15\T\20:39:07.847 [INFO] Downloaded: https://repo.maven.apache.org/maven2/org/codehaus/plexus/plexus-utils/3.0.17/plexus-utils-3.0.17.jar
(246 KB at 561.4 KB/sec)
2017-03-15\T\20:41:14.742 [ERROR] [ERROR] Some problems were encountered while processing
the POMs:
[WARNING] 'build.pluginManagement.plugins.plugin.(groupId:artifactId)' must be unique but
found duplicate declaration of plugin org.codehaus.mojo:build-helper-maven-plugin @ line 1459,
column 17
[ERROR] Unresolveable build extension: Plugin kr.motd.maven:os-maven-plugin:1.4.0.Final or
one of its dependencies could not be resolved: The following artifacts could not be resolved:
kr.motd.maven:os-maven-plugin:jar:1.4.0.Final, org.apache.maven:maven-model:jar:3.2.1, org.eclipse.sisu:org.eclipse.sisu.plexus:jar:0.0.0.M5:
Could not transfer artifact kr.motd.maven:os-maven-plugin:jar:1.4.0.Final from/to central
(https://repo.maven.apache.org/maven2): Connect to repo.maven.apache.org:443 [repo.maven.apache.org/151.101.44.215]
failed: Connection timed out @ 
 @ 
2017-03-15\T\20:41:14.754 [ERROR] The build could not read 1 project -> [Help 1]
org.apache.maven.project.ProjectBuildingException: Some problems were encountered while processing
the POMs:
[WARNING] 'build.pluginManagement.plugins.plugin.(groupId:artifactId)' must be unique but
found duplicate declaration of plugin org.codehaus.mojo:build-helper-maven-plugin @ line 1459,
column 17
[ERROR] Unresolveable build extension: Plugin kr.motd.maven:os-maven-plugin:1.4.0.Final or
one of its dependencies could not be resolved: The following artifacts could not be resolved:
kr.motd.maven:os-maven-plugin:jar:1.4.0.Final, org.apache.maven:maven-model:jar:3.2.1, org.eclipse.sisu:org.eclipse.sisu.plexus:jar:0.0.0.M5:
Could not transfer artifact kr.motd.maven:os-maven-plugin:jar:1.4.0.Final from/to central
(https://repo.maven.apache.org/maven2): Connect to repo.maven.apache.org:443 [repo.maven.apache.org/151.101.44.215]
failed: Connection timed out @ 

	at org.apache.maven.project.DefaultProjectBuilder.build(DefaultProjectBuilder.java:422)
	at org.apache.maven.graph.DefaultGraphBuilder.collectProjects(DefaultGraphBuilder.java:419)
	at org.apache.maven.graph.DefaultGraphBuilder.getProjectsForMavenReactor(DefaultGraphBuilder.java:410)
	at org.apache.maven.graph.DefaultGraphBuilder.build(DefaultGraphBuilder.java:83)
	at org.apache.maven.DefaultMaven.buildGraph(DefaultMaven.java:491)
	at org.apache.maven.DefaultMaven.doExecute(DefaultMaven.java:219)
	at org.apache.maven.DefaultMaven.doExecute(DefaultMaven.java:193)
	at org.apache.maven.DefaultMaven.execute(DefaultMaven.java:106)
	at org.apache.maven.cli.MavenCli.execute(MavenCli.java:862)
	at org.apache.maven.cli.MavenCli.doMain(MavenCli.java:286)
	at org.apache.maven.cli.MavenCli.main(MavenCli.java:197)
	at sun.reflect.NativeMethodAccessorImpl.invoke0(Native Method)
	at sun.reflect.NativeMethodAccessorImpl.invoke(NativeMethodAccessorImpl.java:57)
	at sun.reflect.DelegatingMethodAccessorImpl.invoke(DelegatingMethodAccessorImpl.java:43)
	at java.lang.reflect.Method.invoke(Method.java:606)
	at org.codehaus.plexus.classworlds.launcher.Launcher.launchEnhanced(Launcher.java:289)
	at org.codehaus.plexus.classworlds.launcher.Launcher.launch(Launcher.java:229)
	at org.codehaus.plexus.classworlds.launcher.Launcher.mainWithExitCode(Launcher.java:415)
	at org.codehaus.plexus.classworlds.launcher.Launcher.main(Launcher.java:356)
2017-03-15\T\20:41:14.755 [ERROR]   
2017-03-15\T\20:41:14.755 [ERROR]   The project org.apache.beam:beam-parent:0.7.0-SNAPSHOT
(<https://builds.apache.org/job/beam_PostCommit_Java_Version_Test/jdk=JDK%201.7%20(latest),label=beam/ws/pom.xml)>
has 1 error
2017-03-15\T\20:41:14.755 [ERROR]     Unresolveable build extension: Plugin kr.motd.maven:os-maven-plugin:1.4.0.Final
or one of its dependencies could not be resolved: The following artifacts could not be resolved:
kr.motd.maven:os-maven-plugin:jar:1.4.0.Final, org.apache.maven:maven-model:jar:3.2.1, org.eclipse.sisu:org.eclipse.sisu.plexus:jar:0.0.0.M5:
Could not transfer artifact kr.motd.maven:os-maven-plugin:jar:1.4.0.Final from/to central
(https://repo.maven.apache.org/maven2): Connect to repo.maven.apache.org:443 [repo.maven.apache.org/151.101.44.215]
failed: Connection timed out -> [Help 2]
org.apache.maven.plugin.PluginManagerException: Plugin kr.motd.maven:os-maven-plugin:1.4.0.Final
or one of its dependencies could not be resolved: The following artifacts could not be resolved:
kr.motd.maven:os-maven-plugin:jar:1.4.0.Final, org.apache.maven:maven-model:jar:3.2.1, org.eclipse.sisu:org.eclipse.sisu.plexus:jar:0.0.0.M5:
Could not transfer artifact kr.motd.maven:os-maven-plugin:jar:1.4.0.Final from/to central
(https://repo.maven.apache.org/maven2): Connect to repo.maven.apache.org:443 [repo.maven.apache.org/151.101.44.215]
failed: Connection timed out
	at org.apache.maven.plugin.internal.DefaultMavenPluginManager.setupExtensionsRealm(DefaultMavenPluginManager.java:874)
	at org.apache.maven.project.DefaultProjectBuildingHelper.createProjectRealm(DefaultProjectBuildingHelper.java:196)
	at org.apache.maven.project.DefaultModelBuildingListener.buildExtensionsAssembled(DefaultModelBuildingListener.java:111)
	at org.apache.maven.model.building.ModelBuildingEventCatapult$1.fire(ModelBuildingEventCatapult.java:44)
	at org.apache.maven.model.building.DefaultModelBuilder.fireEvent(DefaultModelBuilder.java:1270)
	at org.apache.maven.model.building.DefaultModelBuilder.build(DefaultModelBuilder.java:437)
	at org.apache.maven.model.building.DefaultModelBuilder.build(DefaultModelBuilder.java:417)
	at org.apache.maven.project.DefaultProjectBuilder.build(DefaultProjectBuilder.java:620)
	at org.apache.maven.project.DefaultProjectBuilder.build(DefaultProjectBuilder.java:411)
	at org.apache.maven.graph.DefaultGraphBuilder.collectProjects(DefaultGraphBuilder.java:419)
	at org.apache.maven.graph.DefaultGraphBuilder.getProjectsForMavenReactor(DefaultGraphBuilder.java:410)
	at org.apache.maven.graph.DefaultGraphBuilder.build(DefaultGraphBuilder.java:83)
	at org.apache.maven.DefaultMaven.buildGraph(DefaultMaven.java:491)
	at org.apache.maven.DefaultMaven.doExecute(DefaultMaven.java:219)
	at org.apache.maven.DefaultMaven.doExecute(DefaultMaven.java:193)
	at org.apache.maven.DefaultMaven.execute(DefaultMaven.java:106)
	at org.apache.maven.cli.MavenCli.execute(MavenCli.java:862)
	at org.apache.maven.cli.MavenCli.doMain(MavenCli.java:286)
	at org.apache.maven.cli.MavenCli.main(MavenCli.java:197)
	at sun.reflect.NativeMethodAccessorImpl.invoke0(Native Method)
	at sun.reflect.NativeMethodAccessorImpl.invoke(NativeMethodAccessorImpl.java:57)
	at sun.reflect.DelegatingMethodAccessorImpl.invoke(DelegatingMethodAccessorImpl.java:43)
	at java.lang.reflect.Method.invoke(Method.java:606)
	at org.codehaus.plexus.classworlds.launcher.Launcher.launchEnhanced(Launcher.java:289)
	at org.codehaus.plexus.classworlds.launcher.Launcher.launch(Launcher.java:229)
	at org.codehaus.plexus.classworlds.launcher.Launcher.mainWithExitCode(Launcher.java:415)
	at org.codehaus.plexus.classworlds.launcher.Launcher.main(Launcher.java:356)
Caused by: org.apache.maven.plugin.PluginResolutionException: Plugin kr.motd.maven:os-maven-plugin:1.4.0.Final
or one of its dependencies could not be resolved: The following artifacts could not be resolved:
kr.motd.maven:os-maven-plugin:jar:1.4.0.Final, org.apache.maven:maven-model:jar:3.2.1, org.eclipse.sisu:org.eclipse.sisu.plexus:jar:0.0.0.M5:
Could not transfer artifact kr.motd.maven:os-maven-plugin:jar:1.4.0.Final from/to central
(https://repo.maven.apache.org/maven2): Connect to repo.maven.apache.org:443 [repo.maven.apache.org/151.101.44.215]
failed: Connection timed out
	at org.apache.maven.plugin.internal.DefaultPluginDependenciesResolver.resolveInternal(DefaultPluginDependenciesResolver.java:218)
	at org.apache.maven.plugin.internal.DefaultPluginDependenciesResolver.resolve(DefaultPluginDependenciesResolver.java:149)
	at org.apache.maven.plugin.internal.DefaultMavenPluginManager.resolveExtensionArtifacts(DefaultMavenPluginManager.java:940)
	at org.apache.maven.plugin.internal.DefaultMavenPluginManager.setupExtensionsRealm(DefaultMavenPluginManager.java:867)
	... 26 more
Caused by: org.eclipse.aether.resolution.ArtifactResolutionException: The following artifacts
could not be resolved: kr.motd.maven:os-maven-plugin:jar:1.4.0.Final, org.apache.maven:maven-model:jar:3.2.1,
org.eclipse.sisu:org.eclipse.sisu.plexus:jar:0.0.0.M5: Could not transfer artifact kr.motd.maven:os-maven-plugin:jar:1.4.0.Final
from/to central (https://repo.maven.apache.org/maven2): Connect to repo.maven.apache.org:443
[repo.maven.apache.org/151.101.44.215] failed: Connection timed out
	at org.eclipse.aether.internal.impl.DefaultArtifactResolver.resolve(DefaultArtifactResolver.java:444)
	at org.eclipse.aether.internal.impl.DefaultArtifactResolver.resolveArtifacts(DefaultArtifactResolver.java:246)
	at org.eclipse.aether.internal.impl.DefaultRepositorySystem.resolveDependencies(DefaultRepositorySystem.java:367)
	at org.apache.maven.plugin.internal.DefaultPluginDependenciesResolver.resolveInternal(DefaultPluginDependenciesResolver.java:210)
	... 29 more
Caused by: org.eclipse.aether.transfer.ArtifactTransferException: Could not transfer artifact
kr.motd.maven:os-maven-plugin:jar:1.4.0.Final from/to central (https://repo.maven.apache.org/maven2):
Connect to repo.maven.apache.org:443 [repo.maven.apache.org/151.101.44.215] failed: Connection
timed out
	at org.eclipse.aether.connector.basic.ArtifactTransportListener.transferFailed(ArtifactTransportListener.java:43)
	at org.eclipse.aether.connector.basic.BasicRepositoryConnector$TaskRunner.run(BasicRepositoryConnector.java:355)
	at org.eclipse.aether.util.concurrency.RunnableErrorForwarder$1.run(RunnableErrorForwarder.java:67)
	at java.util.concurrent.ThreadPoolExecutor.runWorker(ThreadPoolExecutor.java:1145)
	at java.util.concurrent.ThreadPoolExecutor$Worker.run(ThreadPoolExecutor.java:615)
	at java.lang.Thread.run(Thread.java:745)
Caused by: org.apache.maven.wagon.TransferFailedException: Connect to repo.maven.apache.org:443
[repo.maven.apache.org/151.101.44.215] failed: Connection timed out
	at org.apache.maven.wagon.providers.http.AbstractHttpClientWagon.fillInputData(AbstractHttpClientWagon.java:1066)
	at org.apache.maven.wagon.providers.http.AbstractHttpClientWagon.fillInputData(AbstractHttpClientWagon.java:960)
	at org.apache.maven.wagon.StreamWagon.getInputStream(StreamWagon.java:116)
	at org.apache.maven.wagon.StreamWagon.getIfNewer(StreamWagon.java:88)
	at org.apache.maven.wagon.StreamWagon.get(StreamWagon.java:61)
	at org.eclipse.aether.transport.wagon.WagonTransporter$GetTaskRunner.run(WagonTransporter.java:560)
	at org.eclipse.aether.transport.wagon.WagonTransporter.execute(WagonTransporter.java:427)
	at org.eclipse.aether.transport.wagon.WagonTransporter.get(WagonTransporter.java:404)
	at org.eclipse.aether.connector.basic.BasicRepositoryConnector$GetTaskRunner.runTask(BasicRepositoryConnector.java:447)
	at org.eclipse.aether.connector.basic.BasicRepositoryConnector$TaskRunner.run(BasicRepositoryConnector.java:350)
	... 4 more
Caused by: org.apache.maven.wagon.providers.http.httpclient.conn.ConnectTimeoutException:
Connect to repo.maven.apache.org:443 [repo.maven.apache.org/151.101.44.215] failed: Connection
timed out
	at org.apache.maven.wagon.providers.http.httpclient.impl.conn.HttpClientConnectionOperator.connect(HttpClientConnectionOperator.java:138)
	at org.apache.maven.wagon.providers.http.httpclient.impl.conn.PoolingHttpClientConnectionManager.connect(PoolingHttpClientConnectionManager.java:318)
	at org.apache.maven.wagon.providers.http.httpclient.impl.execchain.MainClientExec.establishRoute(MainClientExec.java:363)
	at org.apache.maven.wagon.providers.http.httpclient.impl.execchain.MainClientExec.execute(MainClientExec.java:219)
	at org.apache.maven.wagon.providers.http.httpclient.impl.execchain.ProtocolExec.execute(ProtocolExec.java:195)
	at org.apache.maven.wagon.providers.http.httpclient.impl.execchain.RetryExec.execute(RetryExec.java:86)
	at org.apache.maven.wagon.providers.http.httpclient.impl.execchain.RedirectExec.execute(RedirectExec.java:108)
	at org.apache.maven.wagon.providers.http.httpclient.impl.client.InternalHttpClient.doExecute(InternalHttpClient.java:184)
	at org.apache.maven.wagon.providers.http.httpclient.impl.client.CloseableHttpClient.execute(CloseableHttpClient.java:82)
	at org.apache.maven.wagon.providers.http.AbstractHttpClientWagon.execute(AbstractHttpClientWagon.java:832)
	at org.apache.maven.wagon.providers.http.AbstractHttpClientWagon.fillInputData(AbstractHttpClientWagon.java:983)
	... 13 more
Caused by: java.net.ConnectException: Connection timed out
	at java.net.PlainSocketImpl.socketConnect(Native Method)
	at java.net.AbstractPlainSocketImpl.doConnect(AbstractPlainSocketImpl.java:339)
	at java.net.AbstractPlainSocketImpl.connectToAddress(AbstractPlainSocketImpl.java:200)
	at java.net.AbstractPlainSocketImpl.connect(AbstractPlainSocketImpl.java:182)
	at java.net.SocksSocketImpl.connect(SocksSocketImpl.java:392)
	at java.net.Socket.connect(Socket.java:579)
	at org.apache.maven.wagon.providers.http.httpclient.conn.ssl.SSLConnectionSocketFactory.connectSocket(SSLConnectionSocketFactory.java:239)
	at org.apache.maven.wagon.providers.http.httpclient.impl.conn.HttpClientConnectionOperator.connect(HttpClientConnectionOperator.java:123)
	... 23 more
2017-03-15\T\20:41:14.757 [ERROR] 
2017-03-15\T\20:41:14.757 [ERROR] Re-run Maven using the -X switch to enable full debug logging.
2017-03-15\T\20:41:14.757 [ERROR] 
2017-03-15\T\20:41:14.757 [ERROR] For more information about the errors and possible solutions,
please read the following articles:
2017-03-15\T\20:41:14.757 [ERROR] [Help 1] http://cwiki.apache.org/confluence/display/MAVEN/ProjectBuildingException
2017-03-15\T\20:41:14.757 [ERROR] [Help 2] http://cwiki.apache.org/confluence/display/MAVEN/PluginManagerException
Build step 'Invoke top-level Maven targets' marked build as failure

Mime
View raw message