beam-commits mailing list archives

Site index · List index
Message view « Date » · « Thread »
Top « Date » · « Thread »
From Apache Jenkins Server <jenk...@builds.apache.org>
Subject Build failed in Jenkins: beam_PostCommit_Java_MavenInstall #3010
Date Thu, 23 Mar 2017 21:42:06 GMT
See <https://builds.apache.org/job/beam_PostCommit_Java_MavenInstall/3010/display/redirect>

------------------------------------------
[...truncated 2.40 MB...]
2017-03-23T21:38:15.274 [INFO] Downloaded: https://repo.maven.apache.org/maven2/org/sonatype/oss/oss-parent/6/oss-parent-6.pom
(5 KB at 174.7 KB/sec)
2017-03-23T21:38:15.276 [INFO] Downloading: https://repo.maven.apache.org/maven2/com/googlecode/javaewah/JavaEWAH/0.7.9/JavaEWAH-0.7.9.pom
2017-03-23T21:38:15.303 [INFO] Downloaded: https://repo.maven.apache.org/maven2/com/googlecode/javaewah/JavaEWAH/0.7.9/JavaEWAH-0.7.9.pom
(5 KB at 157.1 KB/sec)
2017-03-23T21:38:15.306 [INFO] Downloading: https://repo.maven.apache.org/maven2/org/slf4j/slf4j-api/1.7.21/slf4j-api-1.7.21.pom
2017-03-23T21:38:15.334 [INFO] Downloaded: https://repo.maven.apache.org/maven2/org/slf4j/slf4j-api/1.7.21/slf4j-api-1.7.21.pom
(3 KB at 96.8 KB/sec)
2017-03-23T21:38:15.335 [INFO] Downloading: https://repo.maven.apache.org/maven2/org/slf4j/slf4j-parent/1.7.21/slf4j-parent-1.7.21.pom
2017-03-23T21:38:15.364 [INFO] Downloaded: https://repo.maven.apache.org/maven2/org/slf4j/slf4j-parent/1.7.21/slf4j-parent-1.7.21.pom
(14 KB at 454.7 KB/sec)
2017-03-23T21:38:15.382 [INFO] Downloading: https://repo.maven.apache.org/maven2/org/codehaus/plexus/plexus-utils/2.0.7/plexus-utils-2.0.7.pom
2017-03-23T21:38:15.408 [INFO] Downloaded: https://repo.maven.apache.org/maven2/org/codehaus/plexus/plexus-utils/2.0.7/plexus-utils-2.0.7.pom
(3 KB at 105.6 KB/sec)
2017-03-23T21:38:15.431 [INFO] Downloading: https://repo.maven.apache.org/maven2/org/sonatype/sisu/sisu-inject-plexus/1.4.3.2/sisu-inject-plexus-1.4.3.2.pom
2017-03-23T21:38:15.460 [INFO] Downloaded: https://repo.maven.apache.org/maven2/org/sonatype/sisu/sisu-inject-plexus/1.4.3.2/sisu-inject-plexus-1.4.3.2.pom
(6 KB at 175.4 KB/sec)
2017-03-23T21:38:15.490 [INFO] Downloading: https://repo.maven.apache.org/maven2/org/sonatype/sisu/inject/guice-plexus/1.4.3.2/guice-plexus-1.4.3.2.pom
2017-03-23T21:38:15.519 [INFO] Downloaded: https://repo.maven.apache.org/maven2/org/sonatype/sisu/inject/guice-plexus/1.4.3.2/guice-plexus-1.4.3.2.pom
(3 KB at 102.2 KB/sec)
2017-03-23T21:38:15.520 [INFO] Downloading: https://repo.maven.apache.org/maven2/org/sonatype/sisu/inject/guice-bean/1.4.3.2/guice-bean-1.4.3.2.pom
2017-03-23T21:38:15.547 [INFO] Downloaded: https://repo.maven.apache.org/maven2/org/sonatype/sisu/inject/guice-bean/1.4.3.2/guice-bean-1.4.3.2.pom
(3 KB at 91.4 KB/sec)
2017-03-23T21:38:15.564 [INFO] Downloading: https://repo.maven.apache.org/maven2/org/sonatype/sisu/sisu-inject/1.4.3.2/sisu-inject-1.4.3.2.pom
2017-03-23T21:38:15.591 [INFO] Downloaded: https://repo.maven.apache.org/maven2/org/sonatype/sisu/sisu-inject/1.4.3.2/sisu-inject-1.4.3.2.pom
(2 KB at 43.5 KB/sec)
2017-03-23T21:38:15.593 [INFO] Downloading: https://repo.maven.apache.org/maven2/org/sonatype/sisu/sisu-parent/1.4.3.2/sisu-parent-1.4.3.2.pom
2017-03-23T21:38:15.621 [INFO] Downloaded: https://repo.maven.apache.org/maven2/org/sonatype/sisu/sisu-parent/1.4.3.2/sisu-parent-1.4.3.2.pom
(8 KB at 281.9 KB/sec)
2017-03-23T21:38:15.623 [INFO] Downloading: https://repo.maven.apache.org/maven2/org/sonatype/sisu/sisu-inject-bean/1.4.3.2/sisu-inject-bean-1.4.3.2.pom
2017-03-23T21:38:15.650 [INFO] Downloaded: https://repo.maven.apache.org/maven2/org/sonatype/sisu/sisu-inject-bean/1.4.3.2/sisu-inject-bean-1.4.3.2.pom
(6 KB at 191.7 KB/sec)
2017-03-23T21:38:15.653 [INFO] Downloading: https://repo.maven.apache.org/maven2/org/sonatype/sisu/sisu-guice/2.9.2/sisu-guice-2.9.2.pom
2017-03-23T21:38:15.681 [INFO] Downloaded: https://repo.maven.apache.org/maven2/org/sonatype/sisu/sisu-guice/2.9.2/sisu-guice-2.9.2.pom
(8 KB at 256.3 KB/sec)
2017-03-23T21:38:15.684 [INFO] Downloading: https://repo.maven.apache.org/maven2/org/sonatype/sisu/inject/guice-parent/2.9.2/guice-parent-2.9.2.pom
2017-03-23T21:38:15.714 [INFO] Downloaded: https://repo.maven.apache.org/maven2/org/sonatype/sisu/inject/guice-parent/2.9.2/guice-parent-2.9.2.pom
(12 KB at 398.6 KB/sec)
2017-03-23T21:38:15.718 [INFO] Downloading: https://repo.maven.apache.org/maven2/org/slf4j/jcl-over-slf4j/1.7.21/jcl-over-slf4j-1.7.21.pom
2017-03-23T21:38:15.744 [INFO] Downloaded: https://repo.maven.apache.org/maven2/org/slf4j/jcl-over-slf4j/1.7.21/jcl-over-slf4j-1.7.21.pom
(963 B at 36.2 KB/sec)
2017-03-23T21:38:15.902 [INFO] Downloading: https://repo.maven.apache.org/maven2/org/apache/httpcomponents/httpmime/4.5.2/httpmime-4.5.2.jar
2017-03-23T21:38:15.903 [INFO] Downloading: https://repo.maven.apache.org/maven2/com/fasterxml/jackson/core/jackson-core/2.8.3/jackson-core-2.8.3.jar
2017-03-23T21:38:15.904 [INFO] Downloading: https://repo.maven.apache.org/maven2/com/fasterxml/jackson/core/jackson-databind/2.8.3/jackson-databind-2.8.3.jar
2017-03-23T21:38:15.904 [INFO] Downloading: https://repo.maven.apache.org/maven2/org/eclipse/jgit/org.eclipse.jgit/4.5.0.201609210915-r/org.eclipse.jgit-4.5.0.201609210915-r.jar
2017-03-23T21:38:15.905 [INFO] Downloading: https://repo.maven.apache.org/maven2/com/fasterxml/jackson/core/jackson-annotations/2.8.3/jackson-annotations-2.8.3.jar
2017-03-23T21:38:15.940 [INFO] Downloaded: https://repo.maven.apache.org/maven2/com/fasterxml/jackson/core/jackson-annotations/2.8.3/jackson-annotations-2.8.3.jar
(55 KB at 1468.8 KB/sec)
2017-03-23T21:38:15.940 [INFO] Downloading: https://repo.maven.apache.org/maven2/com/jcraft/jsch/0.1.53/jsch-0.1.53.jar
2017-03-23T21:38:15.947 [INFO] Downloaded: https://repo.maven.apache.org/maven2/org/apache/httpcomponents/httpmime/4.5.2/httpmime-4.5.2.jar
(41 KB at 890.4 KB/sec)
2017-03-23T21:38:15.947 [INFO] Downloading: https://repo.maven.apache.org/maven2/com/googlecode/javaewah/JavaEWAH/0.7.9/JavaEWAH-0.7.9.jar
2017-03-23T21:38:15.972 [INFO] Downloaded: https://repo.maven.apache.org/maven2/com/fasterxml/jackson/core/jackson-core/2.8.3/jackson-core-2.8.3.jar
(275 KB at 3921.3 KB/sec)
2017-03-23T21:38:15.972 [INFO] Downloading: https://repo.maven.apache.org/maven2/org/codehaus/plexus/plexus-utils/2.0.7/plexus-utils-2.0.7.jar
2017-03-23T21:38:16.008 [INFO] Downloaded: https://repo.maven.apache.org/maven2/com/googlecode/javaewah/JavaEWAH/0.7.9/JavaEWAH-0.7.9.jar
(123 KB at 1175.1 KB/sec)
2017-03-23T21:38:16.008 [INFO] Downloading: https://repo.maven.apache.org/maven2/org/sonatype/sisu/sisu-inject-plexus/1.4.3.2/sisu-inject-plexus-1.4.3.2.jar
2017-03-23T21:38:16.023 [INFO] Downloaded: https://repo.maven.apache.org/maven2/com/jcraft/jsch/0.1.53/jsch-0.1.53.jar
(274 KB at 2299.5 KB/sec)
2017-03-23T21:38:16.023 [INFO] Downloading: https://repo.maven.apache.org/maven2/org/sonatype/sisu/sisu-inject-bean/1.4.3.2/sisu-inject-bean-1.4.3.2.jar
2017-03-23T21:38:16.036 [INFO] Downloaded: https://repo.maven.apache.org/maven2/org/codehaus/plexus/plexus-utils/2.0.7/plexus-utils-2.0.7.jar
(219 KB at 1656.8 KB/sec)
2017-03-23T21:38:16.037 [INFO] Downloading: https://repo.maven.apache.org/maven2/org/sonatype/sisu/sisu-guice/2.9.2/sisu-guice-2.9.2-no_aop.jar
2017-03-23T21:38:16.055 [INFO] Downloaded: https://repo.maven.apache.org/maven2/org/sonatype/sisu/sisu-inject-plexus/1.4.3.2/sisu-inject-plexus-1.4.3.2.jar
(201 KB at 1325.0 KB/sec)
2017-03-23T21:38:16.055 [INFO] Downloading: https://repo.maven.apache.org/maven2/org/slf4j/slf4j-api/1.7.21/slf4j-api-1.7.21.jar
2017-03-23T21:38:16.071 [INFO] Downloaded: https://repo.maven.apache.org/maven2/org/sonatype/sisu/sisu-inject-bean/1.4.3.2/sisu-inject-bean-1.4.3.2.jar
(157 KB at 938.1 KB/sec)
2017-03-23T21:38:16.071 [INFO] Downloading: https://repo.maven.apache.org/maven2/org/slf4j/jcl-over-slf4j/1.7.21/jcl-over-slf4j-1.7.21.jar
2017-03-23T21:38:16.088 [INFO] Downloaded: https://repo.maven.apache.org/maven2/org/slf4j/slf4j-api/1.7.21/slf4j-api-1.7.21.jar
(41 KB at 218.0 KB/sec)
2017-03-23T21:38:16.103 [INFO] Downloaded: https://repo.maven.apache.org/maven2/org/slf4j/jcl-over-slf4j/1.7.21/jcl-over-slf4j-1.7.21.jar
(17 KB at 80.6 KB/sec)
2017-03-23T21:38:16.112 [INFO] Downloaded: https://repo.maven.apache.org/maven2/com/fasterxml/jackson/core/jackson-databind/2.8.3/jackson-databind-2.8.3.jar
(1205 KB at 5792.3 KB/sec)
2017-03-23T21:38:16.116 [INFO] Downloaded: https://repo.maven.apache.org/maven2/org/sonatype/sisu/sisu-guice/2.9.2/sisu-guice-2.9.2-no_aop.jar
(469 KB at 2210.3 KB/sec)
2017-03-23T21:38:16.194 [INFO] Downloaded: https://repo.maven.apache.org/maven2/org/eclipse/jgit/org.eclipse.jgit/4.5.0.201609210915-r/org.eclipse.jgit-4.5.0.201609210915-r.jar
(2324 KB at 8011.6 KB/sec)
2017-03-23T21:38:17.751 [INFO] Starting Coveralls job for jenkins (3010 / https://builds.apache.org/job/beam_PostCommit_Java_MavenInstall/3010/)
2017-03-23T21:38:17.751 [INFO] Using repository token <secret>
2017-03-23T21:38:17.751 [INFO] Git commit a133b4c in pr/2306/head
2017-03-23T21:38:17.751 [INFO] Writing Coveralls data to <https://builds.apache.org/job/beam_PostCommit_Java_MavenInstall/ws/target/coveralls.json...>
2017-03-23T21:38:17.805 [INFO] Processing coverage report from <https://builds.apache.org/job/beam_PostCommit_Java_MavenInstall/ws/sdks/java/core/target/site/jacoco/jacoco.xml>
2017-03-23T21:38:18.391 [INFO] Processing coverage report from <https://builds.apache.org/job/beam_PostCommit_Java_MavenInstall/ws/sdks/java/java8tests/target/site/jacoco/jacoco.xml>
2017-03-23T21:38:18.421 [INFO] Processing coverage report from <https://builds.apache.org/job/beam_PostCommit_Java_MavenInstall/ws/runners/core-java/target/site/jacoco/jacoco.xml>
2017-03-23T21:38:18.755 [INFO] Processing coverage report from <https://builds.apache.org/job/beam_PostCommit_Java_MavenInstall/ws/runners/direct-java/target/site/jacoco/jacoco.xml>
2017-03-23T21:38:18.926 [INFO] Processing coverage report from <https://builds.apache.org/job/beam_PostCommit_Java_MavenInstall/ws/runners/google-cloud-dataflow-java/target/site/jacoco/jacoco.xml>
2017-03-23T21:38:19.108 [INFO] Processing coverage report from <https://builds.apache.org/job/beam_PostCommit_Java_MavenInstall/ws/examples/java/target/site/jacoco/jacoco.xml>
2017-03-23T21:38:19.191 [INFO] Processing coverage report from <https://builds.apache.org/job/beam_PostCommit_Java_MavenInstall/ws/examples/java8/target/site/jacoco/jacoco.xml>
2017-03-23T21:38:19.289 [INFO] Successfully wrote Coveralls data in 1538ms
2017-03-23T21:38:19.289 [INFO] Gathered code coverage metrics for 519 source files with 123321
lines of code:
2017-03-23T21:38:19.289 [INFO] - 30850 relevant lines
2017-03-23T21:38:19.289 [INFO] - 21645 covered lines
2017-03-23T21:38:19.289 [INFO] - 9205 missed lines
2017-03-23T21:38:19.289 [INFO] Submitting Coveralls data to API
2017-03-23T21:39:19.583 [ERROR] Submission failed in 60294ms while handling I/O operations
[JENKINS] Archiving disabled
[JENKINS] Archiving disabled
[JENKINS] Archiving disabled
[JENKINS] Archiving disabled
[JENKINS] Archiving disabled
[JENKINS] Archiving disabled
[JENKINS] Archiving disabled
[JENKINS] Archiving disabled
[JENKINS] Archiving disabled
[JENKINS] Archiving disabled
[JENKINS] Archiving disabled
[JENKINS] Archiving disabled
[JENKINS] Archiving disabled
[JENKINS] Archiving disabled
[JENKINS] Archiving disabled
[JENKINS] Archiving disabled
[JENKINS] Archiving disabled
[JENKINS] Archiving disabled
[JENKINS] Archiving disabled
[JENKINS] Archiving disabled
[JENKINS] Archiving disabled
[JENKINS] Archiving disabled
[JENKINS] Archiving disabled
[JENKINS] Archiving disabled
[JENKINS] Archiving disabled
[JENKINS] Archiving disabled
[JENKINS] Archiving disabled
[JENKINS] Archiving disabled
[JENKINS] Archiving disabled
[JENKINS] Archiving disabled
[JENKINS] Archiving disabled
[JENKINS] Archiving disabled
[JENKINS] Archiving disabled
[JENKINS] Archiving disabled
[JENKINS] Archiving disabled
[JENKINS] Archiving disabled
[JENKINS] Archiving disabled
[JENKINS] Archiving disabled
[JENKINS] Archiving disabled
[JENKINS] Archiving disabled
[JENKINS] Archiving disabled
[JENKINS] Archiving disabled
[JENKINS] Archiving disabled
[JENKINS] Archiving disabled
2017-03-23T21:39:53.797 [INFO] ------------------------------------------------------------------------
2017-03-23T21:39:53.797 [INFO] Reactor Summary:
2017-03-23T21:39:53.798 [INFO] 
2017-03-23T21:39:53.798 [INFO] Apache Beam :: Parent .............................. FAILURE
[01:05 min]
2017-03-23T21:39:53.798 [INFO] Apache Beam :: SDKs :: Java :: Build Tools ......... SUCCESS
[ 14.221 s]
2017-03-23T21:39:53.798 [INFO] Apache Beam :: SDKs ................................ SUCCESS
[  7.625 s]
2017-03-23T21:39:53.798 [INFO] Apache Beam :: SDKs :: Common ...................... SUCCESS
[  6.516 s]
2017-03-23T21:39:53.798 [INFO] Apache Beam :: SDKs :: Common :: Fn API ............ SUCCESS
[ 23.009 s]
2017-03-23T21:39:53.798 [INFO] Apache Beam :: SDKs :: Common :: Runner API ........ SUCCESS
[ 19.600 s]
2017-03-23T21:39:53.798 [INFO] Apache Beam :: SDKs :: Java ........................ SUCCESS
[  8.608 s]
2017-03-23T21:39:53.798 [INFO] Apache Beam :: SDKs :: Java :: Core ................ SUCCESS
[03:34 min]
2017-03-23T21:39:53.798 [INFO] Apache Beam :: SDKs :: Java :: IO .................. SUCCESS
[  5.628 s]
2017-03-23T21:39:53.798 [INFO] Apache Beam :: SDKs :: Java :: IO :: Common ........ SUCCESS
[  7.709 s]
2017-03-23T21:39:53.798 [INFO] Apache Beam :: Runners ............................. SUCCESS
[  9.124 s]
2017-03-23T21:39:53.798 [INFO] Apache Beam :: Runners :: Core Java Construction ... SUCCESS
[ 29.085 s]
2017-03-23T21:39:53.798 [INFO] Apache Beam :: Runners :: Core Java ................ SUCCESS
[01:17 min]
2017-03-23T21:39:53.798 [INFO] Apache Beam :: Runners :: Direct Java .............. SUCCESS
[04:15 min]
2017-03-23T21:39:53.798 [INFO] Apache Beam :: SDKs :: Java :: IO :: Elasticsearch . SUCCESS
[ 56.234 s]
2017-03-23T21:39:53.798 [INFO] Apache Beam :: Runners :: Google Cloud Dataflow .... SUCCESS
[ 44.590 s]
2017-03-23T21:39:53.798 [INFO] Apache Beam :: SDKs :: Java :: IO :: Google Cloud Platform
SUCCESS [05:41 min]
2017-03-23T21:39:53.798 [INFO] Apache Beam :: SDKs :: Java :: IO :: Hadoop Common . SUCCESS
[ 28.477 s]
2017-03-23T21:39:53.798 [INFO] Apache Beam :: SDKs :: Java :: IO :: HBase ......... SUCCESS
[ 40.415 s]
2017-03-23T21:39:53.798 [INFO] Apache Beam :: SDKs :: Java :: IO :: HDFS .......... SUCCESS
[ 39.564 s]
2017-03-23T21:39:53.798 [INFO] Apache Beam :: SDKs :: Java :: IO :: JDBC .......... SUCCESS
[ 40.089 s]
2017-03-23T21:39:53.798 [INFO] Apache Beam :: SDKs :: Java :: IO :: JMS ........... SUCCESS
[ 23.992 s]
2017-03-23T21:39:53.798 [INFO] Apache Beam :: SDKs :: Java :: IO :: Kafka ......... SUCCESS
[ 21.897 s]
2017-03-23T21:39:53.798 [INFO] Apache Beam :: SDKs :: Java :: IO :: Kinesis ....... SUCCESS
[ 25.222 s]
2017-03-23T21:39:53.798 [INFO] Apache Beam :: SDKs :: Java :: IO :: MongoDB ....... SUCCESS
[ 35.445 s]
2017-03-23T21:39:53.798 [INFO] Apache Beam :: SDKs :: Java :: IO :: MQTT .......... SUCCESS
[ 20.629 s]
2017-03-23T21:39:53.798 [INFO] Apache Beam :: SDKs :: Java :: Maven Archetypes .... SUCCESS
[  3.568 s]
2017-03-23T21:39:53.798 [INFO] Apache Beam :: SDKs :: Java :: Maven Archetypes :: Starter
SUCCESS [ 24.209 s]
2017-03-23T21:39:53.798 [INFO] Apache Beam :: SDKs :: Java :: Maven Archetypes :: Examples
SUCCESS [ 27.511 s]
2017-03-23T21:39:53.798 [INFO] Apache Beam :: SDKs :: Java :: Maven Archetypes :: Examples
- Java 8 SUCCESS [ 24.816 s]
2017-03-23T21:39:53.798 [INFO] Apache Beam :: SDKs :: Java :: Extensions .......... SUCCESS
[  3.017 s]
2017-03-23T21:39:53.798 [INFO] Apache Beam :: SDKs :: Java :: Extensions :: Jackson SUCCESS
[ 14.137 s]
2017-03-23T21:39:53.798 [INFO] Apache Beam :: SDKs :: Java :: Extensions :: Join library SUCCESS
[ 17.458 s]
2017-03-23T21:39:53.798 [INFO] Apache Beam :: SDKs :: Java :: Extensions :: Sorter  SUCCESS
[ 38.445 s]
2017-03-23T21:39:53.799 [INFO] Apache Beam :: SDKs :: Java :: Harness ............. SUCCESS
[ 38.941 s]
2017-03-23T21:39:53.799 [INFO] Apache Beam :: SDKs :: Java :: Java 8 Tests ........ SUCCESS
[ 15.178 s]
2017-03-23T21:39:53.799 [INFO] Apache Beam :: SDKs :: Python ...................... SUCCESS
[07:19 min]
2017-03-23T21:39:53.799 [INFO] Apache Beam :: Runners :: Flink .................... SUCCESS
[  2.096 s]
2017-03-23T21:39:53.799 [INFO] Apache Beam :: Runners :: Flink :: Core ............ SUCCESS
[01:06 min]
2017-03-23T21:39:53.799 [INFO] Apache Beam :: Runners :: Flink :: Examples ........ SUCCESS
[ 18.955 s]
2017-03-23T21:39:53.799 [INFO] Apache Beam :: Runners :: Spark .................... SUCCESS
[03:34 min]
2017-03-23T21:39:53.799 [INFO] Apache Beam :: Runners :: Apex ..................... SUCCESS
[01:31 min]
2017-03-23T21:39:53.799 [INFO] Apache Beam :: Examples ............................ SUCCESS
[  5.109 s]
2017-03-23T21:39:53.799 [INFO] Apache Beam :: Examples :: Java .................... SUCCESS
[06:58 min]
2017-03-23T21:39:53.799 [INFO] Apache Beam :: Examples :: Java 8 .................. SUCCESS
[ 48.669 s]
2017-03-23T21:39:53.799 [INFO] Apache Beam :: SDKs :: Java :: Aggregated Javadoc .. SUCCESS
[ 45.666 s]
2017-03-23T21:39:53.799 [INFO] ------------------------------------------------------------------------
2017-03-23T21:39:53.799 [INFO] BUILD FAILURE
2017-03-23T21:39:53.799 [INFO] ------------------------------------------------------------------------
2017-03-23T21:39:53.799 [INFO] Total time: 53:43 min
2017-03-23T21:39:53.799 [INFO] Finished at: 2017-03-23T21:39:53+00:00
2017-03-23T21:39:54.582 [INFO] Final Memory: 287M/1451M
2017-03-23T21:39:54.582 [INFO] ------------------------------------------------------------------------
Waiting for Jenkins to finish collecting data
2017-03-23T21:41:44.505 [ERROR] Failed to execute goal org.eluder.coveralls:coveralls-maven-plugin:4.3.0:report
(default-cli) on project beam-parent: I/O operation failed: Read timed out -> [Help 1]
org.apache.maven.lifecycle.LifecycleExecutionException: Failed to execute goal org.eluder.coveralls:coveralls-maven-plugin:4.3.0:report
(default-cli) on project beam-parent: I/O operation failed
	at org.apache.maven.lifecycle.internal.MojoExecutor.execute(MojoExecutor.java:212)
	at org.apache.maven.lifecycle.internal.MojoExecutor.execute(MojoExecutor.java:153)
	at org.apache.maven.lifecycle.internal.MojoExecutor.execute(MojoExecutor.java:145)
	at org.apache.maven.lifecycle.internal.LifecycleModuleBuilder.buildProject(LifecycleModuleBuilder.java:116)
	at org.apache.maven.lifecycle.internal.LifecycleModuleBuilder.buildProject(LifecycleModuleBuilder.java:80)
	at org.apache.maven.lifecycle.internal.builder.singlethreaded.SingleThreadedBuilder.build(SingleThreadedBuilder.java:51)
	at org.apache.maven.lifecycle.internal.LifecycleStarter.execute(LifecycleStarter.java:128)
	at org.apache.maven.DefaultMaven.doExecute(DefaultMaven.java:307)
	at org.apache.maven.DefaultMaven.doExecute(DefaultMaven.java:193)
	at org.apache.maven.DefaultMaven.execute(DefaultMaven.java:106)
	at org.jvnet.hudson.maven3.launcher.Maven33Launcher.main(Maven33Launcher.java:129)
	at sun.reflect.NativeMethodAccessorImpl.invoke0(Native Method)
	at sun.reflect.NativeMethodAccessorImpl.invoke(NativeMethodAccessorImpl.java:62)
	at sun.reflect.DelegatingMethodAccessorImpl.invoke(DelegatingMethodAccessorImpl.java:43)
	at java.lang.reflect.Method.invoke(Method.java:498)
	at org.codehaus.plexus.classworlds.launcher.Launcher.launchStandard(Launcher.java:330)
	at org.codehaus.plexus.classworlds.launcher.Launcher.launch(Launcher.java:238)
	at jenkins.maven3.agent.Maven33Main.launch(Maven33Main.java:176)
	at sun.reflect.NativeMethodAccessorImpl.invoke0(Native Method)
	at sun.reflect.NativeMethodAccessorImpl.invoke(NativeMethodAccessorImpl.java:62)
	at sun.reflect.DelegatingMethodAccessorImpl.invoke(DelegatingMethodAccessorImpl.java:43)
	at java.lang.reflect.Method.invoke(Method.java:498)
	at hudson.maven.Maven3Builder.call(Maven3Builder.java:139)
	at hudson.maven.Maven3Builder.call(Maven3Builder.java:70)
	at hudson.remoting.UserRequest.perform(UserRequest.java:153)
	at hudson.remoting.UserRequest.perform(UserRequest.java:50)
	at hudson.remoting.Request$2.run(Request.java:336)
	at hudson.remoting.InterceptingExecutorService$1.call(InterceptingExecutorService.java:68)
	at java.util.concurrent.FutureTask.run(FutureTask.java:266)
	at java.util.concurrent.ThreadPoolExecutor.runWorker(ThreadPoolExecutor.java:1142)
	at java.util.concurrent.ThreadPoolExecutor$Worker.run(ThreadPoolExecutor.java:617)
	at java.lang.Thread.run(Thread.java:745)
Caused by: org.apache.maven.plugin.MojoFailureException: I/O operation failed
	at org.eluder.coveralls.maven.plugin.CoverallsReportMojo.execute(CoverallsReportMojo.java:259)
	at org.apache.maven.plugin.DefaultBuildPluginManager.executeMojo(DefaultBuildPluginManager.java:134)
	at org.apache.maven.lifecycle.internal.MojoExecutor.execute(MojoExecutor.java:208)
	... 31 more
Caused by: java.net.SocketTimeoutException: Read timed out
	at java.net.SocketInputStream.socketRead0(Native Method)
	at java.net.SocketInputStream.socketRead(SocketInputStream.java:116)
	at java.net.SocketInputStream.read(SocketInputStream.java:171)
	at java.net.SocketInputStream.read(SocketInputStream.java:141)
	at sun.security.ssl.InputRecord.readFully(InputRecord.java:465)
	at sun.security.ssl.InputRecord.read(InputRecord.java:503)
	at sun.security.ssl.SSLSocketImpl.readRecord(SSLSocketImpl.java:973)
	at sun.security.ssl.SSLSocketImpl.readDataRecord(SSLSocketImpl.java:930)
	at sun.security.ssl.AppInputStream.read(AppInputStream.java:105)
	at org.apache.http.impl.io.SessionInputBufferImpl.streamRead(SessionInputBufferImpl.java:139)
	at org.apache.http.impl.io.SessionInputBufferImpl.fillBuffer(SessionInputBufferImpl.java:155)
	at org.apache.http.impl.io.SessionInputBufferImpl.readLine(SessionInputBufferImpl.java:284)
	at org.apache.http.impl.conn.DefaultHttpResponseParser.parseHead(DefaultHttpResponseParser.java:140)
	at org.apache.http.impl.conn.DefaultHttpResponseParser.parseHead(DefaultHttpResponseParser.java:57)
	at org.apache.http.impl.io.AbstractMessageParser.parse(AbstractMessageParser.java:261)
	at org.apache.http.impl.DefaultBHttpClientConnection.receiveResponseHeader(DefaultBHttpClientConnection.java:165)
	at org.apache.http.impl.conn.CPoolProxy.receiveResponseHeader(CPoolProxy.java:167)
	at org.apache.http.protocol.HttpRequestExecutor.doReceiveResponse(HttpRequestExecutor.java:272)
	at org.apache.http.protocol.HttpRequestExecutor.execute(HttpRequestExecutor.java:124)
	at org.apache.http.impl.execchain.MainClientExec.execute(MainClientExec.java:271)
	at org.apache.http.impl.execchain.ProtocolExec.execute(ProtocolExec.java:184)
	at org.apache.http.impl.execchain.RetryExec.execute(RetryExec.java:88)
	at org.apache.http.impl.execchain.RedirectExec.execute(RedirectExec.java:110)
	at org.apache.http.impl.client.InternalHttpClient.doExecute(InternalHttpClient.java:184)
	at org.apache.http.impl.client.CloseableHttpClient.execute(CloseableHttpClient.java:82)
	at org.apache.http.impl.client.CloseableHttpClient.execute(CloseableHttpClient.java:107)
	at org.apache.http.impl.client.CloseableHttpClient.execute(CloseableHttpClient.java:55)
	at org.eluder.coveralls.maven.plugin.httpclient.CoverallsClient.submit(CoverallsClient.java:84)
	at org.eluder.coveralls.maven.plugin.CoverallsReportMojo.submitData(CoverallsReportMojo.java:400)
	at org.eluder.coveralls.maven.plugin.CoverallsReportMojo.execute(CoverallsReportMojo.java:254)
	... 33 more
2017-03-23T21:41:44.506 [ERROR] 
2017-03-23T21:41:44.506 [ERROR] Re-run Maven using the -X switch to enable full debug logging.
2017-03-23T21:41:44.506 [ERROR] 
2017-03-23T21:41:44.506 [ERROR] For more information about the errors and possible solutions,
please read the following articles:
2017-03-23T21:41:44.506 [ERROR] [Help 1] http://cwiki.apache.org/confluence/display/MAVEN/MojoFailureException
channel stopped

Mime
View raw message