beam-commits mailing list archives

Site index · List index
Message view « Date » · « Thread »
Top « Date » · « Thread »
From Apache Jenkins Server <jenk...@builds.apache.org>
Subject Build failed in Jenkins: beam_PostCommit_Java_MavenInstall #2921
Date Wed, 15 Mar 2017 23:48:02 GMT
See <https://builds.apache.org/job/beam_PostCommit_Java_MavenInstall/2921/display/redirect?page=changes>

Changes:

[tgroh] Disable Guava Shading in Google Cloud Platform IOs

------------------------------------------
[...truncated 748.66 KB...]
[JENKINS] Archiving disabled
[JENKINS] Archiving disabled
[JENKINS] Archiving disabled
[JENKINS] Archiving disabled
[JENKINS] Archiving disabled
[JENKINS] Archiving disabled
[JENKINS] Archiving disabled
[JENKINS] Archiving disabled
[JENKINS] Archiving disabled
[JENKINS] Archiving disabled
[JENKINS] Archiving disabled
[JENKINS] Archiving disabled
[JENKINS] Archiving disabled
[JENKINS] Archiving disabled
[JENKINS] Archiving disabled
[JENKINS] Archiving disabled
[JENKINS] Archiving disabled
[JENKINS] Archiving disabled
[JENKINS] Archiving disabled
[JENKINS] Archiving disabled
[JENKINS] Archiving disabled
[JENKINS] Archiving disabled
[JENKINS] Archiving disabled
[JENKINS] Archiving disabled
[JENKINS] Archiving disabled
[JENKINS] Archiving disabled
[JENKINS] Archiving disabled
[JENKINS] Archiving disabled
[JENKINS] Archiving disabled
[JENKINS] Archiving disabled
[JENKINS] Archiving disabled
[JENKINS] Archiving disabled
2017-03-15T23:47:32.911 [INFO] ------------------------------------------------------------------------
2017-03-15T23:47:32.911 [INFO] Reactor Summary:
2017-03-15T23:47:32.911 [INFO] 
2017-03-15T23:47:32.911 [INFO] Apache Beam :: Parent .............................. SUCCESS
[ 21.433 s]
2017-03-15T23:47:32.911 [INFO] Apache Beam :: SDKs :: Java :: Build Tools ......... SUCCESS
[ 13.590 s]
2017-03-15T23:47:32.911 [INFO] Apache Beam :: SDKs ................................ SUCCESS
[  8.244 s]
2017-03-15T23:47:32.911 [INFO] Apache Beam :: SDKs :: Common ...................... SUCCESS
[  5.267 s]
2017-03-15T23:47:32.911 [INFO] Apache Beam :: SDKs :: Common :: Fn API ............ SUCCESS
[ 16.082 s]
2017-03-15T23:47:32.911 [INFO] Apache Beam :: SDKs :: Common :: Runner API ........ SUCCESS
[ 10.678 s]
2017-03-15T23:47:32.911 [INFO] Apache Beam :: SDKs :: Java ........................ SUCCESS
[  2.266 s]
2017-03-15T23:47:32.912 [INFO] Apache Beam :: SDKs :: Java :: Core ................ SUCCESS
[03:06 min]
2017-03-15T23:47:32.912 [INFO] Apache Beam :: Runners ............................. SUCCESS
[  1.818 s]
2017-03-15T23:47:32.912 [INFO] Apache Beam :: Runners :: Core Java Construction ... SUCCESS
[ 12.004 s]
2017-03-15T23:47:32.912 [INFO] Apache Beam :: Runners :: Core Java ................ SUCCESS
[ 52.835 s]
2017-03-15T23:47:32.912 [INFO] Apache Beam :: Runners :: Direct Java .............. SUCCESS
[03:33 min]
2017-03-15T23:47:32.912 [INFO] Apache Beam :: SDKs :: Java :: IO .................. SUCCESS
[  1.775 s]
2017-03-15T23:47:32.912 [INFO] Apache Beam :: SDKs :: Java :: IO :: Elasticsearch . SUCCESS
[ 43.574 s]
2017-03-15T23:47:32.912 [INFO] Apache Beam :: Runners :: Google Cloud Dataflow .... SUCCESS
[ 39.352 s]
2017-03-15T23:47:32.912 [INFO] Apache Beam :: SDKs :: Java :: IO :: Google Cloud Platform
FAILURE [01:06 min]
2017-03-15T23:47:32.912 [INFO] Apache Beam :: SDKs :: Java :: IO :: Hadoop Common . SKIPPED
2017-03-15T23:47:32.912 [INFO] Apache Beam :: SDKs :: Java :: IO :: HBase ......... SKIPPED
2017-03-15T23:47:32.912 [INFO] Apache Beam :: SDKs :: Java :: IO :: HDFS .......... SKIPPED
2017-03-15T23:47:32.912 [INFO] Apache Beam :: SDKs :: Java :: IO :: JDBC .......... SKIPPED
2017-03-15T23:47:32.912 [INFO] Apache Beam :: SDKs :: Java :: IO :: JMS ........... SKIPPED
2017-03-15T23:47:32.912 [INFO] Apache Beam :: SDKs :: Java :: IO :: Kafka ......... SKIPPED
2017-03-15T23:47:32.912 [INFO] Apache Beam :: SDKs :: Java :: IO :: Kinesis ....... SKIPPED
2017-03-15T23:47:32.912 [INFO] Apache Beam :: SDKs :: Java :: IO :: MongoDB ....... SKIPPED
2017-03-15T23:47:32.912 [INFO] Apache Beam :: SDKs :: Java :: IO :: MQTT .......... SKIPPED
2017-03-15T23:47:32.912 [INFO] Apache Beam :: SDKs :: Java :: Maven Archetypes .... SKIPPED
2017-03-15T23:47:32.912 [INFO] Apache Beam :: SDKs :: Java :: Maven Archetypes :: Starter
SKIPPED
2017-03-15T23:47:32.912 [INFO] Apache Beam :: SDKs :: Java :: Maven Archetypes :: Examples
SKIPPED
2017-03-15T23:47:32.912 [INFO] Apache Beam :: SDKs :: Java :: Maven Archetypes :: Examples
- Java 8 SKIPPED
2017-03-15T23:47:32.912 [INFO] Apache Beam :: SDKs :: Java :: Extensions .......... SKIPPED
2017-03-15T23:47:32.912 [INFO] Apache Beam :: SDKs :: Java :: Extensions :: Jackson SKIPPED
2017-03-15T23:47:32.912 [INFO] Apache Beam :: SDKs :: Java :: Extensions :: Join library SKIPPED
2017-03-15T23:47:32.912 [INFO] Apache Beam :: SDKs :: Java :: Extensions :: Sorter  SKIPPED
2017-03-15T23:47:32.912 [INFO] Apache Beam :: SDKs :: Java :: Harness ............. SKIPPED
2017-03-15T23:47:32.912 [INFO] Apache Beam :: SDKs :: Java :: Java 8 Tests ........ SKIPPED
2017-03-15T23:47:32.912 [INFO] Apache Beam :: SDKs :: Python ...................... SKIPPED
2017-03-15T23:47:32.912 [INFO] Apache Beam :: Runners :: Flink .................... SKIPPED
2017-03-15T23:47:32.912 [INFO] Apache Beam :: Runners :: Flink :: Core ............ SKIPPED
2017-03-15T23:47:32.912 [INFO] Apache Beam :: Runners :: Flink :: Examples ........ SKIPPED
2017-03-15T23:47:32.912 [INFO] Apache Beam :: Runners :: Spark .................... SKIPPED
2017-03-15T23:47:32.912 [INFO] Apache Beam :: Runners :: Apex ..................... SKIPPED
2017-03-15T23:47:32.912 [INFO] Apache Beam :: Examples ............................ SKIPPED
2017-03-15T23:47:32.912 [INFO] Apache Beam :: Examples :: Java .................... SKIPPED
2017-03-15T23:47:32.912 [INFO] Apache Beam :: Examples :: Java 8 .................. SKIPPED
2017-03-15T23:47:32.912 [INFO] Apache Beam :: SDKs :: Java :: Aggregated Javadoc .. SKIPPED
2017-03-15T23:47:32.912 [INFO] ------------------------------------------------------------------------
2017-03-15T23:47:32.912 [INFO] BUILD FAILURE
2017-03-15T23:47:32.912 [INFO] ------------------------------------------------------------------------
2017-03-15T23:47:32.912 [INFO] Total time: 12:21 min
2017-03-15T23:47:32.913 [INFO] Finished at: 2017-03-15T23:47:32+00:00
2017-03-15T23:47:33.771 [INFO] Final Memory: 147M/1356M
2017-03-15T23:47:33.771 [INFO] ------------------------------------------------------------------------
Waiting for Jenkins to finish collecting data
2017-03-15T23:47:42.516 [ERROR] Failed to execute goal org.apache.maven.plugins:maven-failsafe-plugin:2.19.1:integration-test
(default) on project beam-sdks-java-io-google-cloud-platform: Execution default of goal org.apache.maven.plugins:maven-failsafe-plugin:2.19.1:integration-test
failed: There was an error in the forked process
2017-03-15T23:47:42.516 [ERROR] java.lang.NoClassDefFoundError: org/apache/beam/sdk/io/gcp/bigtable/BigtableIO$Read
2017-03-15T23:47:42.516 [ERROR] at java.lang.Class.getDeclaredMethods0(Native Method)
2017-03-15T23:47:42.516 [ERROR] at java.lang.Class.privateGetDeclaredMethods(Class.java:2701)
2017-03-15T23:47:42.516 [ERROR] at java.lang.Class.privateGetMethodRecursive(Class.java:3048)
2017-03-15T23:47:42.516 [ERROR] at java.lang.Class.getMethod0(Class.java:3018)
2017-03-15T23:47:42.516 [ERROR] at java.lang.Class.getMethod(Class.java:1784)
2017-03-15T23:47:42.516 [ERROR] at org.apache.maven.surefire.util.ReflectionUtils.tryGetMethod(ReflectionUtils.java:61)
2017-03-15T23:47:42.516 [ERROR] at org.apache.maven.surefire.common.junit3.JUnit3TestChecker.isSuiteOnly(JUnit3TestChecker.java:64)
2017-03-15T23:47:42.516 [ERROR] at org.apache.maven.surefire.common.junit3.JUnit3TestChecker.isValidJUnit3Test(JUnit3TestChecker.java:59)
2017-03-15T23:47:42.516 [ERROR] at org.apache.maven.surefire.common.junit3.JUnit3TestChecker.accept(JUnit3TestChecker.java:54)
2017-03-15T23:47:42.516 [ERROR] at org.apache.maven.surefire.common.junit4.JUnit4TestChecker.accept(JUnit4TestChecker.java:52)
2017-03-15T23:47:42.516 [ERROR] at org.apache.maven.surefire.common.junit48.JUnit48TestChecker.accept(JUnit48TestChecker.java:50)
2017-03-15T23:47:42.516 [ERROR] at org.apache.maven.surefire.util.DefaultScanResult.applyFilter(DefaultScanResult.java:98)
2017-03-15T23:47:42.516 [ERROR] at org.apache.maven.surefire.junitcore.JUnitCoreProvider.scanClassPath(JUnitCoreProvider.java:295)
2017-03-15T23:47:42.517 [ERROR] at org.apache.maven.surefire.junitcore.JUnitCoreProvider.setTestsToRun(JUnitCoreProvider.java:203)
2017-03-15T23:47:42.517 [ERROR] at org.apache.maven.surefire.junitcore.JUnitCoreProvider.invoke(JUnitCoreProvider.java:138)
2017-03-15T23:47:42.517 [ERROR] at org.apache.maven.surefire.booter.ForkedBooter.invokeProviderInSameClassLoader(ForkedBooter.java:290)
2017-03-15T23:47:42.517 [ERROR] at org.apache.maven.surefire.booter.ForkedBooter.runSuitesInProcess(ForkedBooter.java:242)
2017-03-15T23:47:42.517 [ERROR] at org.apache.maven.surefire.booter.ForkedBooter.main(ForkedBooter.java:121)
2017-03-15T23:47:42.517 [ERROR] Caused by: java.lang.ClassNotFoundException: org.apache.beam.sdk.io.gcp.bigtable.BigtableIO$Read
2017-03-15T23:47:42.517 [ERROR] at java.net.URLClassLoader.findClass(URLClassLoader.java:381)
2017-03-15T23:47:42.517 [ERROR] at java.lang.ClassLoader.loadClass(ClassLoader.java:424)
2017-03-15T23:47:42.517 [ERROR] at sun.misc.Launcher$AppClassLoader.loadClass(Launcher.java:331)
2017-03-15T23:47:42.517 [ERROR] at java.lang.ClassLoader.loadClass(ClassLoader.java:357)
2017-03-15T23:47:42.517 [ERROR] ... 18 more
2017-03-15T23:47:42.517 [ERROR] -> [Help 1]
org.apache.maven.lifecycle.LifecycleExecutionException: Failed to execute goal org.apache.maven.plugins:maven-failsafe-plugin:2.19.1:integration-test
(default) on project beam-sdks-java-io-google-cloud-platform: Execution default of goal org.apache.maven.plugins:maven-failsafe-plugin:2.19.1:integration-test
failed: There was an error in the forked process
java.lang.NoClassDefFoundError: org/apache/beam/sdk/io/gcp/bigtable/BigtableIO$Read
	at java.lang.Class.getDeclaredMethods0(Native Method)
	at java.lang.Class.privateGetDeclaredMethods(Class.java:2701)
	at java.lang.Class.privateGetMethodRecursive(Class.java:3048)
	at java.lang.Class.getMethod0(Class.java:3018)
	at java.lang.Class.getMethod(Class.java:1784)
	at org.apache.maven.surefire.util.ReflectionUtils.tryGetMethod(ReflectionUtils.java:61)
	at org.apache.maven.surefire.common.junit3.JUnit3TestChecker.isSuiteOnly(JUnit3TestChecker.java:64)
	at org.apache.maven.surefire.common.junit3.JUnit3TestChecker.isValidJUnit3Test(JUnit3TestChecker.java:59)
	at org.apache.maven.surefire.common.junit3.JUnit3TestChecker.accept(JUnit3TestChecker.java:54)
	at org.apache.maven.surefire.common.junit4.JUnit4TestChecker.accept(JUnit4TestChecker.java:52)
	at org.apache.maven.surefire.common.junit48.JUnit48TestChecker.accept(JUnit48TestChecker.java:50)
	at org.apache.maven.surefire.util.DefaultScanResult.applyFilter(DefaultScanResult.java:98)
	at org.apache.maven.surefire.junitcore.JUnitCoreProvider.scanClassPath(JUnitCoreProvider.java:295)
	at org.apache.maven.surefire.junitcore.JUnitCoreProvider.setTestsToRun(JUnitCoreProvider.java:203)
	at org.apache.maven.surefire.junitcore.JUnitCoreProvider.invoke(JUnitCoreProvider.java:138)
	at org.apache.maven.surefire.booter.ForkedBooter.invokeProviderInSameClassLoader(ForkedBooter.java:290)
	at org.apache.maven.surefire.booter.ForkedBooter.runSuitesInProcess(ForkedBooter.java:242)
	at org.apache.maven.surefire.booter.ForkedBooter.main(ForkedBooter.java:121)
Caused by: java.lang.ClassNotFoundException: org.apache.beam.sdk.io.gcp.bigtable.BigtableIO$Read
	at java.net.URLClassLoader.findClass(URLClassLoader.java:381)
	at java.lang.ClassLoader.loadClass(ClassLoader.java:424)
	at sun.misc.Launcher$AppClassLoader.loadClass(Launcher.java:331)
	at java.lang.ClassLoader.loadClass(ClassLoader.java:357)
	... 18 more

	at org.apache.maven.lifecycle.internal.MojoExecutor.execute(MojoExecutor.java:224)
	at org.apache.maven.lifecycle.internal.MojoExecutor.execute(MojoExecutor.java:153)
	at org.apache.maven.lifecycle.internal.MojoExecutor.execute(MojoExecutor.java:145)
	at org.apache.maven.lifecycle.internal.LifecycleModuleBuilder.buildProject(LifecycleModuleBuilder.java:116)
	at org.apache.maven.lifecycle.internal.LifecycleModuleBuilder.buildProject(LifecycleModuleBuilder.java:80)
	at org.apache.maven.lifecycle.internal.builder.singlethreaded.SingleThreadedBuilder.build(SingleThreadedBuilder.java:51)
	at org.apache.maven.lifecycle.internal.LifecycleStarter.execute(LifecycleStarter.java:128)
	at org.apache.maven.DefaultMaven.doExecute(DefaultMaven.java:307)
	at org.apache.maven.DefaultMaven.doExecute(DefaultMaven.java:193)
	at org.apache.maven.DefaultMaven.execute(DefaultMaven.java:106)
	at org.jvnet.hudson.maven3.launcher.Maven33Launcher.main(Maven33Launcher.java:129)
	at sun.reflect.NativeMethodAccessorImpl.invoke0(Native Method)
	at sun.reflect.NativeMethodAccessorImpl.invoke(NativeMethodAccessorImpl.java:62)
	at sun.reflect.DelegatingMethodAccessorImpl.invoke(DelegatingMethodAccessorImpl.java:43)
	at java.lang.reflect.Method.invoke(Method.java:498)
	at org.codehaus.plexus.classworlds.launcher.Launcher.launchStandard(Launcher.java:330)
	at org.codehaus.plexus.classworlds.launcher.Launcher.launch(Launcher.java:238)
	at jenkins.maven3.agent.Maven33Main.launch(Maven33Main.java:176)
	at sun.reflect.NativeMethodAccessorImpl.invoke0(Native Method)
	at sun.reflect.NativeMethodAccessorImpl.invoke(NativeMethodAccessorImpl.java:62)
	at sun.reflect.DelegatingMethodAccessorImpl.invoke(DelegatingMethodAccessorImpl.java:43)
	at java.lang.reflect.Method.invoke(Method.java:498)
	at hudson.maven.Maven3Builder.call(Maven3Builder.java:139)
	at hudson.maven.Maven3Builder.call(Maven3Builder.java:70)
	at hudson.remoting.UserRequest.perform(UserRequest.java:153)
	at hudson.remoting.UserRequest.perform(UserRequest.java:50)
	at hudson.remoting.Request$2.run(Request.java:336)
	at hudson.remoting.InterceptingExecutorService$1.call(InterceptingExecutorService.java:68)
	at java.util.concurrent.FutureTask.run(FutureTask.java:266)
	at java.util.concurrent.ThreadPoolExecutor.runWorker(ThreadPoolExecutor.java:1142)
	at java.util.concurrent.ThreadPoolExecutor$Worker.run(ThreadPoolExecutor.java:617)
	at java.lang.Thread.run(Thread.java:745)
Caused by: org.apache.maven.plugin.PluginExecutionException: Execution default of goal org.apache.maven.plugins:maven-failsafe-plugin:2.19.1:integration-test
failed: There was an error in the forked process
java.lang.NoClassDefFoundError: org/apache/beam/sdk/io/gcp/bigtable/BigtableIO$Read
	at java.lang.Class.getDeclaredMethods0(Native Method)
	at java.lang.Class.privateGetDeclaredMethods(Class.java:2701)
	at java.lang.Class.privateGetMethodRecursive(Class.java:3048)
	at java.lang.Class.getMethod0(Class.java:3018)
	at java.lang.Class.getMethod(Class.java:1784)
	at org.apache.maven.surefire.util.ReflectionUtils.tryGetMethod(ReflectionUtils.java:61)
	at org.apache.maven.surefire.common.junit3.JUnit3TestChecker.isSuiteOnly(JUnit3TestChecker.java:64)
	at org.apache.maven.surefire.common.junit3.JUnit3TestChecker.isValidJUnit3Test(JUnit3TestChecker.java:59)
	at org.apache.maven.surefire.common.junit3.JUnit3TestChecker.accept(JUnit3TestChecker.java:54)
	at org.apache.maven.surefire.common.junit4.JUnit4TestChecker.accept(JUnit4TestChecker.java:52)
	at org.apache.maven.surefire.common.junit48.JUnit48TestChecker.accept(JUnit48TestChecker.java:50)
	at org.apache.maven.surefire.util.DefaultScanResult.applyFilter(DefaultScanResult.java:98)
	at org.apache.maven.surefire.junitcore.JUnitCoreProvider.scanClassPath(JUnitCoreProvider.java:295)
	at org.apache.maven.surefire.junitcore.JUnitCoreProvider.setTestsToRun(JUnitCoreProvider.java:203)
	at org.apache.maven.surefire.junitcore.JUnitCoreProvider.invoke(JUnitCoreProvider.java:138)
	at org.apache.maven.surefire.booter.ForkedBooter.invokeProviderInSameClassLoader(ForkedBooter.java:290)
	at org.apache.maven.surefire.booter.ForkedBooter.runSuitesInProcess(ForkedBooter.java:242)
	at org.apache.maven.surefire.booter.ForkedBooter.main(ForkedBooter.java:121)
Caused by: java.lang.ClassNotFoundException: org.apache.beam.sdk.io.gcp.bigtable.BigtableIO$Read
	at java.net.URLClassLoader.findClass(URLClassLoader.java:381)
	at java.lang.ClassLoader.loadClass(ClassLoader.java:424)
	at sun.misc.Launcher$AppClassLoader.loadClass(Launcher.java:331)
	at java.lang.ClassLoader.loadClass(ClassLoader.java:357)
	... 18 more

	at org.apache.maven.plugin.DefaultBuildPluginManager.executeMojo(DefaultBuildPluginManager.java:145)
	at org.apache.maven.lifecycle.internal.MojoExecutor.execute(MojoExecutor.java:208)
	... 31 more
Caused by: java.lang.RuntimeException: There was an error in the forked process
java.lang.NoClassDefFoundError: org/apache/beam/sdk/io/gcp/bigtable/BigtableIO$Read
	at java.lang.Class.getDeclaredMethods0(Native Method)
	at java.lang.Class.privateGetDeclaredMethods(Class.java:2701)
	at java.lang.Class.privateGetMethodRecursive(Class.java:3048)
	at java.lang.Class.getMethod0(Class.java:3018)
	at java.lang.Class.getMethod(Class.java:1784)
	at org.apache.maven.surefire.util.ReflectionUtils.tryGetMethod(ReflectionUtils.java:61)
	at org.apache.maven.surefire.common.junit3.JUnit3TestChecker.isSuiteOnly(JUnit3TestChecker.java:64)
	at org.apache.maven.surefire.common.junit3.JUnit3TestChecker.isValidJUnit3Test(JUnit3TestChecker.java:59)
	at org.apache.maven.surefire.common.junit3.JUnit3TestChecker.accept(JUnit3TestChecker.java:54)
	at org.apache.maven.surefire.common.junit4.JUnit4TestChecker.accept(JUnit4TestChecker.java:52)
	at org.apache.maven.surefire.common.junit48.JUnit48TestChecker.accept(JUnit48TestChecker.java:50)
	at org.apache.maven.surefire.util.DefaultScanResult.applyFilter(DefaultScanResult.java:98)
	at org.apache.maven.surefire.junitcore.JUnitCoreProvider.scanClassPath(JUnitCoreProvider.java:295)
	at org.apache.maven.surefire.junitcore.JUnitCoreProvider.setTestsToRun(JUnitCoreProvider.java:203)
	at org.apache.maven.surefire.junitcore.JUnitCoreProvider.invoke(JUnitCoreProvider.java:138)
	at org.apache.maven.surefire.booter.ForkedBooter.invokeProviderInSameClassLoader(ForkedBooter.java:290)
	at org.apache.maven.surefire.booter.ForkedBooter.runSuitesInProcess(ForkedBooter.java:242)
	at org.apache.maven.surefire.booter.ForkedBooter.main(ForkedBooter.java:121)
Caused by: java.lang.ClassNotFoundException: org.apache.beam.sdk.io.gcp.bigtable.BigtableIO$Read
	at java.net.URLClassLoader.findClass(URLClassLoader.java:381)
	at java.lang.ClassLoader.loadClass(ClassLoader.java:424)
	at sun.misc.Launcher$AppClassLoader.loadClass(Launcher.java:331)
	at java.lang.ClassLoader.loadClass(ClassLoader.java:357)
	... 18 more

	at org.apache.maven.plugin.surefire.booterclient.ForkStarter.fork(ForkStarter.java:584)
	at org.apache.maven.plugin.surefire.booterclient.ForkStarter.fork(ForkStarter.java:460)
	at org.apache.maven.plugin.surefire.booterclient.ForkStarter.run(ForkStarter.java:229)
	at org.apache.maven.plugin.surefire.booterclient.ForkStarter.run(ForkStarter.java:201)
	at org.apache.maven.plugin.surefire.AbstractSurefireMojo.executeProvider(AbstractSurefireMojo.java:1026)
	at org.apache.maven.plugin.surefire.AbstractSurefireMojo.executeAfterPreconditionsChecked(AbstractSurefireMojo.java:862)
	at org.apache.maven.plugin.surefire.AbstractSurefireMojo.execute(AbstractSurefireMojo.java:755)
	at org.apache.maven.plugin.DefaultBuildPluginManager.executeMojo(DefaultBuildPluginManager.java:134)
	... 32 more
2017-03-15T23:47:42.518 [ERROR] 
2017-03-15T23:47:42.518 [ERROR] Re-run Maven using the -X switch to enable full debug logging.
2017-03-15T23:47:42.518 [ERROR] 
2017-03-15T23:47:42.518 [ERROR] For more information about the errors and possible solutions,
please read the following articles:
2017-03-15T23:47:42.518 [ERROR] [Help 1] http://cwiki.apache.org/confluence/display/MAVEN/PluginExecutionException
2017-03-15T23:47:42.518 [ERROR] 
2017-03-15T23:47:42.518 [ERROR] After correcting the problems, you can resume the build with
the command
2017-03-15T23:47:42.518 [ERROR]   mvn <goals> -rf :beam-sdks-java-io-google-cloud-platform
channel stopped

Mime
View raw message