beam-commits mailing list archives

Site index · List index
Message view « Date » · « Thread »
Top « Date » · « Thread »
From Apache Jenkins Server <jenk...@builds.apache.org>
Subject Build failed in Jenkins: beam_PostCommit_Python_Verify #1517
Date Wed, 15 Mar 2017 21:06:40 GMT
See <https://builds.apache.org/job/beam_PostCommit_Python_Verify/1517/display/redirect>

------------------------------------------
GitHub pull request #2244 of commit 08037d289319374401b9189c3a5df27b37b13e33, no merge conflicts.
Setting status of 08037d289319374401b9189c3a5df27b37b13e33 to PENDING with url https://builds.apache.org/job/beam_PostCommit_Python_Verify/1517/
and message: 'Build started sha1 is merged.'
Using context: Jenkins: Python SDK PostCommit Tests
[EnvInject] - Loading node environment variables.
Building remotely on beam3 (beam) in workspace <https://builds.apache.org/job/beam_PostCommit_Python_Verify/ws/>
 > git rev-parse --is-inside-work-tree # timeout=10
Fetching changes from the remote Git repository
 > git config remote.origin.url https://github.com/apache/beam.git # timeout=10
Fetching upstream changes from https://github.com/apache/beam.git
 > git --version # timeout=10
 > git fetch --tags --progress https://github.com/apache/beam.git +refs/heads/*:refs/remotes/origin/*
+refs/pull/*:refs/remotes/origin/pr/*
ERROR: Error fetching remote repo 'origin'
hudson.plugins.git.GitException: Failed to fetch from https://github.com/apache/beam.git
	at hudson.plugins.git.GitSCM.fetchFrom(GitSCM.java:806)
	at hudson.plugins.git.GitSCM.retrieveChanges(GitSCM.java:1070)
	at hudson.plugins.git.GitSCM.checkout(GitSCM.java:1101)
	at hudson.scm.SCM.checkout(SCM.java:495)
	at hudson.model.AbstractProject.checkout(AbstractProject.java:1278)
	at hudson.model.AbstractBuild$AbstractBuildExecution.defaultCheckout(AbstractBuild.java:604)
	at jenkins.scm.SCMCheckoutStrategy.checkout(SCMCheckoutStrategy.java:86)
	at hudson.model.AbstractBuild$AbstractBuildExecution.run(AbstractBuild.java:529)
	at hudson.model.Run.execute(Run.java:1728)
	at hudson.model.FreeStyleBuild.run(FreeStyleBuild.java:43)
	at hudson.model.ResourceController.execute(ResourceController.java:98)
	at hudson.model.Executor.run(Executor.java:404)
Caused by: hudson.plugins.git.GitException: Command "git fetch --tags --progress https://github.com/apache/beam.git
+refs/heads/*:refs/remotes/origin/* +refs/pull/*:refs/remotes/origin/pr/*" returned status
code 128:
stdout: 
stderr: error: RPC failed; result=7, HTTP code = 0
fatal: The remote end hung up unexpectedly

	at org.jenkinsci.plugins.gitclient.CliGitAPIImpl.launchCommandIn(CliGitAPIImpl.java:1793)
	at org.jenkinsci.plugins.gitclient.CliGitAPIImpl.launchCommandWithCredentials(CliGitAPIImpl.java:1519)
	at org.jenkinsci.plugins.gitclient.CliGitAPIImpl.access$300(CliGitAPIImpl.java:64)
	at org.jenkinsci.plugins.gitclient.CliGitAPIImpl$1.execute(CliGitAPIImpl.java:315)
	at org.jenkinsci.plugins.gitclient.RemoteGitImpl$CommandInvocationHandler$1.call(RemoteGitImpl.java:153)
	at org.jenkinsci.plugins.gitclient.RemoteGitImpl$CommandInvocationHandler$1.call(RemoteGitImpl.java:146)
	at hudson.remoting.UserRequest.perform(UserRequest.java:153)
	at hudson.remoting.UserRequest.perform(UserRequest.java:50)
	at hudson.remoting.Request$2.run(Request.java:336)
	at hudson.remoting.InterceptingExecutorService$1.call(InterceptingExecutorService.java:68)
	at java.util.concurrent.FutureTask.run(FutureTask.java:262)
	at java.util.concurrent.ThreadPoolExecutor.runWorker(ThreadPoolExecutor.java:1145)
	at java.util.concurrent.ThreadPoolExecutor$Worker.run(ThreadPoolExecutor.java:615)
	at java.lang.Thread.run(Thread.java:745)
	at ......remote call to beam3(Native Method)
	at hudson.remoting.Channel.attachCallSiteStackTrace(Channel.java:1537)
	at hudson.remoting.UserResponse.retrieve(UserRequest.java:253)
	at hudson.remoting.Channel.call(Channel.java:822)
	at org.jenkinsci.plugins.gitclient.RemoteGitImpl$CommandInvocationHandler.execute(RemoteGitImpl.java:146)
	at sun.reflect.GeneratedMethodAccessor756.invoke(Unknown Source)
	at sun.reflect.DelegatingMethodAccessorImpl.invoke(DelegatingMethodAccessorImpl.java:43)
	at java.lang.reflect.Method.invoke(Method.java:498)
	at org.jenkinsci.plugins.gitclient.RemoteGitImpl$CommandInvocationHandler.invoke(RemoteGitImpl.java:132)
	at com.sun.proxy.$Proxy81.execute(Unknown Source)
	at hudson.plugins.git.GitSCM.fetchFrom(GitSCM.java:804)
	... 11 more
ERROR: null
Retrying after 10 seconds
 > git rev-parse --is-inside-work-tree # timeout=10
Fetching changes from the remote Git repository
 > git config remote.origin.url https://github.com/apache/beam.git # timeout=10
Fetching upstream changes from https://github.com/apache/beam.git
 > git --version # timeout=10
 > git fetch --tags --progress https://github.com/apache/beam.git +refs/heads/*:refs/remotes/origin/*
+refs/pull/*:refs/remotes/origin/pr/*
 > git rev-parse refs/remotes/origin/pr/2244/merge^{commit} # timeout=10
 > git rev-parse refs/remotes/origin/origin/pr/2244/merge^{commit} # timeout=10
Checking out Revision 8219fd67aadd4da90c250f96ca7e4416ca87a5e2 (refs/remotes/origin/pr/2244/merge)
 > git config core.sparsecheckout # timeout=10
 > git checkout -f 8219fd67aadd4da90c250f96ca7e4416ca87a5e2
First time build. Skipping changelog.
Cleaning workspace
 > git rev-parse --verify HEAD # timeout=10
Resetting working tree
 > git reset --hard # timeout=10
 > git clean -fdx # timeout=10
[EnvInject] - Executing scripts and injecting environment variables after the SCM step.
[EnvInject] - Injecting as environment variables the properties content 
SPARK_LOCAL_IP=127.0.0.1

[EnvInject] - Variables injected successfully.
[beam_PostCommit_Python_Verify] $ /bin/bash -xe /tmp/hudson759854892060690643.sh
+ bash sdks/python/run_postcommit.sh

# pip install --user installation location.
LOCAL_PATH=$HOME/.local/bin/

# Remove any tox cache from previous workspace
rm -rf sdks/python/target/.tox

# INFRA does not install virtualenv
pip install virtualenv --user
Requirement already satisfied (use --upgrade to upgrade): virtualenv in /home/jenkins/.local/lib/python2.7/site-packages
Cleaning up...

# INFRA does not install tox
pip install tox --user
Requirement already satisfied (use --upgrade to upgrade): tox in /home/jenkins/.local/lib/python2.7/site-packages
Cleaning up...

# Tox runs unit tests in a virtual environment
${LOCAL_PATH}/tox -e ALL -c sdks/python/tox.ini
GLOB sdist-make: <https://builds.apache.org/job/beam_PostCommit_Python_Verify/ws/sdks/python/setup.py>
ERROR: invocation failed (exit code 1), logfile: <https://builds.apache.org/job/beam_PostCommit_Python_Verify/ws/sdks/python/target/.tox/log/tox-0.log>
ERROR: actionid: tox
msg: packaging
cmdargs: ['/usr/bin/python', local('<https://builds.apache.org/job/beam_PostCommit_Python_Verify/ws/sdks/python/setup.py'),>
'sdist', '--formats=zip', '--dist-dir', local('<https://builds.apache.org/job/beam_PostCommit_Python_Verify/ws/sdks/python/target/.tox/dist')]>
env: None

setup.py:58: UserWarning: You are using version 1.5.4 of pip. However, version 7.0.0 is recommended.
  _PIP_VERSION, REQUIRED_PIP_VERSION
Traceback (most recent call last):
  File "setup.py", line 156, in <module>
    'beam_test_plugin = test_config:BeamTestPlugin'
  File "/usr/lib/python2.7/distutils/core.py", line 111, in setup
    _setup_distribution = dist = klass(attrs)
  File "/usr/lib/python2.7/dist-packages/setuptools/dist.py", line 239, in __init__
    self.fetch_build_eggs(attrs.pop('setup_requires'))
  File "/usr/lib/python2.7/dist-packages/setuptools/dist.py", line 264, in fetch_build_eggs
    replace_conflicting=True
  File "/usr/lib/python2.7/dist-packages/pkg_resources.py", line 620, in resolve
    dist = best[req.key] = env.best_match(req, ws, installer)
  File "/usr/lib/python2.7/dist-packages/pkg_resources.py", line 858, in best_match
    return self.obtain(req, installer) # try and download/install
  File "/usr/lib/python2.7/dist-packages/pkg_resources.py", line 870, in obtain
    return installer(requirement)
  File "/usr/lib/python2.7/dist-packages/setuptools/dist.py", line 314, in fetch_build_egg
    return cmd.easy_install(req)
  File "/usr/lib/python2.7/dist-packages/setuptools/command/easy_install.py", line 604, in
easy_install
    self.local_index
  File "/usr/lib/python2.7/dist-packages/setuptools/package_index.py", line 602, in fetch_distribution
    return dist.clone(location=self.download(dist.location, tmpdir))
  File "/usr/lib/python2.7/dist-packages/setuptools/package_index.py", line 518, in download
    found = self._download_url(scheme.group(1), spec, tmpdir)
  File "/usr/lib/python2.7/dist-packages/setuptools/package_index.py", line 766, in _download_url
    return self._attempt_download(url, filename)
  File "/usr/lib/python2.7/dist-packages/setuptools/package_index.py", line 772, in _attempt_download
    headers = self._download_to(url, filename)
  File "/usr/lib/python2.7/dist-packages/setuptools/package_index.py", line 680, in _download_to
    tfp = open(filename,'wb')
IOError: [Errno 2] No such file or directory: '/tmp/easy_install-azqCRF/nose-1.3.7.tar.gz'

ERROR: FAIL could not package project - v = InvocationError('/usr/bin/python <https://builds.apache.org/job/beam_PostCommit_Python_Verify/ws/sdks/python/setup.py>
sdist --formats=zip --dist-dir <https://builds.apache.org/job/beam_PostCommit_Python_Verify/ws/sdks/python/target/.tox/dist>
(see <https://builds.apache.org/job/beam_PostCommit_Python_Verify/ws/sdks/python/target/.tox/log/tox-0.log)',>
1)
Build step 'Execute shell' marked build as failure

Mime
View raw message