beam-commits mailing list archives

Site index · List index
Message view « Date » · « Thread »
Top « Date » · « Thread »
From Apache Jenkins Server <jenk...@builds.apache.org>
Subject Build failed in Jenkins: beam_PostCommit_Java_MavenInstall #2853
Date Thu, 09 Mar 2017 07:31:28 GMT
See <https://builds.apache.org/job/beam_PostCommit_Java_MavenInstall/2853/display/redirect?page=changes>

Changes:

[jbonofre] [BEAM-1184] Add integration tests to ElasticsearchIO

------------------------------------------
[...truncated 412.24 KB...]
2017-03-09T06:58:30.268 [INFO] Downloading: https://repo.maven.apache.org/maven2/org/slf4j/slf4j-api/1.7.7/slf4j-api-1.7.7.pom
2017-03-09T06:58:48.230 [INFO] Downloaded: https://repo.maven.apache.org/maven2/org/slf4j/slf4j-api/1.7.7/slf4j-api-1.7.7.pom
(3 KB at 0.1 KB/sec)
2017-03-09T06:59:00.335 [INFO] Downloading: https://repo.maven.apache.org/maven2/org/slf4j/slf4j-parent/1.7.7/slf4j-parent-1.7.7.pom
2017-03-09T06:59:22.696 [INFO] Downloaded: https://repo.maven.apache.org/maven2/org/slf4j/slf4j-parent/1.7.7/slf4j-parent-1.7.7.pom
(12 KB at 0.5 KB/sec)
2017-03-09T06:59:46.062 [INFO] Downloading: https://repo.maven.apache.org/maven2/joda-time/joda-time/2.7/joda-time-2.7.pom
2017-03-09T07:00:20.858 [INFO] Downloaded: https://repo.maven.apache.org/maven2/joda-time/joda-time/2.7/joda-time-2.7.pom
(28 KB at 0.8 KB/sec)
2017-03-09T07:02:04.494 [INFO] Downloading: https://repo.maven.apache.org/maven2/org/slf4j/slf4j-simple/1.7.7/slf4j-simple-1.7.7.pom
2017-03-09T07:03:18.819 [INFO] Downloaded: https://repo.maven.apache.org/maven2/org/slf4j/slf4j-simple/1.7.7/slf4j-simple-1.7.7.pom
(2 KB at 0.0 KB/sec)
2017-03-09T07:04:36.964 [INFO] Downloading: https://repo.maven.apache.org/maven2/org/apache/maven/maven-model/2.0.10/maven-model-2.0.10.jar
2017-03-09T07:04:36.965 [INFO] Downloading: https://repo.maven.apache.org/maven2/org/apache/maven/maven-artifact-manager/2.0.10/maven-artifact-manager-2.0.10.jar
2017-03-09T07:04:36.965 [INFO] Downloading: https://repo.maven.apache.org/maven2/org/apache/maven/maven-repository-metadata/2.0.10/maven-repository-metadata-2.0.10.jar
2017-03-09T07:04:36.966 [INFO] Downloading: https://repo.maven.apache.org/maven2/org/codehaus/plexus/plexus-utils/1.5.5/plexus-utils-1.5.5.jar
2017-03-09T07:04:36.966 [INFO] Downloading: https://repo.maven.apache.org/maven2/org/apache/maven/maven-plugin-api/2.0.10/maven-plugin-api-2.0.10.jar
2017-03-09T07:04:37.002 [INFO] Downloaded: https://repo.maven.apache.org/maven2/org/apache/maven/maven-plugin-api/2.0.10/maven-plugin-api-2.0.10.jar
(13 KB at 331.4 KB/sec)
2017-03-09T07:04:37.002 [INFO] Downloading: https://repo.maven.apache.org/maven2/org/apache/maven/maven-artifact/2.0.10/maven-artifact-2.0.10.jar
2017-03-09T07:04:37.016 [INFO] Downloaded: https://repo.maven.apache.org/maven2/org/apache/maven/maven-repository-metadata/2.0.10/maven-repository-metadata-2.0.10.jar
(26 KB at 498.3 KB/sec)
2017-03-09T07:04:37.016 [INFO] Downloading: https://repo.maven.apache.org/maven2/org/apache/avro/avro-compiler/1.8.1/avro-compiler-1.8.1.jar
2017-03-09T07:04:37.018 [INFO] Downloaded: https://repo.maven.apache.org/maven2/org/apache/maven/maven-artifact-manager/2.0.10/maven-artifact-manager-2.0.10.jar
(57 KB at 1051.3 KB/sec)
2017-03-09T07:04:37.018 [INFO] Downloading: https://repo.maven.apache.org/maven2/org/xerial/snappy/snappy-java/1.1.1.3/snappy-java-1.1.1.3.jar
2017-03-09T07:04:37.029 [INFO] Downloaded: https://repo.maven.apache.org/maven2/org/apache/maven/maven-model/2.0.10/maven-model-2.0.10.jar
(94 KB at 1445.2 KB/sec)
2017-03-09T07:04:37.029 [INFO] Downloading: https://repo.maven.apache.org/maven2/org/apache/commons/commons-compress/1.8.1/commons-compress-1.8.1.jar
2017-03-09T07:04:37.035 [INFO] Downloaded: https://repo.maven.apache.org/maven2/org/apache/maven/maven-artifact/2.0.10/maven-artifact-2.0.10.jar
(88 KB at 1264.2 KB/sec)
2017-03-09T07:04:37.035 [INFO] Downloading: https://repo.maven.apache.org/maven2/joda-time/joda-time/2.7/joda-time-2.7.jar
2017-03-09T07:04:37.051 [INFO] Downloaded: https://repo.maven.apache.org/maven2/org/codehaus/plexus/plexus-utils/1.5.5/plexus-utils-1.5.5.jar
(246 KB at 2853.3 KB/sec)
2017-03-09T07:04:37.051 [INFO] Downloading: https://repo.maven.apache.org/maven2/org/slf4j/slf4j-api/1.7.7/slf4j-api-1.7.7.jar
2017-03-09T07:04:37.059 [INFO] Downloaded: https://repo.maven.apache.org/maven2/org/apache/avro/avro-compiler/1.8.1/avro-compiler-1.8.1.jar
(80 KB at 856.7 KB/sec)
2017-03-09T07:04:37.074 [INFO] Downloading: https://repo.maven.apache.org/maven2/org/slf4j/slf4j-simple/1.7.7/slf4j-simple-1.7.7.jar
2017-03-09T07:04:37.093 [INFO] Downloaded: https://repo.maven.apache.org/maven2/org/slf4j/slf4j-api/1.7.7/slf4j-api-1.7.7.jar
(29 KB at 225.0 KB/sec)
2017-03-09T07:04:37.120 [INFO] Downloaded: https://repo.maven.apache.org/maven2/org/xerial/snappy/snappy-java/1.1.1.3/snappy-java-1.1.1.3.jar
(576 KB at 3735.4 KB/sec)
2017-03-09T07:04:37.122 [INFO] Downloaded: https://repo.maven.apache.org/maven2/org/slf4j/slf4j-simple/1.7.7/slf4j-simple-1.7.7.jar
(11 KB at 66.9 KB/sec)
2017-03-09T07:04:37.123 [INFO] Downloaded: https://repo.maven.apache.org/maven2/org/apache/commons/commons-compress/1.8.1/commons-compress-1.8.1.jar
(357 KB at 2273.8 KB/sec)
2017-03-09T07:04:37.131 [INFO] Downloaded: https://repo.maven.apache.org/maven2/joda-time/joda-time/2.7/joda-time-2.7.jar
(576 KB at 3487.7 KB/sec)
2017-03-09T07:04:40.053 [INFO] 
2017-03-09T07:04:40.054 [INFO] --- maven-remote-resources-plugin:1.5:process (process-resource-bundles)
@ beam-sdks-java-core ---
2017-03-09T07:04:43.404 [INFO] 
2017-03-09T07:04:43.404 [INFO] --- maven-resources-plugin:2.7:resources (default-resources)
@ beam-sdks-java-core ---
2017-03-09T07:04:43.406 [INFO] Using 'UTF-8' encoding to copy filtered resources.
2017-03-09T07:04:43.408 [INFO] Copying 1 resource
2017-03-09T07:04:43.464 [INFO] Copying 3 resources
2017-03-09T07:04:43.642 [INFO] 
2017-03-09T07:04:43.642 [INFO] --- maven-compiler-plugin:3.6.1:compile (default-compile) @
beam-sdks-java-core ---
2017-03-09T07:04:44.365 [INFO] Changes detected - recompiling the module!
2017-03-09T07:04:44.366 [INFO] Compiling 422 source files to <https://builds.apache.org/job/beam_PostCommit_Java_MavenInstall/ws/sdks/java/core/target/classes>
2017-03-09T07:04:57.643 [WARNING] bootstrap class path not set in conjunction with -source
1.7
2017-03-09T07:04:57.643 [INFO] <https://builds.apache.org/job/beam_PostCommit_Java_MavenInstall/ws/sdks/java/core/src/main/java/org/apache/beam/sdk/io/FileBasedSink.java>:
Some input files use or override a deprecated API.
2017-03-09T07:04:57.644 [INFO] <https://builds.apache.org/job/beam_PostCommit_Java_MavenInstall/ws/sdks/java/core/src/main/java/org/apache/beam/sdk/io/FileBasedSink.java>:
Recompile with -Xlint:deprecation for details.
2017-03-09T07:04:57.644 [INFO] <https://builds.apache.org/job/beam_PostCommit_Java_MavenInstall/ws/sdks/java/core/src/main/java/org/apache/beam/sdk/options/ValueProvider.java>:
Some input files use unchecked or unsafe operations.
2017-03-09T07:04:57.644 [INFO] <https://builds.apache.org/job/beam_PostCommit_Java_MavenInstall/ws/sdks/java/core/src/main/java/org/apache/beam/sdk/options/ValueProvider.java>:
Recompile with -Xlint:unchecked for details.
2017-03-09T07:04:58.527 [INFO] 
2017-03-09T07:04:58.527 [INFO] --- build-helper-maven-plugin:1.12:add-test-source (add-test-source)
@ beam-sdks-java-core ---
2017-03-09T07:04:58.688 [INFO] Downloading: https://repo.maven.apache.org/maven2/org/codehaus/plexus/plexus-component-annotations/1.5.4/plexus-component-annotations-1.5.4.pom
2017-03-09T07:04:58.823 [INFO] Downloaded: https://repo.maven.apache.org/maven2/org/codehaus/plexus/plexus-component-annotations/1.5.4/plexus-component-annotations-1.5.4.pom
(815 B at 5.9 KB/sec)
2017-03-09T07:04:58.829 [INFO] Downloading: https://repo.maven.apache.org/maven2/org/codehaus/plexus/plexus-containers/1.5.4/plexus-containers-1.5.4.pom
2017-03-09T07:04:58.859 [INFO] Downloaded: https://repo.maven.apache.org/maven2/org/codehaus/plexus/plexus-containers/1.5.4/plexus-containers-1.5.4.pom
(5 KB at 138.0 KB/sec)
2017-03-09T07:04:58.886 [INFO] Downloading: https://repo.maven.apache.org/maven2/org/apache/maven/shared/file-management/3.0.0/file-management-3.0.0.pom
2017-03-09T07:04:58.950 [INFO] Downloaded: https://repo.maven.apache.org/maven2/org/apache/maven/shared/file-management/3.0.0/file-management-3.0.0.pom
(5 KB at 71.5 KB/sec)
2017-03-09T07:04:58.964 [INFO] Downloading: https://repo.maven.apache.org/maven2/org/apache/maven/shared/maven-shared-io/3.0.0/maven-shared-io-3.0.0.pom
2017-03-09T07:04:58.995 [INFO] Downloaded: https://repo.maven.apache.org/maven2/org/apache/maven/shared/maven-shared-io/3.0.0/maven-shared-io-3.0.0.pom
(5 KB at 131.0 KB/sec)
2017-03-09T07:04:59.024 [INFO] Downloading: https://repo.maven.apache.org/maven2/org/apache/maven/wagon/wagon-provider-api/2.10/wagon-provider-api-2.10.pom
2017-03-09T07:04:59.079 [INFO] Downloaded: https://repo.maven.apache.org/maven2/org/apache/maven/wagon/wagon-provider-api/2.10/wagon-provider-api-2.10.pom
(2 KB at 30.7 KB/sec)
2017-03-09T07:04:59.115 [INFO] Downloading: https://repo.maven.apache.org/maven2/org/apache/maven/wagon/wagon/2.10/wagon-2.10.pom
2017-03-09T07:04:59.164 [INFO] Downloaded: https://repo.maven.apache.org/maven2/org/apache/maven/wagon/wagon/2.10/wagon-2.10.pom
(21 KB at 408.9 KB/sec)
2017-03-09T07:04:59.420 [INFO] Downloading: https://repo.maven.apache.org/maven2/org/apache/maven/shared/file-management/3.0.0/file-management-3.0.0.jar
2017-03-09T07:04:59.431 [INFO] Downloading: https://repo.maven.apache.org/maven2/org/apache/maven/shared/maven-shared-io/3.0.0/maven-shared-io-3.0.0.jar
2017-03-09T07:04:59.447 [INFO] Downloading: https://repo.maven.apache.org/maven2/org/apache/maven/wagon/wagon-provider-api/2.10/wagon-provider-api-2.10.jar
2017-03-09T07:04:59.484 [INFO] Downloaded: https://repo.maven.apache.org/maven2/org/apache/maven/wagon/wagon-provider-api/2.10/wagon-provider-api-2.10.jar
(53 KB at 816.8 KB/sec)
2017-03-09T07:04:59.484 [INFO] Downloaded: https://repo.maven.apache.org/maven2/org/apache/maven/shared/file-management/3.0.0/file-management-3.0.0.jar
(35 KB at 530.7 KB/sec)
2017-03-09T07:04:59.488 [INFO] Downloaded: https://repo.maven.apache.org/maven2/org/apache/maven/shared/maven-shared-io/3.0.0/maven-shared-io-3.0.0.jar
(41 KB at 586.8 KB/sec)
2017-03-09T07:04:59.878 [INFO] Test Source directory: <https://builds.apache.org/job/beam_PostCommit_Java_MavenInstall/ws/sdks/java/core/target/generated-test-sources/java>
added.
2017-03-09T07:05:01.406 [INFO] 
2017-03-09T07:05:01.406 [INFO] --- maven-resources-plugin:2.7:testResources (default-testResources)
@ beam-sdks-java-core ---
2017-03-09T07:05:01.408 [INFO] Using 'UTF-8' encoding to copy filtered resources.
2017-03-09T07:05:01.408 [INFO] skip non existing resourceDirectory <https://builds.apache.org/job/beam_PostCommit_Java_MavenInstall/ws/sdks/java/core/src/test/resources>
2017-03-09T07:05:01.408 [INFO] Copying 3 resources
2017-03-09T07:05:01.767 [INFO] 
2017-03-09T07:05:01.767 [INFO] --- maven-compiler-plugin:3.6.1:testCompile (default-testCompile)
@ beam-sdks-java-core ---
2017-03-09T07:05:02.027 [INFO] Changes detected - recompiling the module!
2017-03-09T07:05:02.028 [INFO] Compiling 262 source files to <https://builds.apache.org/job/beam_PostCommit_Java_MavenInstall/ws/sdks/java/core/target/test-classes>
2017-03-09T07:05:11.434 [INFO] <https://builds.apache.org/job/beam_PostCommit_Java_MavenInstall/ws/sdks/java/core/src/test/java/org/apache/beam/sdk/util/DefaultBucketTest.java>:
Some input files use or override a deprecated API.
2017-03-09T07:05:11.434 [INFO] <https://builds.apache.org/job/beam_PostCommit_Java_MavenInstall/ws/sdks/java/core/src/test/java/org/apache/beam/sdk/util/DefaultBucketTest.java>:
Recompile with -Xlint:deprecation for details.
2017-03-09T07:05:11.434 [INFO] <https://builds.apache.org/job/beam_PostCommit_Java_MavenInstall/ws/sdks/java/core/src/test/java/org/apache/beam/sdk/transforms/ApproximateQuantilesTest.java>:
Some input files use unchecked or unsafe operations.
2017-03-09T07:05:11.434 [INFO] <https://builds.apache.org/job/beam_PostCommit_Java_MavenInstall/ws/sdks/java/core/src/test/java/org/apache/beam/sdk/transforms/ApproximateQuantilesTest.java>:
Recompile with -Xlint:unchecked for details.
2017-03-09T07:05:11.995 [INFO] 
2017-03-09T07:05:11.995 [INFO] --- maven-checkstyle-plugin:2.17:check (default) @ beam-sdks-java-core
---
2017-03-09T07:05:55.578 [INFO] Starting audit...
Audit done.
2017-03-09T07:05:55.831 [INFO] 
2017-03-09T07:05:55.831 [INFO] >>> findbugs-maven-plugin:3.0.4:check (default) >
:findbugs @ beam-sdks-java-core >>>
2017-03-09T07:05:55.923 [INFO] 
2017-03-09T07:05:55.923 [INFO] --- findbugs-maven-plugin:3.0.4:findbugs (findbugs) @ beam-sdks-java-core
---
2017-03-09T07:05:56.594 [INFO] Fork Value is true
2017-03-09T07:06:55.004 [INFO] Done FindBugs Analysis....
2017-03-09T07:06:56.789 [INFO] 
2017-03-09T07:06:56.789 [INFO] <<< findbugs-maven-plugin:3.0.4:check (default) <
:findbugs @ beam-sdks-java-core <<<
2017-03-09T07:06:56.790 [INFO] 
2017-03-09T07:06:56.790 [INFO] --- findbugs-maven-plugin:3.0.4:check (default) @ beam-sdks-java-core
---
2017-03-09T07:06:56.880 [INFO] BugInstance size is 0
2017-03-09T07:06:56.890 [INFO] Error size is 0
2017-03-09T07:06:56.987 [INFO] No errors/warnings found
2017-03-09T07:06:57.789 [INFO] 
2017-03-09T07:06:57.789 [INFO] --- maven-surefire-plugin:2.19.1:test (default-test) @ beam-sdks-java-core
---
2017-03-09T07:06:57.881 [INFO] Surefire report directory: <https://builds.apache.org/job/beam_PostCommit_Java_MavenInstall/ws/sdks/java/core/target/surefire-reports>
2017-03-09T07:06:57.895 [INFO] Using configured provider org.apache.maven.surefire.junitcore.JUnitCoreProvider
2017-03-09T07:06:57.896 [INFO] parallel='none', perCoreThreadCount=true, threadCount=0, useUnlimitedThreads=false,
threadCountSuites=0, threadCountClasses=0, threadCountMethods=0, parallelOptimized=true

-------------------------------------------------------
 T E S T S
-------------------------------------------------------
Running org.apache.beam.SdkCoreApiSurfaceTest
Tests run: 1, Failures: 0, Errors: 0, Skipped: 0, Time elapsed: 8.034 sec - in org.apache.beam.SdkCoreApiSurfaceTest
Running org.apache.beam.sdk.values.PCollectionTupleTest
Tests run: 4, Failures: 0, Errors: 0, Skipped: 0, Time elapsed: 0.586 sec - in org.apache.beam.sdk.values.PCollectionTupleTest
Running org.apache.beam.sdk.values.PCollectionListTest
Tests run: 4, Failures: 0, Errors: 0, Skipped: 0, Time elapsed: 0.165 sec - in org.apache.beam.sdk.values.PCollectionListTest
Running org.apache.beam.sdk.values.TypeDescriptorsTest
Tests run: 5, Failures: 0, Errors: 0, Skipped: 0, Time elapsed: 0.03 sec - in org.apache.beam.sdk.values.TypeDescriptorsTest
Running org.apache.beam.sdk.values.TypeDescriptorTest
Tests run: 11, Failures: 0, Errors: 0, Skipped: 0, Time elapsed: 0.069 sec - in org.apache.beam.sdk.values.TypeDescriptorTest
Running org.apache.beam.sdk.values.TupleTagTest
Tests run: 2, Failures: 0, Errors: 0, Skipped: 0, Time elapsed: 0.007 sec - in org.apache.beam.sdk.values.TupleTagTest
Running org.apache.beam.sdk.values.KVTest
Tests run: 3, Failures: 0, Errors: 0, Skipped: 0, Time elapsed: 0.02 sec - in org.apache.beam.sdk.values.KVTest
Running org.apache.beam.sdk.values.TimestampedValueTest
Tests run: 7, Failures: 0, Errors: 0, Skipped: 0, Time elapsed: 0.249 sec - in org.apache.beam.sdk.values.TimestampedValueTest
Running org.apache.beam.sdk.values.TypedPValueTest
Tests run: 6, Failures: 0, Errors: 0, Skipped: 0, Time elapsed: 0.187 sec - in org.apache.beam.sdk.values.TypedPValueTest
Running org.apache.beam.sdk.metrics.MetricsEnvironmentTest
Tests run: 2, Failures: 0, Errors: 0, Skipped: 0, Time elapsed: 0.046 sec - in org.apache.beam.sdk.metrics.MetricsEnvironmentTest
Running org.apache.beam.sdk.metrics.MetricsContainerTest
Tests run: 3, Failures: 0, Errors: 0, Skipped: 0, Time elapsed: 0.005 sec - in org.apache.beam.sdk.metrics.MetricsContainerTest
Running org.apache.beam.sdk.metrics.CounterCellTest
Tests run: 1, Failures: 0, Errors: 0, Skipped: 0, Time elapsed: 0.023 sec - in org.apache.beam.sdk.metrics.CounterCellTest
Running org.apache.beam.sdk.metrics.MetricsTest
Tests run: 4, Failures: 0, Errors: 0, Skipped: 0, Time elapsed: 0.036 sec - in org.apache.beam.sdk.metrics.MetricsTest
Running org.apache.beam.sdk.metrics.DistributionCellTest
Tests run: 1, Failures: 0, Errors: 0, Skipped: 0, Time elapsed: 0.002 sec - in org.apache.beam.sdk.metrics.DistributionCellTest
Running org.apache.beam.sdk.metrics.DirtyStateTest
Tests run: 2, Failures: 0, Errors: 0, Skipped: 0, Time elapsed: 0.005 sec - in org.apache.beam.sdk.metrics.DirtyStateTest
Running org.apache.beam.sdk.metrics.MetricsMapTest
Tests run: 4, Failures: 0, Errors: 0, Skipped: 0, Time elapsed: 0.011 sec - in org.apache.beam.sdk.metrics.MetricsMapTest
Running org.apache.beam.sdk.options.ValueProviderUtilsTest
Tests run: 3, Failures: 0, Errors: 0, Skipped: 0, Time elapsed: 0.275 sec - in org.apache.beam.sdk.options.ValueProviderUtilsTest
Running org.apache.beam.sdk.options.PipelineOptionsTest
Tests run: 2, Failures: 0, Errors: 0, Skipped: 0, Time elapsed: 0.095 sec - in org.apache.beam.sdk.options.PipelineOptionsTest
Running org.apache.beam.sdk.options.PipelineOptionsFactoryTest
Tests run: 89, Failures: 0, Errors: 0, Skipped: 0, Time elapsed: 2.324 sec - in org.apache.beam.sdk.options.PipelineOptionsFactoryTest
Running org.apache.beam.sdk.options.ValueProviderTest
Tests run: 18, Failures: 0, Errors: 0, Skipped: 0, Time elapsed: 0.343 sec - in org.apache.beam.sdk.options.ValueProviderTest
Running org.apache.beam.sdk.options.GoogleApiDebugOptionsTest
Tests run: 7, Failures: 0, Errors: 0, Skipped: 0, Time elapsed: 0.624 sec - in org.apache.beam.sdk.options.GoogleApiDebugOptionsTest
Running org.apache.beam.sdk.options.GcpOptionsTest
Tests run: 10, Failures: 0, Errors: 0, Skipped: 0, Time elapsed: 1.725 sec - in org.apache.beam.sdk.options.GcpOptionsTest
Running org.apache.beam.sdk.options.ProxyInvocationHandlerTest
Tests run: 45, Failures: 0, Errors: 0, Skipped: 0, Time elapsed: 2.202 sec - in org.apache.beam.sdk.options.ProxyInvocationHandlerTest
Running org.apache.beam.sdk.options.PipelineOptionsReflectorTest
Tests run: 7, Failures: 0, Errors: 0, Skipped: 0, Time elapsed: 0.065 sec - in org.apache.beam.sdk.options.PipelineOptionsReflectorTest
Running org.apache.beam.sdk.options.PipelineOptionsValidatorTest
Tests run: 15, Failures: 0, Errors: 0, Skipped: 0, Time elapsed: 0.393 sec - in org.apache.beam.sdk.options.PipelineOptionsValidatorTest
Running org.apache.beam.sdk.PipelineTest
Tests run: 6, Failures: 0, Errors: 0, Skipped: 0, Time elapsed: 0.063 sec - in org.apache.beam.sdk.PipelineTest
Running org.apache.beam.sdk.io.CountingSourceTest
Tests run: 2, Failures: 0, Errors: 0, Skipped: 0, Time elapsed: 0.263 sec - in org.apache.beam.sdk.io.CountingSourceTest
Running org.apache.beam.sdk.io.WriteTest
Tests run: 5, Failures: 0, Errors: 0, Skipped: 0, Time elapsed: 0.121 sec - in org.apache.beam.sdk.io.WriteTest
Running org.apache.beam.sdk.io.LocalFileSystemTest
Tests run: 14, Failures: 0, Errors: 0, Skipped: 0, Time elapsed: 0.566 sec - in org.apache.beam.sdk.io.LocalFileSystemTest
Running org.apache.beam.sdk.io.PubsubIOTest
Tests run: 9, Failures: 0, Errors: 0, Skipped: 0, Time elapsed: 0.02 sec - in org.apache.beam.sdk.io.PubsubIOTest
Running org.apache.beam.sdk.io.AvroSourceTest
Tests run: 20, Failures: 0, Errors: 0, Skipped: 0, Time elapsed: 17.296 sec - in org.apache.beam.sdk.io.AvroSourceTest
Running org.apache.beam.sdk.io.XmlSinkTest
Tests run: 7, Failures: 0, Errors: 0, Skipped: 0, Time elapsed: 0.563 sec - in org.apache.beam.sdk.io.XmlSinkTest
Running org.apache.beam.sdk.io.CompressedSourceTest
Tests run: 10, Failures: 0, Errors: 0, Skipped: 0, Time elapsed: 1.117 sec - in org.apache.beam.sdk.io.CompressedSourceTest
Running org.apache.beam.sdk.io.range.ByteKeyRangeTest
Tests run: 13, Failures: 0, Errors: 0, Skipped: 0, Time elapsed: 0.426 sec - in org.apache.beam.sdk.io.range.ByteKeyRangeTest
Running org.apache.beam.sdk.io.range.ByteKeyRangeInterpolateKeyTest
Tests run: 406, Failures: 0, Errors: 0, Skipped: 0, Time elapsed: 0.262 sec - in org.apache.beam.sdk.io.range.ByteKeyRangeInterpolateKeyTest
Running org.apache.beam.sdk.io.range.ByteKeyTest
Tests run: 6, Failures: 0, Errors: 0, Skipped: 0, Time elapsed: 0 sec - in org.apache.beam.sdk.io.range.ByteKeyTest
Running org.apache.beam.sdk.io.range.OffsetRangeTrackerTest
Tests run: 14, Failures: 0, Errors: 0, Skipped: 0, Time elapsed: 0 sec - in org.apache.beam.sdk.io.range.OffsetRangeTrackerTest
Running org.apache.beam.sdk.io.range.ByteKeyRangeEstimateFractionTest
Tests run: 406, Failures: 0, Errors: 0, Skipped: 0, Time elapsed: 0.083 sec - in org.apache.beam.sdk.io.range.ByteKeyRangeEstimateFractionTest
Running org.apache.beam.sdk.io.range.ByteKeyRangeTrackerTest
Tests run: 11, Failures: 0, Errors: 0, Skipped: 0, Time elapsed: 0 sec - in org.apache.beam.sdk.io.range.ByteKeyRangeTrackerTest
Running org.apache.beam.sdk.io.LocalResourceIdTest
Tests run: 9, Failures: 0, Errors: 0, Skipped: 0, Time elapsed: 0 sec - in org.apache.beam.sdk.io.LocalResourceIdTest
Running org.apache.beam.sdk.io.AvroIOTest
Tests run: 9, Failures: 0, Errors: 0, Skipped: 0, Time elapsed: 0.202 sec - in org.apache.beam.sdk.io.AvroIOTest
Running org.apache.beam.sdk.io.CountingInputTest
Tests run: 3, Failures: 0, Errors: 0, Skipped: 0, Time elapsed: 0.034 sec - in org.apache.beam.sdk.io.CountingInputTest
Running org.apache.beam.sdk.io.BoundedReadFromUnboundedSourceTest
Tests run: 1, Failures: 0, Errors: 0, Skipped: 0, Time elapsed: 0.004 sec - in org.apache.beam.sdk.io.BoundedReadFromUnboundedSourceTest
Running org.apache.beam.sdk.io.XmlSourceTest
Tests run: 22, Failures: 0, Errors: 0, Skipped: 2, Time elapsed: 5.761 sec - in org.apache.beam.sdk.io.XmlSourceTest
Running org.apache.beam.sdk.io.TextIOTest
ERROR: Failed to parse POMs
java.io.IOException: Backing channel 'beam1' is disconnected.
	at hudson.remoting.RemoteInvocationHandler.channelOrFail(RemoteInvocationHandler.java:191)
	at hudson.remoting.RemoteInvocationHandler.invoke(RemoteInvocationHandler.java:256)
	at com.sun.proxy.$Proxy104.isAlive(Unknown Source)
	at hudson.Launcher$RemoteLauncher$ProcImpl.isAlive(Launcher.java:1043)
	at hudson.maven.ProcessCache$MavenProcess.call(ProcessCache.java:166)
	at hudson.maven.MavenModuleSetBuild$MavenModuleSetBuildExecution.doRun(MavenModuleSetBuild.java:873)
	at hudson.model.AbstractBuild$AbstractBuildExecution.run(AbstractBuild.java:534)
	at hudson.model.Run.execute(Run.java:1728)
	at hudson.maven.MavenModuleSetBuild.run(MavenModuleSetBuild.java:544)
	at hudson.model.ResourceController.execute(ResourceController.java:98)
	at hudson.model.Executor.run(Executor.java:404)
Caused by: hudson.remoting.Channel$OrderlyShutdown: java.util.concurrent.TimeoutException:
Ping started at 1489043475453 hasn't completed by 1489043777247
	at hudson.remoting.Channel$CloseCommand.execute(Channel.java:1121)
	at hudson.remoting.Channel$1.handle(Channel.java:526)
	at hudson.remoting.SynchronousCommandTransport$ReaderThread.run(SynchronousCommandTransport.java:83)
Caused by: Command close created at
	at hudson.remoting.Command.<init>(Command.java:59)
	at hudson.remoting.Channel$CloseCommand.<init>(Channel.java:1115)
	at hudson.remoting.Channel$CloseCommand.<init>(Channel.java:1113)
	at hudson.remoting.Channel.close(Channel.java:1273)
	at hudson.slaves.ChannelPinger$1.onDead(ChannelPinger.java:115)
	at hudson.remoting.PingThread.ping(PingThread.java:130)
	at hudson.remoting.PingThread.run(PingThread.java:86)
Caused by: java.util.concurrent.TimeoutException: Ping started at 1489043475453 hasn't completed
by 1489043777247
	... 2 more
FATAL: channel is already closed
hudson.remoting.ChannelClosedException: channel is already closed
	at hudson.remoting.Channel.send(Channel.java:604)
	at hudson.remoting.Request.call(Request.java:130)
	at hudson.remoting.Channel.call(Channel.java:821)
	at hudson.Launcher$RemoteLauncher.kill(Launcher.java:984)
	at hudson.model.AbstractBuild$AbstractBuildExecution.run(AbstractBuild.java:540)
	at hudson.model.Run.execute(Run.java:1728)
	at hudson.maven.MavenModuleSetBuild.run(MavenModuleSetBuild.java:544)
	at hudson.model.ResourceController.execute(ResourceController.java:98)
	at hudson.model.Executor.run(Executor.java:404)
Caused by: hudson.remoting.Channel$OrderlyShutdown: java.util.concurrent.TimeoutException:
Ping started at 1489043475453 hasn't completed by 1489043777247
	at hudson.remoting.Channel$CloseCommand.execute(Channel.java:1121)
	at hudson.remoting.Channel$1.handle(Channel.java:526)
	at hudson.remoting.SynchronousCommandTransport$ReaderThread.run(SynchronousCommandTransport.java:83)
Caused by: Command close created at
	at hudson.remoting.Command.<init>(Command.java:59)
	at hudson.remoting.Channel$CloseCommand.<init>(Channel.java:1115)
	at hudson.remoting.Channel$CloseCommand.<init>(Channel.java:1113)
	at hudson.remoting.Channel.close(Channel.java:1273)
	at hudson.slaves.ChannelPinger$1.onDead(ChannelPinger.java:115)
	at hudson.remoting.PingThread.ping(PingThread.java:130)
	at hudson.remoting.PingThread.run(PingThread.java:86)
Caused by: java.util.concurrent.TimeoutException: Ping started at 1489043475453 hasn't completed
by 1489043777247
	... 2 more

Mime
View raw message