beam-commits mailing list archives

Site index · List index
Message view « Date » · « Thread »
Top « Date » · « Thread »
From Apache Jenkins Server <jenk...@builds.apache.org>
Subject Build failed in Jenkins: beam_PostCommit_Java_Version_Test » JDK 1.7 (latest) #4
Date Thu, 09 Mar 2017 05:17:56 GMT
See <https://builds.apache.org/job/beam_PostCommit_Java_Version_Test/jdk=JDK%201.7%20(latest)/4/display/redirect?page=changes>

Changes:

[markliu] remove exclude python project in build due to Jenkins bug

------------------------------------------
[...truncated 387.79 KB...]
2017-03-09\T\05:17:23.819 [WARNING]   - com.google.rpc.Status$Builder
2017-03-09\T\05:17:23.819 [WARNING]   - com.google.api.HttpRule$2
2017-03-09\T\05:17:23.819 [WARNING]   - com.google.rpc.DebugInfoOrBuilder
2017-03-09\T\05:17:23.819 [WARNING]   - com.google.longrunning.CancelOperationRequest$Builder
2017-03-09\T\05:17:23.819 [WARNING]   - com.google.type.ColorProto
2017-03-09\T\05:17:23.819 [WARNING]   - com.google.type.TimeOfDayProto$1
2017-03-09\T\05:17:23.819 [WARNING]   - com.google.longrunning.GetOperationRequest$1
2017-03-09\T\05:17:23.819 [WARNING]   - 113 more...
2017-03-09\T\05:17:23.820 [WARNING] protobuf-lite-3.0.1.jar, protobuf-java-3.1.0.jar define
140 overlapping classes: 
2017-03-09\T\05:17:23.820 [WARNING]   - com.google.protobuf.WireFormat$JavaType
2017-03-09\T\05:17:23.820 [WARNING]   - com.google.protobuf.GeneratedMessageLite$Visitor
2017-03-09\T\05:17:23.820 [WARNING]   - com.google.protobuf.WireFormat
2017-03-09\T\05:17:23.820 [WARNING]   - com.google.protobuf.UnmodifiableLazyStringList
2017-03-09\T\05:17:23.820 [WARNING]   - com.google.protobuf.MessageLite
2017-03-09\T\05:17:23.820 [WARNING]   - com.google.protobuf.UnmodifiableLazyStringList$1
2017-03-09\T\05:17:23.820 [WARNING]   - com.google.protobuf.RopeByteString$RopeInputStream
2017-03-09\T\05:17:23.820 [WARNING]   - com.google.protobuf.ByteString$ArraysByteArrayCopier
2017-03-09\T\05:17:23.820 [WARNING]   - com.google.protobuf.AbstractProtobufList
2017-03-09\T\05:17:23.820 [WARNING]   - com.google.protobuf.Internal$EnumLiteMap
2017-03-09\T\05:17:23.820 [WARNING]   - 130 more...
2017-03-09\T\05:17:23.820 [WARNING] maven-shade-plugin has detected that some class files
are
2017-03-09\T\05:17:23.820 [WARNING] present in two or more JARs. When this happens, only one
2017-03-09\T\05:17:23.820 [WARNING] single version of the class is copied to the uber jar.
2017-03-09\T\05:17:23.820 [WARNING] Usually this is not harmful and you can skip these warnings,
2017-03-09\T\05:17:23.820 [WARNING] otherwise try to manually exclude artifacts based on
2017-03-09\T\05:17:23.820 [WARNING] mvn dependency:tree -Ddetail=true and the above output.
2017-03-09\T\05:17:23.820 [WARNING] See http://maven.apache.org/plugins/maven-shade-plugin/
2017-03-09\T\05:17:23.915 [INFO] Replacing <https://builds.apache.org/job/beam_PostCommit_Java_Version_Test/jdk=JDK%201.7%20(latest)/ws/examples/java/target/beam-examples-java-bundled-0.7.0-SNAPSHOT.jar>
with <https://builds.apache.org/job/beam_PostCommit_Java_Version_Test/jdk=JDK%201.7%20(latest)/ws/examples/java/target/beam-examples-java-0.7.0-SNAPSHOT-shaded.jar>
2017-03-09\T\05:17:24.116 [INFO] 
2017-03-09\T\05:17:24.116 [INFO] --- maven-jar-plugin:3.0.2:test-jar (default-test-jar) @
beam-examples-java ---
2017-03-09\T\05:17:24.179 [INFO] Building jar: <https://builds.apache.org/job/beam_PostCommit_Java_Version_Test/jdk=JDK%201.7%20(latest)/ws/examples/java/target/beam-examples-java-0.7.0-SNAPSHOT-tests.jar>
2017-03-09\T\05:17:24.280 [INFO] 
2017-03-09\T\05:17:24.280 [INFO] --- maven-failsafe-plugin:2.19.1:integration-test (default)
@ beam-examples-java ---
2017-03-09\T\05:17:24.404 [INFO] Failsafe report directory: <https://builds.apache.org/job/beam_PostCommit_Java_Version_Test/jdk=JDK%201.7%20(latest)/ws/examples/java/target/failsafe-reports>
2017-03-09\T\05:17:24.411 [INFO] parallel='all', perCoreThreadCount=true, threadCount=4, useUnlimitedThreads=false,
threadCountSuites=0, threadCountClasses=0, threadCountMethods=0, parallelOptimized=true

-------------------------------------------------------
 T E S T S
-------------------------------------------------------
Running org.apache.beam.examples.WordCountIT
Tests run: 1, Failures: 0, Errors: 1, Skipped: 0, Time elapsed: 0.118 sec <<< FAILURE!
- in org.apache.beam.examples.WordCountIT
testE2EWordCount(org.apache.beam.examples.WordCountIT)  Time elapsed: 0.118 sec  <<<
ERROR!
java.lang.IllegalArgumentException: Unknown 'runner' specified 'org.apache.beam.runners.dataflow.testing.TestDataflowRunner',
supported pipeline runners [DirectRunner]
	at org.apache.beam.sdk.options.PipelineOptionsFactory.parseObjects(PipelineOptionsFactory.java:1609)
	at org.apache.beam.sdk.options.PipelineOptionsFactory.access$400(PipelineOptionsFactory.java:104)
	at org.apache.beam.sdk.options.PipelineOptionsFactory$Builder.as(PipelineOptionsFactory.java:289)
	at org.apache.beam.sdk.testing.TestPipeline.testingPipelineOptions(TestPipeline.java:364)
	at org.apache.beam.examples.WordCountIT.testE2EWordCount(WordCountIT.java:59)
	at sun.reflect.NativeMethodAccessorImpl.invoke0(Native Method)
	at sun.reflect.NativeMethodAccessorImpl.invoke(NativeMethodAccessorImpl.java:57)
	at sun.reflect.DelegatingMethodAccessorImpl.invoke(DelegatingMethodAccessorImpl.java:43)
	at java.lang.reflect.Method.invoke(Method.java:606)
	at org.junit.runners.model.FrameworkMethod$1.runReflectiveCall(FrameworkMethod.java:50)
	at org.junit.internal.runners.model.ReflectiveCallable.run(ReflectiveCallable.java:12)
	at org.junit.runners.model.FrameworkMethod.invokeExplosively(FrameworkMethod.java:47)
	at org.junit.internal.runners.statements.InvokeMethod.evaluate(InvokeMethod.java:17)
	at org.junit.runners.ParentRunner.runLeaf(ParentRunner.java:325)
	at org.junit.runners.BlockJUnit4ClassRunner.runChild(BlockJUnit4ClassRunner.java:78)
	at org.junit.runners.BlockJUnit4ClassRunner.runChild(BlockJUnit4ClassRunner.java:57)
	at org.junit.runners.ParentRunner$3.run(ParentRunner.java:290)
	at org.apache.maven.surefire.junitcore.pc.Scheduler$1.run(Scheduler.java:393)
	at java.util.concurrent.Executors$RunnableAdapter.call(Executors.java:471)
	at java.util.concurrent.FutureTask.run(FutureTask.java:262)
	at java.util.concurrent.ThreadPoolExecutor.runWorker(ThreadPoolExecutor.java:1145)
	at java.util.concurrent.ThreadPoolExecutor$Worker.run(ThreadPoolExecutor.java:615)
	at java.lang.Thread.run(Thread.java:745)
Caused by: java.lang.ClassNotFoundException: org.apache.beam.runners.dataflow.testing.TestDataflowRunner
	at java.net.URLClassLoader$1.run(URLClassLoader.java:366)
	at java.net.URLClassLoader$1.run(URLClassLoader.java:355)
	at java.security.AccessController.doPrivileged(Native Method)
	at java.net.URLClassLoader.findClass(URLClassLoader.java:354)
	at java.lang.ClassLoader.loadClass(ClassLoader.java:425)
	at sun.misc.Launcher$AppClassLoader.loadClass(Launcher.java:308)
	at java.lang.ClassLoader.loadClass(ClassLoader.java:358)
	at java.lang.Class.forName0(Native Method)
	at java.lang.Class.forName(Class.java:195)
	at org.apache.beam.sdk.options.PipelineOptionsFactory.parseObjects(PipelineOptionsFactory.java:1595)
	... 22 more


Results :

Tests in error: 
  WordCountIT.testE2EWordCount:59 » IllegalArgument Unknown 'runner' specified '...

Tests run: 1, Failures: 0, Errors: 1, Skipped: 0

2017-03-09\T\05:17:28.742 [INFO] 
2017-03-09\T\05:17:28.743 [INFO] --- maven-dependency-plugin:3.0.0:analyze-only (default)
@ beam-examples-java ---
2017-03-09\T\05:17:28.779 [INFO] Downloading: https://repo.maven.apache.org/maven2/org/apache/maven/shared/maven-dependency-analyzer/1.6/maven-dependency-analyzer-1.6.pom
2017-03-09\T\05:17:28.827 [INFO] Downloaded: https://repo.maven.apache.org/maven2/org/apache/maven/shared/maven-dependency-analyzer/1.6/maven-dependency-analyzer-1.6.pom
(6 KB at 110.8 KB/sec)
2017-03-09\T\05:17:28.832 [INFO] Downloading: https://repo.maven.apache.org/maven2/org/codehaus/plexus/plexus-utils/1.5.1/plexus-utils-1.5.1.pom
2017-03-09\T\05:17:28.928 [INFO] Downloaded: https://repo.maven.apache.org/maven2/org/codehaus/plexus/plexus-utils/1.5.1/plexus-utils-1.5.1.pom
(3 KB at 23.4 KB/sec)
2017-03-09\T\05:17:28.941 [INFO] Downloading: https://repo.maven.apache.org/maven2/org/apache/maven/maven-model/2.0.5/maven-model-2.0.5.pom
2017-03-09\T\05:17:28.954 [INFO] Downloaded: https://repo.maven.apache.org/maven2/org/apache/maven/maven-model/2.0.5/maven-model-2.0.5.pom
(3 KB at 204.5 KB/sec)
2017-03-09\T\05:17:28.982 [INFO] Downloading: https://repo.maven.apache.org/maven2/org/apache/maven/maven/2.0.5/maven-2.0.5.pom
2017-03-09\T\05:17:29.017 [INFO] Downloaded: https://repo.maven.apache.org/maven2/org/apache/maven/maven/2.0.5/maven-2.0.5.pom
(6 KB at 159.2 KB/sec)
2017-03-09\T\05:17:29.024 [INFO] Downloading: https://repo.maven.apache.org/maven2/org/apache/maven/maven-artifact/2.0.5/maven-artifact-2.0.5.pom
2017-03-09\T\05:17:29.087 [INFO] Downloaded: https://repo.maven.apache.org/maven2/org/apache/maven/maven-artifact/2.0.5/maven-artifact-2.0.5.pom
(727 B at 11.3 KB/sec)
2017-03-09\T\05:17:29.091 [INFO] Downloading: https://repo.maven.apache.org/maven2/org/apache/maven/shared/maven-dependency-tree/3.0/maven-dependency-tree-3.0.pom
2017-03-09\T\05:17:29.138 [INFO] Downloaded: https://repo.maven.apache.org/maven2/org/apache/maven/shared/maven-dependency-tree/3.0/maven-dependency-tree-3.0.pom
(8 KB at 153.1 KB/sec)
2017-03-09\T\05:17:29.203 [INFO] Downloading: https://repo.maven.apache.org/maven2/org/apache/maven/shared/maven-dependency-analyzer/1.6/maven-dependency-analyzer-1.6.jar
2017-03-09\T\05:17:29.204 [INFO] Downloading: https://repo.maven.apache.org/maven2/org/apache/maven/shared/maven-dependency-tree/3.0/maven-dependency-tree-3.0.jar
2017-03-09\T\05:17:29.205 [INFO] Downloading: https://repo.maven.apache.org/maven2/commons-collections/commons-collections/3.2.2/commons-collections-3.2.2.jar
2017-03-09\T\05:17:29.246 [INFO] Downloaded: https://repo.maven.apache.org/maven2/org/apache/maven/shared/maven-dependency-analyzer/1.6/maven-dependency-analyzer-1.6.jar
(31 KB at 715.5 KB/sec)
2017-03-09\T\05:17:29.247 [INFO] Downloaded: https://repo.maven.apache.org/maven2/org/apache/maven/shared/maven-dependency-tree/3.0/maven-dependency-tree-3.0.jar
(36 KB at 811.6 KB/sec)
2017-03-09\T\05:17:29.547 [INFO] Downloaded: https://repo.maven.apache.org/maven2/commons-collections/commons-collections/3.2.2/commons-collections-3.2.2.jar
(575 KB at 1670.2 KB/sec)
2017-03-09\T\05:17:30.103 [INFO] No dependency problems found
2017-03-09\T\05:17:30.103 [INFO] 
2017-03-09\T\05:17:30.103 [INFO] --- apache-rat-plugin:0.12:check (default) @ beam-examples-java
---
2017-03-09\T\05:17:30.111 [INFO] Downloading: https://repo.maven.apache.org/maven2/org/apache/rat/apache-rat-core/0.12/apache-rat-core-0.12.pom
2017-03-09\T\05:17:30.158 [INFO] Downloaded: https://repo.maven.apache.org/maven2/org/apache/rat/apache-rat-core/0.12/apache-rat-core-0.12.pom
(5 KB at 88.3 KB/sec)
2017-03-09\T\05:17:30.161 [INFO] Downloading: https://repo.maven.apache.org/maven2/org/apache/rat/apache-rat-api/0.12/apache-rat-api-0.12.pom
2017-03-09\T\05:17:30.205 [INFO] Downloaded: https://repo.maven.apache.org/maven2/org/apache/rat/apache-rat-api/0.12/apache-rat-api-0.12.pom
(2 KB at 41.5 KB/sec)
2017-03-09\T\05:17:30.209 [INFO] Downloading: https://repo.maven.apache.org/maven2/org/apache/commons/commons-compress/1.10/commons-compress-1.10.pom
2017-03-09\T\05:17:30.246 [INFO] Downloaded: https://repo.maven.apache.org/maven2/org/apache/commons/commons-compress/1.10/commons-compress-1.10.pom
(13 KB at 331.6 KB/sec)
2017-03-09\T\05:17:30.249 [INFO] Downloading: https://repo.maven.apache.org/maven2/org/apache/commons/commons-parent/38/commons-parent-38.pom
2017-03-09\T\05:17:30.385 [INFO] Downloaded: https://repo.maven.apache.org/maven2/org/apache/commons/commons-parent/38/commons-parent-38.pom
(61 KB at 446.5 KB/sec)
2017-03-09\T\05:17:30.392 [INFO] Downloading: https://repo.maven.apache.org/maven2/org/apache/maven/doxia/doxia-sink-api/1.6/doxia-sink-api-1.6.pom
2017-03-09\T\05:17:30.443 [INFO] Downloaded: https://repo.maven.apache.org/maven2/org/apache/maven/doxia/doxia-sink-api/1.6/doxia-sink-api-1.6.pom
(2 KB at 29.3 KB/sec)
2017-03-09\T\05:17:30.488 [INFO] Downloading: https://repo.maven.apache.org/maven2/org/apache/maven/doxia/doxia-site-renderer/1.6/doxia-site-renderer-1.6.pom
2017-03-09\T\05:17:30.552 [INFO] Downloaded: https://repo.maven.apache.org/maven2/org/apache/maven/doxia/doxia-site-renderer/1.6/doxia-site-renderer-1.6.pom
(6 KB at 93.2 KB/sec)
2017-03-09\T\05:17:30.555 [INFO] Downloading: https://repo.maven.apache.org/maven2/org/apache/maven/doxia/doxia-core/1.6/doxia-core-1.6.pom
2017-03-09\T\05:17:30.570 [INFO] Downloaded: https://repo.maven.apache.org/maven2/org/apache/maven/doxia/doxia-core/1.6/doxia-core-1.6.pom
(5 KB at 273.6 KB/sec)
2017-03-09\T\05:17:30.574 [INFO] Downloading: https://repo.maven.apache.org/maven2/org/apache/maven/doxia/doxia-module-xhtml/1.6/doxia-module-xhtml-1.6.pom
2017-03-09\T\05:17:30.620 [INFO] Downloaded: https://repo.maven.apache.org/maven2/org/apache/maven/doxia/doxia-module-xhtml/1.6/doxia-module-xhtml-1.6.pom
(2 KB at 34.6 KB/sec)
2017-03-09\T\05:17:30.622 [INFO] Downloading: https://repo.maven.apache.org/maven2/org/apache/maven/doxia/doxia-modules/1.6/doxia-modules-1.6.pom
2017-03-09\T\05:17:30.665 [INFO] Downloaded: https://repo.maven.apache.org/maven2/org/apache/maven/doxia/doxia-modules/1.6/doxia-modules-1.6.pom
(3 KB at 59.5 KB/sec)
2017-03-09\T\05:17:30.669 [INFO] Downloading: https://repo.maven.apache.org/maven2/org/apache/maven/doxia/doxia-module-fml/1.6/doxia-module-fml-1.6.pom
2017-03-09\T\05:17:30.683 [INFO] Downloaded: https://repo.maven.apache.org/maven2/org/apache/maven/doxia/doxia-module-fml/1.6/doxia-module-fml-1.6.pom
(5 KB at 335.1 KB/sec)
2017-03-09\T\05:17:30.691 [INFO] Downloading: https://repo.maven.apache.org/maven2/org/codehaus/plexus/plexus-utils/3.0.21/plexus-utils-3.0.21.pom
2017-03-09\T\05:17:30.713 [INFO] Downloaded: https://repo.maven.apache.org/maven2/org/codehaus/plexus/plexus-utils/3.0.21/plexus-utils-3.0.21.pom
(4 KB at 169.1 KB/sec)
2017-03-09\T\05:17:30.752 [INFO] Downloading: https://repo.maven.apache.org/maven2/org/apache/maven/doxia/doxia-logging-api/1.2/doxia-logging-api-1.2.jar
2017-03-09\T\05:17:30.752 [INFO] Downloading: https://repo.maven.apache.org/maven2/org/codehaus/plexus/plexus-classworlds/1.2-alpha-9/plexus-classworlds-1.2-alpha-9.jar
2017-03-09\T\05:17:30.752 [INFO] Downloading: https://repo.maven.apache.org/maven2/org/apache/rat/apache-rat-core/0.12/apache-rat-core-0.12.jar
2017-03-09\T\05:17:30.753 [INFO] Downloading: https://repo.maven.apache.org/maven2/org/apache/rat/apache-rat-api/0.12/apache-rat-api-0.12.jar
2017-03-09\T\05:17:30.753 [INFO] Downloading: https://repo.maven.apache.org/maven2/commons-io/commons-io/2.2/commons-io-2.2.jar
2017-03-09\T\05:17:30.776 [INFO] Downloaded: https://repo.maven.apache.org/maven2/org/apache/rat/apache-rat-api/0.12/apache-rat-api-0.12.jar
(11 KB at 431.6 KB/sec)
2017-03-09\T\05:17:30.776 [INFO] Downloading: https://repo.maven.apache.org/maven2/org/apache/commons/commons-compress/1.10/commons-compress-1.10.jar
2017-03-09\T\05:17:30.777 [INFO] Downloaded: https://repo.maven.apache.org/maven2/org/apache/maven/doxia/doxia-logging-api/1.2/doxia-logging-api-1.2.jar
(12 KB at 443.2 KB/sec)
2017-03-09\T\05:17:30.777 [INFO] Downloading: https://repo.maven.apache.org/maven2/org/apache/maven/doxia/doxia-decoration-model/1.6/doxia-decoration-model-1.6.jar
2017-03-09\T\05:17:30.782 [INFO] Downloaded: https://repo.maven.apache.org/maven2/org/codehaus/plexus/plexus-classworlds/1.2-alpha-9/plexus-classworlds-1.2-alpha-9.jar
(42 KB at 1384.3 KB/sec)
2017-03-09\T\05:17:30.782 [INFO] Downloading: https://repo.maven.apache.org/maven2/org/apache/maven/doxia/doxia-sink-api/1.6/doxia-sink-api-1.6.jar
2017-03-09\T\05:17:30.813 [INFO] Downloaded: https://repo.maven.apache.org/maven2/commons-io/commons-io/2.2/commons-io-2.2.jar
(170 KB at 2825.3 KB/sec)
2017-03-09\T\05:17:30.813 [INFO] Downloading: https://repo.maven.apache.org/maven2/org/apache/maven/doxia/doxia-site-renderer/1.6/doxia-site-renderer-1.6.jar
2017-03-09\T\05:17:30.814 [INFO] Downloaded: https://repo.maven.apache.org/maven2/org/apache/rat/apache-rat-core/0.12/apache-rat-core-0.12.jar
(120 KB at 1927.4 KB/sec)
2017-03-09\T\05:17:30.814 [INFO] Downloading: https://repo.maven.apache.org/maven2/org/apache/maven/doxia/doxia-module-xhtml/1.6/doxia-module-xhtml-1.6.jar
2017-03-09\T\05:17:30.821 [INFO] Downloaded: https://repo.maven.apache.org/maven2/org/apache/maven/doxia/doxia-sink-api/1.6/doxia-sink-api-1.6.jar
(11 KB at 161.0 KB/sec)
2017-03-09\T\05:17:30.821 [INFO] Downloading: https://repo.maven.apache.org/maven2/org/apache/maven/doxia/doxia-module-fml/1.6/doxia-module-fml-1.6.jar
2017-03-09\T\05:17:30.824 [INFO] Downloaded: https://repo.maven.apache.org/maven2/org/apache/maven/doxia/doxia-decoration-model/1.6/doxia-decoration-model-1.6.jar
(56 KB at 781.9 KB/sec)
2017-03-09\T\05:17:30.824 [INFO] Downloading: https://repo.maven.apache.org/maven2/org/codehaus/plexus/plexus-utils/3.0.21/plexus-utils-3.0.21.jar
2017-03-09\T\05:17:30.830 [INFO] Downloaded: https://repo.maven.apache.org/maven2/org/apache/maven/doxia/doxia-module-xhtml/1.6/doxia-module-xhtml-1.6.jar
(16 KB at 203.2 KB/sec)
2017-03-09\T\05:17:30.833 [INFO] Downloaded: https://repo.maven.apache.org/maven2/org/apache/maven/doxia/doxia-site-renderer/1.6/doxia-site-renderer-1.6.jar
(56 KB at 688.5 KB/sec)
2017-03-09\T\05:17:30.838 [INFO] Downloaded: https://repo.maven.apache.org/maven2/org/apache/maven/doxia/doxia-module-fml/1.6/doxia-module-fml-1.6.jar
(38 KB at 442.1 KB/sec)
2017-03-09\T\05:17:30.850 [INFO] Downloaded: https://repo.maven.apache.org/maven2/org/apache/commons/commons-compress/1.10/commons-compress-1.10.jar
(400 KB at 4122.5 KB/sec)
2017-03-09\T\05:17:30.863 [INFO] Downloaded: https://repo.maven.apache.org/maven2/org/codehaus/plexus/plexus-utils/3.0.21/plexus-utils-3.0.21.jar
(240 KB at 2173.0 KB/sec)
2017-03-09\T\05:17:30.983 [INFO] Enabled default license matchers.
2017-03-09\T\05:17:30.986 [INFO] Will parse SCM ignores for exclusions...
2017-03-09\T\05:17:30.998 [INFO] Finished adding exclusions from SCM ignore files.
2017-03-09\T\05:17:30.998 [INFO] 61 implicit excludes (use -debug for more details).
2017-03-09\T\05:17:30.998 [INFO] Exclude: **/target/**/*
2017-03-09\T\05:17:30.999 [INFO] Exclude: **/dependency-reduced-pom.xml
2017-03-09\T\05:17:30.999 [INFO] Exclude: **/hs_err_pid*.log
2017-03-09\T\05:17:30.999 [INFO] Exclude: .github/**/*
2017-03-09\T\05:17:30.999 [INFO] Exclude: **/*.iml
2017-03-09\T\05:17:30.999 [INFO] Exclude: **/.idea/**/*
2017-03-09\T\05:17:30.999 [INFO] Exclude: **/*.egg-info/**/*
2017-03-09\T\05:17:30.999 [INFO] Exclude: **/package-list
2017-03-09\T\05:17:30.999 [INFO] Exclude: **/user.avsc
2017-03-09\T\05:17:30.999 [INFO] Exclude: **/test/resources/**/*.txt
2017-03-09\T\05:17:30.999 [INFO] Exclude: **/test/**/.placeholder
2017-03-09\T\05:17:30.999 [INFO] Exclude: .repository/**/*
2017-03-09\T\05:17:31.000 [INFO] Exclude: **/nose-*.egg/**/*
2017-03-09\T\05:17:31.000 [INFO] Exclude: **/.eggs/**/*
2017-03-09\T\05:17:31.000 [INFO] Exclude: **/.tox/**/*
2017-03-09\T\05:17:31.000 [INFO] Exclude: **/.checkstyle
2017-03-09\T\05:17:31.000 [INFO] Exclude: **/.classpath
2017-03-09\T\05:17:31.000 [INFO] Exclude: **/.factorypath
2017-03-09\T\05:17:31.000 [INFO] Exclude: **/.project
2017-03-09\T\05:17:31.000 [INFO] Exclude: **/.settings/**/*
2017-03-09\T\05:17:31.259 [INFO] 43 resources included (use -debug for more details)
2017-03-09\T\05:17:31.523 [INFO] Rat check: Summary over all files. Unapproved: 0, unknown:
0, generated: 0, approved: 42 licenses.
2017-03-09\T\05:17:31.523 [INFO] 
2017-03-09\T\05:17:31.523 [INFO] --- maven-failsafe-plugin:2.19.1:verify (default) @ beam-examples-java
---
2017-03-09\T\05:17:31.525 [INFO] Failsafe report directory: <https://builds.apache.org/job/beam_PostCommit_Java_Version_Test/jdk=JDK%201.7%20(latest)/ws/examples/java/target/failsafe-reports>
2017-03-09\T\05:17:31.529 [INFO]                                                         
               
2017-03-09\T\05:17:31.529 [INFO] ------------------------------------------------------------------------
2017-03-09\T\05:17:31.529 [INFO] Skipping Apache Beam :: Examples :: Java
2017-03-09\T\05:17:31.529 [INFO] This project has been banned from the build due to previous
failures.
2017-03-09\T\05:17:31.529 [INFO] ------------------------------------------------------------------------
2017-03-09\T\05:17:31.529 [INFO]                                                         
               
2017-03-09\T\05:17:31.529 [INFO] ------------------------------------------------------------------------
2017-03-09\T\05:17:31.529 [INFO] Skipping Apache Beam :: Examples :: Java
2017-03-09\T\05:17:31.529 [INFO] This project has been banned from the build due to previous
failures.
2017-03-09\T\05:17:31.529 [INFO] ------------------------------------------------------------------------
2017-03-09\T\05:17:31.529 [INFO]                                                         
               
2017-03-09\T\05:17:31.529 [INFO] ------------------------------------------------------------------------
2017-03-09\T\05:17:31.529 [INFO] Skipping Apache Beam :: Examples :: Java
2017-03-09\T\05:17:31.529 [INFO] This project has been banned from the build due to previous
failures.
2017-03-09\T\05:17:31.529 [INFO] ------------------------------------------------------------------------
2017-03-09\T\05:17:31.529 [INFO] ------------------------------------------------------------------------
2017-03-09\T\05:17:31.529 [INFO] BUILD FAILURE
2017-03-09\T\05:17:31.529 [INFO] ------------------------------------------------------------------------
2017-03-09\T\05:17:31.530 [INFO] Total time: 02:05 min
2017-03-09\T\05:17:31.530 [INFO] Finished at: 2017-03-09T05:17:31+00:00
2017-03-09\T\05:17:32.474 [INFO] Final Memory: 218M/3750M
2017-03-09\T\05:17:32.474 [INFO] ------------------------------------------------------------------------
2017-03-09\T\05:17:32.475 [ERROR] Failed to execute goal org.apache.maven.plugins:maven-failsafe-plugin:2.19.1:verify
(default) on project beam-examples-java: There are test failures.
2017-03-09\T\05:17:32.475 [ERROR] 
2017-03-09\T\05:17:32.475 [ERROR] Please refer to <https://builds.apache.org/job/beam_PostCommit_Java_Version_Test/jdk=JDK%201.7%20(latest)/ws/examples/java/target/failsafe-reports>
for the individual test results.
2017-03-09\T\05:17:32.475 [ERROR] -> [Help 1]
org.apache.maven.lifecycle.LifecycleExecutionException: Failed to execute goal org.apache.maven.plugins:maven-failsafe-plugin:2.19.1:verify
(default) on project beam-examples-java: There are test failures.

Please refer to <https://builds.apache.org/job/beam_PostCommit_Java_Version_Test/jdk=JDK%201.7%20(latest)/ws/examples/java/target/failsafe-reports>
for the individual test results.
	at org.apache.maven.lifecycle.internal.MojoExecutor.execute(MojoExecutor.java:212)
	at org.apache.maven.lifecycle.internal.MojoExecutor.execute(MojoExecutor.java:153)
	at org.apache.maven.lifecycle.internal.MojoExecutor.execute(MojoExecutor.java:145)
	at org.apache.maven.lifecycle.internal.LifecycleModuleBuilder.buildProject(LifecycleModuleBuilder.java:116)
	at org.apache.maven.lifecycle.internal.LifecycleModuleBuilder.buildProject(LifecycleModuleBuilder.java:80)
	at org.apache.maven.lifecycle.internal.builder.singlethreaded.SingleThreadedBuilder.build(SingleThreadedBuilder.java:51)
	at org.apache.maven.lifecycle.internal.LifecycleStarter.execute(LifecycleStarter.java:128)
	at org.apache.maven.DefaultMaven.doExecute(DefaultMaven.java:307)
	at org.apache.maven.DefaultMaven.doExecute(DefaultMaven.java:193)
	at org.apache.maven.DefaultMaven.execute(DefaultMaven.java:106)
	at org.apache.maven.cli.MavenCli.execute(MavenCli.java:862)
	at org.apache.maven.cli.MavenCli.doMain(MavenCli.java:286)
	at org.apache.maven.cli.MavenCli.main(MavenCli.java:197)
	at sun.reflect.NativeMethodAccessorImpl.invoke0(Native Method)
	at sun.reflect.NativeMethodAccessorImpl.invoke(NativeMethodAccessorImpl.java:57)
	at sun.reflect.DelegatingMethodAccessorImpl.invoke(DelegatingMethodAccessorImpl.java:43)
	at java.lang.reflect.Method.invoke(Method.java:606)
	at org.codehaus.plexus.classworlds.launcher.Launcher.launchEnhanced(Launcher.java:289)
	at org.codehaus.plexus.classworlds.launcher.Launcher.launch(Launcher.java:229)
	at org.codehaus.plexus.classworlds.launcher.Launcher.mainWithExitCode(Launcher.java:415)
	at org.codehaus.plexus.classworlds.launcher.Launcher.main(Launcher.java:356)
Caused by: org.apache.maven.plugin.MojoFailureException: There are test failures.

Please refer to <https://builds.apache.org/job/beam_PostCommit_Java_Version_Test/jdk=JDK%201.7%20(latest)/ws/examples/java/target/failsafe-reports>
for the individual test results.
	at org.apache.maven.plugin.surefire.SurefireHelper.reportExecution(SurefireHelper.java:91)
	at org.apache.maven.plugin.failsafe.VerifyMojo.execute(VerifyMojo.java:202)
	at org.apache.maven.plugin.DefaultBuildPluginManager.executeMojo(DefaultBuildPluginManager.java:134)
	at org.apache.maven.lifecycle.internal.MojoExecutor.execute(MojoExecutor.java:208)
	... 20 more
2017-03-09\T\05:17:32.476 [ERROR] 
2017-03-09\T\05:17:32.476 [ERROR] Re-run Maven using the -X switch to enable full debug logging.
2017-03-09\T\05:17:32.476 [ERROR] 
2017-03-09\T\05:17:32.476 [ERROR] For more information about the errors and possible solutions,
please read the following articles:
2017-03-09\T\05:17:32.476 [ERROR] [Help 1] http://cwiki.apache.org/confluence/display/MAVEN/MojoFailureException
Build step 'Invoke top-level Maven targets' marked build as failure

Mime
View raw message