beam-commits mailing list archives

Site index · List index
Message view « Date » · « Thread »
Top « Date » · « Thread »
From Apache Jenkins Server <jenk...@builds.apache.org>
Subject Build failed in Jenkins: beam_PostCommit_Java_MavenInstall #3013
Date Thu, 23 Mar 2017 22:23:31 GMT
See <https://builds.apache.org/job/beam_PostCommit_Java_MavenInstall/3013/display/redirect?page=changes>

Changes:

[tgroh] Add WindowMappingFn

------------------------------------------
[...truncated 2.41 MB...]
2017-03-23T22:21:25.637 [INFO] Downloaded: https://repo.maven.apache.org/maven2/org/eclipse/jgit/org.eclipse.jgit-parent/4.5.0.201609210915-r/org.eclipse.jgit-parent-4.5.0.201609210915-r.pom
(27 KB at 314.6 KB/sec)
2017-03-23T22:21:25.672 [INFO] Downloading: https://repo.maven.apache.org/maven2/com/jcraft/jsch/0.1.53/jsch-0.1.53.pom
2017-03-23T22:21:26.090 [INFO] Downloaded: https://repo.maven.apache.org/maven2/com/jcraft/jsch/0.1.53/jsch-0.1.53.pom
(4 KB at 7.6 KB/sec)
2017-03-23T22:21:26.109 [INFO] Downloading: https://repo.maven.apache.org/maven2/org/sonatype/oss/oss-parent/6/oss-parent-6.pom
2017-03-23T22:21:26.212 [INFO] Downloaded: https://repo.maven.apache.org/maven2/org/sonatype/oss/oss-parent/6/oss-parent-6.pom
(5 KB at 46.3 KB/sec)
2017-03-23T22:21:26.231 [INFO] Downloading: https://repo.maven.apache.org/maven2/com/googlecode/javaewah/JavaEWAH/0.7.9/JavaEWAH-0.7.9.pom
2017-03-23T22:21:26.325 [INFO] Downloaded: https://repo.maven.apache.org/maven2/com/googlecode/javaewah/JavaEWAH/0.7.9/JavaEWAH-0.7.9.pom
(5 KB at 45.6 KB/sec)
2017-03-23T22:21:26.397 [INFO] Downloading: https://repo.maven.apache.org/maven2/org/slf4j/slf4j-api/1.7.21/slf4j-api-1.7.21.pom
2017-03-23T22:21:26.487 [INFO] Downloaded: https://repo.maven.apache.org/maven2/org/slf4j/slf4j-api/1.7.21/slf4j-api-1.7.21.pom
(3 KB at 30.1 KB/sec)
2017-03-23T22:21:26.502 [INFO] Downloading: https://repo.maven.apache.org/maven2/org/slf4j/slf4j-parent/1.7.21/slf4j-parent-1.7.21.pom
2017-03-23T22:21:26.579 [INFO] Downloaded: https://repo.maven.apache.org/maven2/org/slf4j/slf4j-parent/1.7.21/slf4j-parent-1.7.21.pom
(14 KB at 171.3 KB/sec)
2017-03-23T22:21:26.602 [INFO] Downloading: https://repo.maven.apache.org/maven2/org/codehaus/plexus/plexus-utils/2.0.7/plexus-utils-2.0.7.pom
2017-03-23T22:21:26.687 [INFO] Downloaded: https://repo.maven.apache.org/maven2/org/codehaus/plexus/plexus-utils/2.0.7/plexus-utils-2.0.7.pom
(3 KB at 32.7 KB/sec)
2017-03-23T22:21:26.786 [INFO] Downloading: https://repo.maven.apache.org/maven2/org/sonatype/sisu/sisu-inject-plexus/1.4.3.2/sisu-inject-plexus-1.4.3.2.pom
2017-03-23T22:21:26.891 [INFO] Downloaded: https://repo.maven.apache.org/maven2/org/sonatype/sisu/sisu-inject-plexus/1.4.3.2/sisu-inject-plexus-1.4.3.2.pom
(6 KB at 55.3 KB/sec)
2017-03-23T22:21:26.913 [INFO] Downloading: https://repo.maven.apache.org/maven2/org/sonatype/sisu/inject/guice-plexus/1.4.3.2/guice-plexus-1.4.3.2.pom
2017-03-23T22:21:27.018 [INFO] Downloaded: https://repo.maven.apache.org/maven2/org/sonatype/sisu/inject/guice-plexus/1.4.3.2/guice-plexus-1.4.3.2.pom
(3 KB at 28.2 KB/sec)
2017-03-23T22:21:27.047 [INFO] Downloading: https://repo.maven.apache.org/maven2/org/sonatype/sisu/inject/guice-bean/1.4.3.2/guice-bean-1.4.3.2.pom
2017-03-23T22:21:27.189 [INFO] Downloaded: https://repo.maven.apache.org/maven2/org/sonatype/sisu/inject/guice-bean/1.4.3.2/guice-bean-1.4.3.2.pom
(3 KB at 17.4 KB/sec)
2017-03-23T22:21:27.217 [INFO] Downloading: https://repo.maven.apache.org/maven2/org/sonatype/sisu/sisu-inject/1.4.3.2/sisu-inject-1.4.3.2.pom
2017-03-23T22:21:27.313 [INFO] Downloaded: https://repo.maven.apache.org/maven2/org/sonatype/sisu/sisu-inject/1.4.3.2/sisu-inject-1.4.3.2.pom
(2 KB at 12.2 KB/sec)
2017-03-23T22:21:27.327 [INFO] Downloading: https://repo.maven.apache.org/maven2/org/sonatype/sisu/sisu-parent/1.4.3.2/sisu-parent-1.4.3.2.pom
2017-03-23T22:21:27.425 [INFO] Downloaded: https://repo.maven.apache.org/maven2/org/sonatype/sisu/sisu-parent/1.4.3.2/sisu-parent-1.4.3.2.pom
(8 KB at 81.4 KB/sec)
2017-03-23T22:21:27.451 [INFO] Downloading: https://repo.maven.apache.org/maven2/org/sonatype/sisu/sisu-inject-bean/1.4.3.2/sisu-inject-bean-1.4.3.2.pom
2017-03-23T22:21:27.537 [INFO] Downloaded: https://repo.maven.apache.org/maven2/org/sonatype/sisu/sisu-inject-bean/1.4.3.2/sisu-inject-bean-1.4.3.2.pom
(6 KB at 59.5 KB/sec)
2017-03-23T22:21:27.561 [INFO] Downloading: https://repo.maven.apache.org/maven2/org/sonatype/sisu/sisu-guice/2.9.2/sisu-guice-2.9.2.pom
2017-03-23T22:21:27.649 [INFO] Downloaded: https://repo.maven.apache.org/maven2/org/sonatype/sisu/sisu-guice/2.9.2/sisu-guice-2.9.2.pom
(8 KB at 81.6 KB/sec)
2017-03-23T22:21:27.666 [INFO] Downloading: https://repo.maven.apache.org/maven2/org/sonatype/sisu/inject/guice-parent/2.9.2/guice-parent-2.9.2.pom
2017-03-23T22:21:27.733 [INFO] Downloaded: https://repo.maven.apache.org/maven2/org/sonatype/sisu/inject/guice-parent/2.9.2/guice-parent-2.9.2.pom
(12 KB at 178.5 KB/sec)
2017-03-23T22:21:27.766 [INFO] Downloading: https://repo.maven.apache.org/maven2/org/slf4j/jcl-over-slf4j/1.7.21/jcl-over-slf4j-1.7.21.pom
2017-03-23T22:21:27.835 [INFO] Downloaded: https://repo.maven.apache.org/maven2/org/slf4j/jcl-over-slf4j/1.7.21/jcl-over-slf4j-1.7.21.pom
(963 B at 13.8 KB/sec)
2017-03-23T22:21:27.912 [INFO] Downloading: https://repo.maven.apache.org/maven2/org/apache/httpcomponents/httpmime/4.5.2/httpmime-4.5.2.jar
2017-03-23T22:21:27.935 [INFO] Downloading: https://repo.maven.apache.org/maven2/com/fasterxml/jackson/core/jackson-core/2.8.3/jackson-core-2.8.3.jar
2017-03-23T22:21:27.973 [INFO] Downloading: https://repo.maven.apache.org/maven2/com/fasterxml/jackson/core/jackson-annotations/2.8.3/jackson-annotations-2.8.3.jar
2017-03-23T22:21:28.004 [INFO] Downloading: https://repo.maven.apache.org/maven2/com/fasterxml/jackson/core/jackson-databind/2.8.3/jackson-databind-2.8.3.jar
2017-03-23T22:21:28.006 [INFO] Downloading: https://repo.maven.apache.org/maven2/org/eclipse/jgit/org.eclipse.jgit/4.5.0.201609210915-r/org.eclipse.jgit-4.5.0.201609210915-r.jar
2017-03-23T22:21:28.600 [INFO] Downloaded: https://repo.maven.apache.org/maven2/org/eclipse/jgit/org.eclipse.jgit/4.5.0.201609210915-r/org.eclipse.jgit-4.5.0.201609210915-r.jar
(2324 KB at 3840.3 KB/sec)
2017-03-23T22:21:28.600 [INFO] Downloading: https://repo.maven.apache.org/maven2/com/jcraft/jsch/0.1.53/jsch-0.1.53.jar
2017-03-23T22:21:28.742 [INFO] Downloaded: https://repo.maven.apache.org/maven2/com/jcraft/jsch/0.1.53/jsch-0.1.53.jar
(274 KB at 366.3 KB/sec)
2017-03-23T22:21:28.743 [INFO] Downloading: https://repo.maven.apache.org/maven2/com/googlecode/javaewah/JavaEWAH/0.7.9/JavaEWAH-0.7.9.jar
2017-03-23T22:21:28.849 [INFO] Downloaded: https://repo.maven.apache.org/maven2/com/googlecode/javaewah/JavaEWAH/0.7.9/JavaEWAH-0.7.9.jar
(123 KB at 143.1 KB/sec)
2017-03-23T22:21:28.850 [INFO] Downloading: https://repo.maven.apache.org/maven2/org/codehaus/plexus/plexus-utils/2.0.7/plexus-utils-2.0.7.jar
2017-03-23T22:21:28.948 [INFO] Downloaded: https://repo.maven.apache.org/maven2/org/codehaus/plexus/plexus-utils/2.0.7/plexus-utils-2.0.7.jar
(219 KB at 229.7 KB/sec)
2017-03-23T22:21:28.948 [INFO] Downloading: https://repo.maven.apache.org/maven2/org/sonatype/sisu/sisu-inject-plexus/1.4.3.2/sisu-inject-plexus-1.4.3.2.jar
2017-03-23T22:21:28.997 [INFO] Downloaded: https://repo.maven.apache.org/maven2/org/apache/httpcomponents/httpmime/4.5.2/httpmime-4.5.2.jar
(41 KB at 36.7 KB/sec)
2017-03-23T22:21:29.023 [INFO] Downloading: https://repo.maven.apache.org/maven2/org/sonatype/sisu/sisu-inject-bean/1.4.3.2/sisu-inject-bean-1.4.3.2.jar
2017-03-23T22:21:29.050 [INFO] Downloaded: https://repo.maven.apache.org/maven2/org/sonatype/sisu/sisu-inject-plexus/1.4.3.2/sisu-inject-plexus-1.4.3.2.jar
(201 KB at 189.8 KB/sec)
2017-03-23T22:21:29.052 [INFO] Downloading: https://repo.maven.apache.org/maven2/org/sonatype/sisu/sisu-guice/2.9.2/sisu-guice-2.9.2-no_aop.jar
2017-03-23T22:21:29.141 [INFO] Downloaded: https://repo.maven.apache.org/maven2/org/sonatype/sisu/sisu-inject-bean/1.4.3.2/sisu-inject-bean-1.4.3.2.jar
(157 KB at 136.9 KB/sec)
2017-03-23T22:21:29.143 [INFO] Downloading: https://repo.maven.apache.org/maven2/org/slf4j/slf4j-api/1.7.21/slf4j-api-1.7.21.jar
2017-03-23T22:21:29.216 [INFO] Downloaded: https://repo.maven.apache.org/maven2/org/sonatype/sisu/sisu-guice/2.9.2/sisu-guice-2.9.2-no_aop.jar
(469 KB at 384.4 KB/sec)
2017-03-23T22:21:29.216 [INFO] Downloading: https://repo.maven.apache.org/maven2/org/slf4j/jcl-over-slf4j/1.7.21/jcl-over-slf4j-1.7.21.jar
2017-03-23T22:21:29.226 [INFO] Downloaded: https://repo.maven.apache.org/maven2/org/slf4j/slf4j-api/1.7.21/slf4j-api-1.7.21.jar
(41 KB at 32.6 KB/sec)
2017-03-23T22:21:29.317 [INFO] Downloaded: https://repo.maven.apache.org/maven2/org/slf4j/jcl-over-slf4j/1.7.21/jcl-over-slf4j-1.7.21.jar
(17 KB at 12.1 KB/sec)
2017-03-23T22:21:34.258 [INFO] Downloaded: https://repo.maven.apache.org/maven2/com/fasterxml/jackson/core/jackson-databind/2.8.3/jackson-databind-2.8.3.jar
(1205 KB at 190.6 KB/sec)
2017-03-23T22:21:40.516 [INFO] Downloaded: https://repo.maven.apache.org/maven2/com/fasterxml/jackson/core/jackson-annotations/2.8.3/jackson-annotations-2.8.3.jar
(55 KB at 4.3 KB/sec)
[WARNING] Failed to getClass for org.eluder.coveralls.maven.plugin.CoverallsReportMojo
[JENKINS] Archiving disabled
[JENKINS] Archiving disabled
[JENKINS] Archiving disabled
[JENKINS] Archiving disabled
[JENKINS] Archiving disabled
[JENKINS] Archiving disabled
[JENKINS] Archiving disabled
[JENKINS] Archiving disabled
[JENKINS] Archiving disabled
[JENKINS] Archiving disabled
[JENKINS] Archiving disabled
[JENKINS] Archiving disabled
[JENKINS] Archiving disabled
[JENKINS] Archiving disabled
[JENKINS] Archiving disabled
[JENKINS] Archiving disabled
[JENKINS] Archiving disabled
[JENKINS] Archiving disabled
[JENKINS] Archiving disabled
[JENKINS] Archiving disabled
[JENKINS] Archiving disabled
[JENKINS] Archiving disabled
[JENKINS] Archiving disabled
[JENKINS] Archiving disabled
[JENKINS] Archiving disabled
[JENKINS] Archiving disabled
[JENKINS] Archiving disabled
[JENKINS] Archiving disabled
[JENKINS] Archiving disabled
[JENKINS] Archiving disabled
[JENKINS] Archiving disabled
[JENKINS] Archiving disabled
[JENKINS] Archiving disabled
[JENKINS] Archiving disabled
[JENKINS] Archiving disabled
[JENKINS] Archiving disabled
[JENKINS] Archiving disabled
[JENKINS] Archiving disabled
[JENKINS] Archiving disabled
[JENKINS] Archiving disabled
[JENKINS] Archiving disabled
[JENKINS] Archiving disabled
[JENKINS] Archiving disabled
[JENKINS] Archiving disabled
2017-03-23T22:22:55.740 [INFO] ------------------------------------------------------------------------
2017-03-23T22:22:55.740 [INFO] Reactor Summary:
2017-03-23T22:22:55.740 [INFO] 
2017-03-23T22:22:55.741 [INFO] Apache Beam :: Parent .............................. FAILURE
[01:19 min]
2017-03-23T22:22:55.741 [INFO] Apache Beam :: SDKs :: Java :: Build Tools ......... SUCCESS
[ 10.771 s]
2017-03-23T22:22:55.741 [INFO] Apache Beam :: SDKs ................................ SUCCESS
[ 10.554 s]
2017-03-23T22:22:55.741 [INFO] Apache Beam :: SDKs :: Common ...................... SUCCESS
[  3.754 s]
2017-03-23T22:22:55.741 [INFO] Apache Beam :: SDKs :: Common :: Fn API ............ SUCCESS
[ 22.064 s]
2017-03-23T22:22:55.741 [INFO] Apache Beam :: SDKs :: Common :: Runner API ........ SUCCESS
[ 16.197 s]
2017-03-23T22:22:55.741 [INFO] Apache Beam :: SDKs :: Java ........................ SUCCESS
[  5.994 s]
2017-03-23T22:22:55.741 [INFO] Apache Beam :: SDKs :: Java :: Core ................ SUCCESS
[05:41 min]
2017-03-23T22:22:55.741 [INFO] Apache Beam :: SDKs :: Java :: IO .................. SUCCESS
[  3.824 s]
2017-03-23T22:22:55.741 [INFO] Apache Beam :: SDKs :: Java :: IO :: Common ........ SUCCESS
[  9.485 s]
2017-03-23T22:22:55.741 [INFO] Apache Beam :: Runners ............................. SUCCESS
[  3.544 s]
2017-03-23T22:22:55.741 [INFO] Apache Beam :: Runners :: Core Java Construction ... SUCCESS
[ 29.990 s]
2017-03-23T22:22:55.741 [INFO] Apache Beam :: Runners :: Core Java ................ SUCCESS
[01:25 min]
2017-03-23T22:22:55.741 [INFO] Apache Beam :: Runners :: Direct Java .............. SUCCESS
[05:11 min]
2017-03-23T22:22:55.741 [INFO] Apache Beam :: SDKs :: Java :: IO :: Elasticsearch . SUCCESS
[ 42.526 s]
2017-03-23T22:22:55.741 [INFO] Apache Beam :: Runners :: Google Cloud Dataflow .... SUCCESS
[ 36.172 s]
2017-03-23T22:22:55.741 [INFO] Apache Beam :: SDKs :: Java :: IO :: Google Cloud Platform
SUCCESS [05:36 min]
2017-03-23T22:22:55.741 [INFO] Apache Beam :: SDKs :: Java :: IO :: Hadoop Common . SUCCESS
[ 26.690 s]
2017-03-23T22:22:55.741 [INFO] Apache Beam :: SDKs :: Java :: IO :: HBase ......... SUCCESS
[ 28.620 s]
2017-03-23T22:22:55.741 [INFO] Apache Beam :: SDKs :: Java :: IO :: HDFS .......... SUCCESS
[ 32.618 s]
2017-03-23T22:22:55.742 [INFO] Apache Beam :: SDKs :: Java :: IO :: JDBC .......... SUCCESS
[ 33.322 s]
2017-03-23T22:22:55.742 [INFO] Apache Beam :: SDKs :: Java :: IO :: JMS ........... SUCCESS
[ 20.538 s]
2017-03-23T22:22:55.742 [INFO] Apache Beam :: SDKs :: Java :: IO :: Kafka ......... SUCCESS
[ 22.344 s]
2017-03-23T22:22:55.742 [INFO] Apache Beam :: SDKs :: Java :: IO :: Kinesis ....... SUCCESS
[ 21.979 s]
2017-03-23T22:22:55.742 [INFO] Apache Beam :: SDKs :: Java :: IO :: MongoDB ....... SUCCESS
[ 34.201 s]
2017-03-23T22:22:55.742 [INFO] Apache Beam :: SDKs :: Java :: IO :: MQTT .......... SUCCESS
[02:23 min]
2017-03-23T22:22:55.742 [INFO] Apache Beam :: SDKs :: Java :: Maven Archetypes .... SUCCESS
[  1.581 s]
2017-03-23T22:22:55.742 [INFO] Apache Beam :: SDKs :: Java :: Maven Archetypes :: Starter
SUCCESS [ 16.013 s]
2017-03-23T22:22:55.742 [INFO] Apache Beam :: SDKs :: Java :: Maven Archetypes :: Examples
SUCCESS [ 23.174 s]
2017-03-23T22:22:55.742 [INFO] Apache Beam :: SDKs :: Java :: Maven Archetypes :: Examples
- Java 8 SUCCESS [ 31.476 s]
2017-03-23T22:22:55.742 [INFO] Apache Beam :: SDKs :: Java :: Extensions .......... SUCCESS
[  2.089 s]
2017-03-23T22:22:55.742 [INFO] Apache Beam :: SDKs :: Java :: Extensions :: Jackson SUCCESS
[ 13.392 s]
2017-03-23T22:22:55.742 [INFO] Apache Beam :: SDKs :: Java :: Extensions :: Join library SUCCESS
[ 15.854 s]
2017-03-23T22:22:55.742 [INFO] Apache Beam :: SDKs :: Java :: Extensions :: Sorter  SUCCESS
[ 34.630 s]
2017-03-23T22:22:55.742 [INFO] Apache Beam :: SDKs :: Java :: Harness ............. SUCCESS
[ 31.388 s]
2017-03-23T22:22:55.742 [INFO] Apache Beam :: SDKs :: Java :: Java 8 Tests ........ SUCCESS
[ 11.711 s]
2017-03-23T22:22:55.742 [INFO] Apache Beam :: SDKs :: Python ...................... SUCCESS
[07:54 min]
2017-03-23T22:22:55.742 [INFO] Apache Beam :: Runners :: Flink .................... SUCCESS
[  2.432 s]
2017-03-23T22:22:55.742 [INFO] Apache Beam :: Runners :: Flink :: Core ............ SUCCESS
[01:20 min]
2017-03-23T22:22:55.742 [INFO] Apache Beam :: Runners :: Flink :: Examples ........ SUCCESS
[ 25.774 s]
2017-03-23T22:22:55.742 [INFO] Apache Beam :: Runners :: Spark .................... SUCCESS
[02:54 min]
2017-03-23T22:22:55.742 [INFO] Apache Beam :: Runners :: Apex ..................... SUCCESS
[02:22 min]
2017-03-23T22:22:55.742 [INFO] Apache Beam :: Examples ............................ SUCCESS
[  1.827 s]
2017-03-23T22:22:55.742 [INFO] Apache Beam :: Examples :: Java .................... SUCCESS
[06:47 min]
2017-03-23T22:22:55.742 [INFO] Apache Beam :: Examples :: Java 8 .................. SUCCESS
[ 35.700 s]
2017-03-23T22:22:55.742 [INFO] Apache Beam :: SDKs :: Java :: Aggregated Javadoc .. SUCCESS
[ 33.600 s]
2017-03-23T22:22:55.742 [INFO] ------------------------------------------------------------------------
2017-03-23T22:22:55.742 [INFO] BUILD FAILURE
2017-03-23T22:22:55.742 [INFO] ------------------------------------------------------------------------
2017-03-23T22:22:55.743 [INFO] Total time: 56:48 min
2017-03-23T22:22:55.743 [INFO] Finished at: 2017-03-23T22:22:55+00:00
2017-03-23T22:22:56.523 [INFO] Final Memory: 278M/1513M
2017-03-23T22:22:56.523 [INFO] ------------------------------------------------------------------------
Waiting for Jenkins to finish collecting data
2017-03-23T22:23:27.684 [ERROR] Failed to execute goal org.eluder.coveralls:coveralls-maven-plugin:4.3.0:report
(default-cli) on project beam-parent: Execution default-cli of goal org.eluder.coveralls:coveralls-maven-plugin:4.3.0:report
failed: Plugin org.eluder.coveralls:coveralls-maven-plugin:4.3.0 or one of its dependencies
could not be resolved: Could not transfer artifact com.fasterxml.jackson.core:jackson-core:jar:2.8.3
from/to central (https://repo.maven.apache.org/maven2): GET request of: com/fasterxml/jackson/core/jackson-core/2.8.3/jackson-core-2.8.3.jar
from central failed: Connection reset -> [Help 1]
org.apache.maven.lifecycle.LifecycleExecutionException: Failed to execute goal org.eluder.coveralls:coveralls-maven-plugin:4.3.0:report
(default-cli) on project beam-parent: Execution default-cli of goal org.eluder.coveralls:coveralls-maven-plugin:4.3.0:report
failed: Plugin org.eluder.coveralls:coveralls-maven-plugin:4.3.0 or one of its dependencies
could not be resolved: Could not transfer artifact com.fasterxml.jackson.core:jackson-core:jar:2.8.3
from/to central (https://repo.maven.apache.org/maven2): GET request of: com/fasterxml/jackson/core/jackson-core/2.8.3/jackson-core-2.8.3.jar
from central failed
	at org.apache.maven.lifecycle.internal.MojoExecutor.execute(MojoExecutor.java:224)
	at org.apache.maven.lifecycle.internal.MojoExecutor.execute(MojoExecutor.java:153)
	at org.apache.maven.lifecycle.internal.MojoExecutor.execute(MojoExecutor.java:145)
	at org.apache.maven.lifecycle.internal.LifecycleModuleBuilder.buildProject(LifecycleModuleBuilder.java:116)
	at org.apache.maven.lifecycle.internal.LifecycleModuleBuilder.buildProject(LifecycleModuleBuilder.java:80)
	at org.apache.maven.lifecycle.internal.builder.singlethreaded.SingleThreadedBuilder.build(SingleThreadedBuilder.java:51)
	at org.apache.maven.lifecycle.internal.LifecycleStarter.execute(LifecycleStarter.java:128)
	at org.apache.maven.DefaultMaven.doExecute(DefaultMaven.java:307)
	at org.apache.maven.DefaultMaven.doExecute(DefaultMaven.java:193)
	at org.apache.maven.DefaultMaven.execute(DefaultMaven.java:106)
	at org.jvnet.hudson.maven3.launcher.Maven33Launcher.main(Maven33Launcher.java:129)
	at sun.reflect.NativeMethodAccessorImpl.invoke0(Native Method)
	at sun.reflect.NativeMethodAccessorImpl.invoke(NativeMethodAccessorImpl.java:62)
	at sun.reflect.DelegatingMethodAccessorImpl.invoke(DelegatingMethodAccessorImpl.java:43)
	at java.lang.reflect.Method.invoke(Method.java:498)
	at org.codehaus.plexus.classworlds.launcher.Launcher.launchStandard(Launcher.java:330)
	at org.codehaus.plexus.classworlds.launcher.Launcher.launch(Launcher.java:238)
	at jenkins.maven3.agent.Maven33Main.launch(Maven33Main.java:176)
	at sun.reflect.NativeMethodAccessorImpl.invoke0(Native Method)
	at sun.reflect.NativeMethodAccessorImpl.invoke(NativeMethodAccessorImpl.java:62)
	at sun.reflect.DelegatingMethodAccessorImpl.invoke(DelegatingMethodAccessorImpl.java:43)
	at java.lang.reflect.Method.invoke(Method.java:498)
	at hudson.maven.Maven3Builder.call(Maven3Builder.java:139)
	at hudson.maven.Maven3Builder.call(Maven3Builder.java:70)
	at hudson.remoting.UserRequest.perform(UserRequest.java:153)
	at hudson.remoting.UserRequest.perform(UserRequest.java:50)
	at hudson.remoting.Request$2.run(Request.java:336)
	at hudson.remoting.InterceptingExecutorService$1.call(InterceptingExecutorService.java:68)
	at java.util.concurrent.FutureTask.run(FutureTask.java:266)
	at java.util.concurrent.ThreadPoolExecutor.runWorker(ThreadPoolExecutor.java:1142)
	at java.util.concurrent.ThreadPoolExecutor$Worker.run(ThreadPoolExecutor.java:617)
	at java.lang.Thread.run(Thread.java:745)
Caused by: org.apache.maven.plugin.PluginExecutionException: Execution default-cli of goal
org.eluder.coveralls:coveralls-maven-plugin:4.3.0:report failed: Plugin org.eluder.coveralls:coveralls-maven-plugin:4.3.0
or one of its dependencies could not be resolved: Could not transfer artifact com.fasterxml.jackson.core:jackson-core:jar:2.8.3
from/to central (https://repo.maven.apache.org/maven2): GET request of: com/fasterxml/jackson/core/jackson-core/2.8.3/jackson-core-2.8.3.jar
from central failed
	at org.apache.maven.plugin.DefaultBuildPluginManager.executeMojo(DefaultBuildPluginManager.java:106)
	at org.apache.maven.lifecycle.internal.MojoExecutor.execute(MojoExecutor.java:208)
	... 31 more
Caused by: org.apache.maven.plugin.PluginResolutionException: Plugin org.eluder.coveralls:coveralls-maven-plugin:4.3.0
or one of its dependencies could not be resolved: Could not transfer artifact com.fasterxml.jackson.core:jackson-core:jar:2.8.3
from/to central (https://repo.maven.apache.org/maven2): GET request of: com/fasterxml/jackson/core/jackson-core/2.8.3/jackson-core-2.8.3.jar
from central failed
	at org.apache.maven.plugin.internal.DefaultPluginDependenciesResolver.resolveInternal(DefaultPluginDependenciesResolver.java:218)
	at org.apache.maven.plugin.internal.DefaultPluginDependenciesResolver.resolve(DefaultPluginDependenciesResolver.java:149)
	at org.apache.maven.plugin.internal.DefaultMavenPluginManager.createPluginRealm(DefaultMavenPluginManager.java:422)
	at org.apache.maven.plugin.internal.DefaultMavenPluginManager.setupPluginRealm(DefaultMavenPluginManager.java:385)
	at org.apache.maven.plugin.DefaultBuildPluginManager.getPluginRealm(DefaultBuildPluginManager.java:231)
	at org.apache.maven.plugin.DefaultBuildPluginManager.executeMojo(DefaultBuildPluginManager.java:102)
	... 32 more
Caused by: org.eclipse.aether.resolution.ArtifactResolutionException: Could not transfer artifact
com.fasterxml.jackson.core:jackson-core:jar:2.8.3 from/to central (https://repo.maven.apache.org/maven2):
GET request of: com/fasterxml/jackson/core/jackson-core/2.8.3/jackson-core-2.8.3.jar from
central failed
	at org.eclipse.aether.internal.impl.DefaultArtifactResolver.resolve(DefaultArtifactResolver.java:444)
	at org.eclipse.aether.internal.impl.DefaultArtifactResolver.resolveArtifacts(DefaultArtifactResolver.java:246)
	at org.eclipse.aether.internal.impl.DefaultRepositorySystem.resolveDependencies(DefaultRepositorySystem.java:367)
	at org.apache.maven.plugin.internal.DefaultPluginDependenciesResolver.resolveInternal(DefaultPluginDependenciesResolver.java:210)
	... 37 more
Caused by: org.eclipse.aether.transfer.ArtifactTransferException: Could not transfer artifact
com.fasterxml.jackson.core:jackson-core:jar:2.8.3 from/to central (https://repo.maven.apache.org/maven2):
GET request of: com/fasterxml/jackson/core/jackson-core/2.8.3/jackson-core-2.8.3.jar from
central failed
	at org.eclipse.aether.connector.basic.ArtifactTransportListener.transferFailed(ArtifactTransportListener.java:43)
	at org.eclipse.aether.connector.basic.BasicRepositoryConnector$TaskRunner.run(BasicRepositoryConnector.java:355)
	at org.eclipse.aether.util.concurrency.RunnableErrorForwarder$1.run(RunnableErrorForwarder.java:67)
	... 3 more
Caused by: org.apache.maven.wagon.TransferFailedException: GET request of: com/fasterxml/jackson/core/jackson-core/2.8.3/jackson-core-2.8.3.jar
from central failed
	at org.apache.maven.wagon.AbstractWagon.getTransfer(AbstractWagon.java:363)
	at org.apache.maven.wagon.AbstractWagon.getTransfer(AbstractWagon.java:316)
	at org.apache.maven.wagon.AbstractWagon.getTransfer(AbstractWagon.java:285)
	at org.apache.maven.wagon.StreamWagon.getIfNewer(StreamWagon.java:97)
	at org.apache.maven.wagon.StreamWagon.get(StreamWagon.java:61)
	at org.eclipse.aether.transport.wagon.WagonTransporter$GetTaskRunner.run(WagonTransporter.java:560)
	at org.eclipse.aether.transport.wagon.WagonTransporter.execute(WagonTransporter.java:427)
	at org.eclipse.aether.transport.wagon.WagonTransporter.get(WagonTransporter.java:404)
	at org.eclipse.aether.connector.basic.BasicRepositoryConnector$GetTaskRunner.runTask(BasicRepositoryConnector.java:447)
	at org.eclipse.aether.connector.basic.BasicRepositoryConnector$TaskRunner.run(BasicRepositoryConnector.java:350)
	... 4 more
Caused by: java.net.SocketException: Connection reset
	at java.net.SocketInputStream.read(SocketInputStream.java:210)
	at java.net.SocketInputStream.read(SocketInputStream.java:141)
	at sun.security.ssl.InputRecord.readFully(InputRecord.java:465)
	at sun.security.ssl.InputRecord.readV3Record(InputRecord.java:593)
	at sun.security.ssl.InputRecord.read(InputRecord.java:532)
	at sun.security.ssl.SSLSocketImpl.readRecord(SSLSocketImpl.java:973)
	at sun.security.ssl.SSLSocketImpl.readDataRecord(SSLSocketImpl.java:930)
	at sun.security.ssl.AppInputStream.read(AppInputStream.java:105)
	at org.apache.maven.wagon.providers.http.httpclient.impl.io.SessionInputBufferImpl.streamRead(SessionInputBufferImpl.java:136)
	at org.apache.maven.wagon.providers.http.httpclient.impl.io.SessionInputBufferImpl.read(SessionInputBufferImpl.java:195)
	at org.apache.maven.wagon.providers.http.httpclient.impl.io.ContentLengthInputStream.read(ContentLengthInputStream.java:178)
	at org.apache.maven.wagon.providers.http.httpclient.conn.EofSensorInputStream.read(EofSensorInputStream.java:137)
	at org.apache.maven.wagon.AbstractWagon.transfer(AbstractWagon.java:531)
	at org.apache.maven.wagon.AbstractWagon.getTransfer(AbstractWagon.java:353)
	... 13 more
2017-03-23T22:23:27.686 [ERROR] 
2017-03-23T22:23:27.686 [ERROR] Re-run Maven using the -X switch to enable full debug logging.
2017-03-23T22:23:27.686 [ERROR] 
2017-03-23T22:23:27.686 [ERROR] For more information about the errors and possible solutions,
please read the following articles:
2017-03-23T22:23:27.686 [ERROR] [Help 1] http://cwiki.apache.org/confluence/display/MAVEN/PluginResolutionException
channel stopped

Mime
View raw message