beam-commits mailing list archives

Site index · List index
Message view « Date » · « Thread »
Top « Date » · « Thread »
From Apache Jenkins Server <jenk...@builds.apache.org>
Subject Build failed in Jenkins: beam_PostCommit_Java_Version_Test_MavenInstall #3
Date Tue, 14 Mar 2017 00:24:35 GMT
See <https://builds.apache.org/job/beam_PostCommit_Java_Version_Test_MavenInstall/3/display/redirect>

------------------------------------------
[...truncated 1.38 MB...]
test_pipeline_state_matcher_given_state (apache_beam.tests.pipeline_verifiers_test.PipelineVerifiersTest)
Test PipelineStateMatcher successes when matches given state ... ok
test_pipeline_state_matcher_success (apache_beam.tests.pipeline_verifiers_test.PipelineVerifiersTest)
Test PipelineStateMatcher successes when using default expected state ... ok

----------------------------------------------------------------------
Ran 1014 tests in 36.515s

OK (skipped=170)
py27cython create: <https://builds.apache.org/job/beam_PostCommit_Java_Version_Test_MavenInstall/ws/sdks/python/target/.tox/py27cython>
py27cython installdeps: nose, cython
ERROR: invocation failed (errno 2), args: ['<https://builds.apache.org/job/beam_PostCommit_Java_Version_Test_MavenInstall/ws/sdks/python/target/.tox/py27cython/bin/pip',>
'install', 'nose', 'cython'], cwd: <https://builds.apache.org/job/beam_PostCommit_Java_Version_Test_MavenInstall/ws/sdks/python>
Traceback (most recent call last):
  File "<https://builds.apache.org/job/beam_PostCommit_Java_Version_Test_MavenInstall/ws/sdks/python/target/python/bin/tox",>
line 11, in <module>
    sys.exit(cmdline())
  File "<https://builds.apache.org/job/beam_PostCommit_Java_Version_Test_MavenInstall/ws/sdks/python/target/python/lib/python2.7/site-packages/tox/session.py",>
line 39, in main
    retcode = Session(config).runcommand()
  File "<https://builds.apache.org/job/beam_PostCommit_Java_Version_Test_MavenInstall/ws/sdks/python/target/python/lib/python2.7/site-packages/tox/session.py",>
line 390, in runcommand
    return self.subcommand_test()
  File "<https://builds.apache.org/job/beam_PostCommit_Java_Version_Test_MavenInstall/ws/sdks/python/target/python/lib/python2.7/site-packages/tox/session.py",>
line 541, in subcommand_test
    if self.setupenv(venv):
  File "<https://builds.apache.org/job/beam_PostCommit_Java_Version_Test_MavenInstall/ws/sdks/python/target/python/lib/python2.7/site-packages/tox/session.py",>
line 449, in setupenv
    status = venv.update(action=action)
  File "<https://builds.apache.org/job/beam_PostCommit_Java_Version_Test_MavenInstall/ws/sdks/python/target/python/lib/python2.7/site-packages/tox/venv.py",>
line 172, in update
    self.hook.tox_testenv_install_deps(action=action, venv=self)
  File "<https://builds.apache.org/job/beam_PostCommit_Java_Version_Test_MavenInstall/ws/sdks/python/target/python/lib/python2.7/site-packages/pluggy.py",>
line 745, in __call__
    return self._hookexec(self, self._nonwrappers + self._wrappers, kwargs)
  File "<https://builds.apache.org/job/beam_PostCommit_Java_Version_Test_MavenInstall/ws/sdks/python/target/python/lib/python2.7/site-packages/pluggy.py",>
line 339, in _hookexec
    return self._inner_hookexec(hook, methods, kwargs)
  File "<https://builds.apache.org/job/beam_PostCommit_Java_Version_Test_MavenInstall/ws/sdks/python/target/python/lib/python2.7/site-packages/pluggy.py",>
line 334, in <lambda>
    _MultiCall(methods, kwargs, hook.spec_opts).execute()
  File "<https://builds.apache.org/job/beam_PostCommit_Java_Version_Test_MavenInstall/ws/sdks/python/target/python/lib/python2.7/site-packages/pluggy.py",>
line 614, in execute
    res = hook_impl.function(*args)
  File "<https://builds.apache.org/job/beam_PostCommit_Java_Version_Test_MavenInstall/ws/sdks/python/target/python/lib/python2.7/site-packages/tox/venv.py",>
line 431, in tox_testenv_install_deps
    venv._install(deps, action=action)
  File "<https://builds.apache.org/job/beam_PostCommit_Java_Version_Test_MavenInstall/ws/sdks/python/target/python/lib/python2.7/site-packages/tox/venv.py",>
line 311, in _install
    action=action)
  File "<https://builds.apache.org/job/beam_PostCommit_Java_Version_Test_MavenInstall/ws/sdks/python/target/python/lib/python2.7/site-packages/tox/venv.py",>
line 284, in run_install_command
    redirect=self.session.report.verbosity < 2)
  File "<https://builds.apache.org/job/beam_PostCommit_Java_Version_Test_MavenInstall/ws/sdks/python/target/python/lib/python2.7/site-packages/tox/venv.py",>
line 390, in _pcall
    redirect=redirect, ignore_ret=ignore_ret)
  File "<https://builds.apache.org/job/beam_PostCommit_Java_Version_Test_MavenInstall/ws/sdks/python/target/python/lib/python2.7/site-packages/tox/session.py",>
line 140, in popen
    stdout=stdout, stderr=STDOUT)
  File "<https://builds.apache.org/job/beam_PostCommit_Java_Version_Test_MavenInstall/ws/sdks/python/target/python/lib/python2.7/site-packages/tox/session.py",>
line 228, in _popen
    stdout=stdout, stderr=stderr, env=env)
  File "/usr/lib/python2.7/subprocess.py", line 710, in __init__
    errread, errwrite)
  File "/usr/lib/python2.7/subprocess.py", line 1327, in _execute_child
    raise child_exception
OSError: [Errno 2] No such file or directory
2017-03-14T00:23:34.531 [ERROR] Command execution failed.
org.apache.commons.exec.ExecuteException: Process exited with an error: 1 (Exit value: 1)
	at org.apache.commons.exec.DefaultExecutor.executeInternal(DefaultExecutor.java:404)
	at org.apache.commons.exec.DefaultExecutor.execute(DefaultExecutor.java:166)
	at org.codehaus.mojo.exec.ExecMojo.executeCommandLine(ExecMojo.java:764)
	at org.codehaus.mojo.exec.ExecMojo.executeCommandLine(ExecMojo.java:711)
	at org.codehaus.mojo.exec.ExecMojo.execute(ExecMojo.java:289)
	at org.apache.maven.plugin.DefaultBuildPluginManager.executeMojo(DefaultBuildPluginManager.java:134)
	at org.apache.maven.lifecycle.internal.MojoExecutor.execute(MojoExecutor.java:208)
	at org.apache.maven.lifecycle.internal.MojoExecutor.execute(MojoExecutor.java:153)
	at org.apache.maven.lifecycle.internal.MojoExecutor.execute(MojoExecutor.java:145)
	at org.apache.maven.lifecycle.internal.LifecycleModuleBuilder.buildProject(LifecycleModuleBuilder.java:116)
	at org.apache.maven.lifecycle.internal.LifecycleModuleBuilder.buildProject(LifecycleModuleBuilder.java:80)
	at org.apache.maven.lifecycle.internal.builder.singlethreaded.SingleThreadedBuilder.build(SingleThreadedBuilder.java:51)
	at org.apache.maven.lifecycle.internal.LifecycleStarter.execute(LifecycleStarter.java:128)
	at org.apache.maven.DefaultMaven.doExecute(DefaultMaven.java:307)
	at org.apache.maven.DefaultMaven.doExecute(DefaultMaven.java:193)
	at org.apache.maven.DefaultMaven.execute(DefaultMaven.java:106)
	at org.jvnet.hudson.maven3.launcher.Maven33Launcher.main(Maven33Launcher.java:129)
	at sun.reflect.NativeMethodAccessorImpl.invoke0(Native Method)
	at sun.reflect.NativeMethodAccessorImpl.invoke(NativeMethodAccessorImpl.java:62)
	at sun.reflect.DelegatingMethodAccessorImpl.invoke(DelegatingMethodAccessorImpl.java:43)
	at java.lang.reflect.Method.invoke(Method.java:498)
	at org.codehaus.plexus.classworlds.launcher.Launcher.launchStandard(Launcher.java:330)
	at org.codehaus.plexus.classworlds.launcher.Launcher.launch(Launcher.java:238)
	at jenkins.maven3.agent.Maven33Main.launch(Maven33Main.java:176)
	at sun.reflect.NativeMethodAccessorImpl.invoke0(Native Method)
	at sun.reflect.NativeMethodAccessorImpl.invoke(NativeMethodAccessorImpl.java:62)
	at sun.reflect.DelegatingMethodAccessorImpl.invoke(DelegatingMethodAccessorImpl.java:43)
	at java.lang.reflect.Method.invoke(Method.java:498)
	at hudson.maven.Maven3Builder.call(Maven3Builder.java:139)
	at hudson.maven.Maven3Builder.call(Maven3Builder.java:70)
	at hudson.remoting.UserRequest.perform(UserRequest.java:153)
	at hudson.remoting.UserRequest.perform(UserRequest.java:50)
	at hudson.remoting.Request$2.run(Request.java:336)
	at hudson.remoting.InterceptingExecutorService$1.call(InterceptingExecutorService.java:68)
	at java.util.concurrent.FutureTask.run(FutureTask.java:266)
	at java.util.concurrent.ThreadPoolExecutor.runWorker(ThreadPoolExecutor.java:1142)
	at java.util.concurrent.ThreadPoolExecutor$Worker.run(ThreadPoolExecutor.java:617)
	at java.lang.Thread.run(Thread.java:745)
[JENKINS] Archiving disabled
2017-03-14T00:23:35.032 [INFO]                                                           
             
2017-03-14T00:23:35.032 [INFO] ------------------------------------------------------------------------
2017-03-14T00:23:35.032 [INFO] Skipping Apache Beam :: Parent
2017-03-14T00:23:35.032 [INFO] This project has been banned from the build due to previous
failures.
2017-03-14T00:23:35.032 [INFO] ------------------------------------------------------------------------
[JENKINS] Archiving disabled
[JENKINS] Archiving disabled
[JENKINS] Archiving disabled
[JENKINS] Archiving disabled
[JENKINS] Archiving disabled
[JENKINS] Archiving disabled
[JENKINS] Archiving disabled
[JENKINS] Archiving disabled
[JENKINS] Archiving disabled
[JENKINS] Archiving disabled
[JENKINS] Archiving disabled
[JENKINS] Archiving disabled
[JENKINS] Archiving disabled
[JENKINS] Archiving disabled
[JENKINS] Archiving disabled
[JENKINS] Archiving disabled
[JENKINS] Archiving disabled
[JENKINS] Archiving disabled
[JENKINS] Archiving disabled
[JENKINS] Archiving disabled
[JENKINS] Archiving disabled
[JENKINS] Archiving disabled
[JENKINS] Archiving disabled
[JENKINS] Archiving disabled
[JENKINS] Archiving disabled
[JENKINS] Archiving disabled
[JENKINS] Archiving disabled
[JENKINS] Archiving disabled
[JENKINS] Archiving disabled
[JENKINS] Archiving disabled
[JENKINS] Archiving disabled
[JENKINS] Archiving disabled
[JENKINS] Archiving disabled
[JENKINS] Archiving disabled
[JENKINS] Archiving disabled
[JENKINS] Archiving disabled
[JENKINS] Archiving disabled
[JENKINS] Archiving disabled
[JENKINS] Archiving disabled
[JENKINS] Archiving disabled
[JENKINS] Archiving disabled
[JENKINS] Archiving disabled
2017-03-14T00:23:51.706 [INFO] ------------------------------------------------------------------------
2017-03-14T00:23:51.706 [INFO] Reactor Summary:
2017-03-14T00:23:51.706 [INFO] 
2017-03-14T00:23:51.706 [INFO] Apache Beam :: Parent .............................. SUCCESS
[ 23.878 s]
2017-03-14T00:23:51.706 [INFO] Apache Beam :: SDKs :: Java :: Build Tools ......... SUCCESS
[ 10.660 s]
2017-03-14T00:23:51.706 [INFO] Apache Beam :: SDKs ................................ SUCCESS
[  4.929 s]
2017-03-14T00:23:51.706 [INFO] Apache Beam :: SDKs :: Common ...................... SUCCESS
[  1.306 s]
2017-03-14T00:23:51.706 [INFO] Apache Beam :: SDKs :: Common :: Fn API ............ SUCCESS
[ 15.097 s]
2017-03-14T00:23:51.706 [INFO] Apache Beam :: SDKs :: Common :: Runner API ........ SUCCESS
[ 10.418 s]
2017-03-14T00:23:51.706 [INFO] Apache Beam :: SDKs :: Java ........................ SUCCESS
[  3.444 s]
2017-03-14T00:23:51.706 [INFO] Apache Beam :: SDKs :: Java :: Core ................ SUCCESS
[02:41 min]
2017-03-14T00:23:51.706 [INFO] Apache Beam :: Runners ............................. SUCCESS
[  1.768 s]
2017-03-14T00:23:51.706 [INFO] Apache Beam :: Runners :: Core Java Construction ... SUCCESS
[ 13.971 s]
2017-03-14T00:23:51.706 [INFO] Apache Beam :: Runners :: Core Java ................ SUCCESS
[ 51.265 s]
2017-03-14T00:23:51.706 [INFO] Apache Beam :: Runners :: Direct Java .............. SUCCESS
[02:54 min]
2017-03-14T00:23:51.706 [INFO] Apache Beam :: SDKs :: Java :: IO .................. SUCCESS
[  1.777 s]
2017-03-14T00:23:51.706 [INFO] Apache Beam :: SDKs :: Java :: IO :: Elasticsearch . SUCCESS
[ 35.735 s]
2017-03-14T00:23:51.706 [INFO] Apache Beam :: Runners :: Google Cloud Dataflow .... SUCCESS
[ 39.757 s]
2017-03-14T00:23:51.706 [INFO] Apache Beam :: SDKs :: Java :: IO :: Google Cloud Platform
SUCCESS [04:31 min]
2017-03-14T00:23:51.707 [INFO] Apache Beam :: SDKs :: Java :: IO :: Hadoop Common . SUCCESS
[ 18.717 s]
2017-03-14T00:23:51.707 [INFO] Apache Beam :: SDKs :: Java :: IO :: HBase ......... SUCCESS
[ 22.419 s]
2017-03-14T00:23:51.707 [INFO] Apache Beam :: SDKs :: Java :: IO :: HDFS .......... SUCCESS
[ 22.031 s]
2017-03-14T00:23:51.707 [INFO] Apache Beam :: SDKs :: Java :: IO :: JDBC .......... SUCCESS
[ 19.993 s]
2017-03-14T00:23:51.707 [INFO] Apache Beam :: SDKs :: Java :: IO :: JMS ........... SUCCESS
[ 17.883 s]
2017-03-14T00:23:51.707 [INFO] Apache Beam :: SDKs :: Java :: IO :: Kafka ......... SUCCESS
[ 22.243 s]
2017-03-14T00:23:51.707 [INFO] Apache Beam :: SDKs :: Java :: IO :: Kinesis ....... SUCCESS
[ 17.759 s]
2017-03-14T00:23:51.707 [INFO] Apache Beam :: SDKs :: Java :: IO :: MongoDB ....... SUCCESS
[ 26.512 s]
2017-03-14T00:23:51.707 [INFO] Apache Beam :: SDKs :: Java :: IO :: MQTT .......... SUCCESS
[ 15.792 s]
2017-03-14T00:23:51.707 [INFO] Apache Beam :: SDKs :: Java :: Maven Archetypes .... SUCCESS
[  1.554 s]
2017-03-14T00:23:51.707 [INFO] Apache Beam :: SDKs :: Java :: Maven Archetypes :: Starter
SUCCESS [ 14.008 s]
2017-03-14T00:23:51.707 [INFO] Apache Beam :: SDKs :: Java :: Maven Archetypes :: Examples
SUCCESS [ 20.274 s]
2017-03-14T00:23:51.707 [INFO] Apache Beam :: SDKs :: Java :: Maven Archetypes :: Examples
- Java 8 SUCCESS [ 20.596 s]
2017-03-14T00:23:51.707 [INFO] Apache Beam :: SDKs :: Java :: Extensions .......... SUCCESS
[  1.749 s]
2017-03-14T00:23:51.707 [INFO] Apache Beam :: SDKs :: Java :: Extensions :: Jackson SUCCESS
[ 17.443 s]
2017-03-14T00:23:51.707 [INFO] Apache Beam :: SDKs :: Java :: Extensions :: Join library SUCCESS
[ 13.195 s]
2017-03-14T00:23:51.707 [INFO] Apache Beam :: SDKs :: Java :: Extensions :: Sorter  SUCCESS
[ 28.191 s]
2017-03-14T00:23:51.707 [INFO] Apache Beam :: SDKs :: Java :: Harness ............. SUCCESS
[ 28.691 s]
2017-03-14T00:23:51.707 [INFO] Apache Beam :: SDKs :: Java :: Java 8 Tests ........ SUCCESS
[  9.070 s]
2017-03-14T00:23:51.707 [INFO] Apache Beam :: SDKs :: Python ...................... FAILURE
[03:03 min]
2017-03-14T00:23:51.707 [INFO] Apache Beam :: Runners :: Flink .................... SKIPPED
2017-03-14T00:23:51.707 [INFO] Apache Beam :: Runners :: Flink :: Core ............ SKIPPED
2017-03-14T00:23:51.707 [INFO] Apache Beam :: Runners :: Flink :: Examples ........ SKIPPED
2017-03-14T00:23:51.707 [INFO] Apache Beam :: Runners :: Spark .................... SKIPPED
2017-03-14T00:23:51.707 [INFO] Apache Beam :: Runners :: Apex ..................... SKIPPED
2017-03-14T00:23:51.707 [INFO] Apache Beam :: Examples ............................ SKIPPED
2017-03-14T00:23:51.707 [INFO] Apache Beam :: Examples :: Java .................... SKIPPED
2017-03-14T00:23:51.707 [INFO] Apache Beam :: Examples :: Java 8 .................. SKIPPED
2017-03-14T00:23:51.707 [INFO] Apache Beam :: SDKs :: Java :: Aggregated Javadoc .. SKIPPED
2017-03-14T00:23:51.707 [INFO] ------------------------------------------------------------------------
2017-03-14T00:23:51.707 [INFO] BUILD FAILURE
2017-03-14T00:23:51.707 [INFO] ------------------------------------------------------------------------
2017-03-14T00:23:51.707 [INFO] Total time: 23:20 min
2017-03-14T00:23:51.708 [INFO] Finished at: 2017-03-14T00:23:51+00:00
2017-03-14T00:23:52.771 [INFO] Final Memory: 208M/1514M
2017-03-14T00:23:52.771 [INFO] ------------------------------------------------------------------------
Waiting for Jenkins to finish collecting data
2017-03-14T00:24:28.603 [ERROR] Failed to execute goal org.codehaus.mojo:exec-maven-plugin:1.5.0:exec
(setuptools-test) on project beam-sdks-python: Command execution failed. Process exited with
an error: 1 (Exit value: 1) -> [Help 1]
org.apache.maven.lifecycle.LifecycleExecutionException: Failed to execute goal org.codehaus.mojo:exec-maven-plugin:1.5.0:exec
(setuptools-test) on project beam-sdks-python: Command execution failed.
	at org.apache.maven.lifecycle.internal.MojoExecutor.execute(MojoExecutor.java:216)
	at org.apache.maven.lifecycle.internal.MojoExecutor.execute(MojoExecutor.java:153)
	at org.apache.maven.lifecycle.internal.MojoExecutor.execute(MojoExecutor.java:145)
	at org.apache.maven.lifecycle.internal.LifecycleModuleBuilder.buildProject(LifecycleModuleBuilder.java:116)
	at org.apache.maven.lifecycle.internal.LifecycleModuleBuilder.buildProject(LifecycleModuleBuilder.java:80)
	at org.apache.maven.lifecycle.internal.builder.singlethreaded.SingleThreadedBuilder.build(SingleThreadedBuilder.java:51)
	at org.apache.maven.lifecycle.internal.LifecycleStarter.execute(LifecycleStarter.java:128)
	at org.apache.maven.DefaultMaven.doExecute(DefaultMaven.java:307)
	at org.apache.maven.DefaultMaven.doExecute(DefaultMaven.java:193)
	at org.apache.maven.DefaultMaven.execute(DefaultMaven.java:106)
	at org.jvnet.hudson.maven3.launcher.Maven33Launcher.main(Maven33Launcher.java:129)
	at sun.reflect.NativeMethodAccessorImpl.invoke0(Native Method)
	at sun.reflect.NativeMethodAccessorImpl.invoke(NativeMethodAccessorImpl.java:62)
	at sun.reflect.DelegatingMethodAccessorImpl.invoke(DelegatingMethodAccessorImpl.java:43)
	at java.lang.reflect.Method.invoke(Method.java:498)
	at org.codehaus.plexus.classworlds.launcher.Launcher.launchStandard(Launcher.java:330)
	at org.codehaus.plexus.classworlds.launcher.Launcher.launch(Launcher.java:238)
	at jenkins.maven3.agent.Maven33Main.launch(Maven33Main.java:176)
	at sun.reflect.NativeMethodAccessorImpl.invoke0(Native Method)
	at sun.reflect.NativeMethodAccessorImpl.invoke(NativeMethodAccessorImpl.java:62)
	at sun.reflect.DelegatingMethodAccessorImpl.invoke(DelegatingMethodAccessorImpl.java:43)
	at java.lang.reflect.Method.invoke(Method.java:498)
	at hudson.maven.Maven3Builder.call(Maven3Builder.java:139)
	at hudson.maven.Maven3Builder.call(Maven3Builder.java:70)
	at hudson.remoting.UserRequest.perform(UserRequest.java:153)
	at hudson.remoting.UserRequest.perform(UserRequest.java:50)
	at hudson.remoting.Request$2.run(Request.java:336)
	at hudson.remoting.InterceptingExecutorService$1.call(InterceptingExecutorService.java:68)
	at java.util.concurrent.FutureTask.run(FutureTask.java:266)
	at java.util.concurrent.ThreadPoolExecutor.runWorker(ThreadPoolExecutor.java:1142)
	at java.util.concurrent.ThreadPoolExecutor$Worker.run(ThreadPoolExecutor.java:617)
	at java.lang.Thread.run(Thread.java:745)
Caused by: org.apache.maven.plugin.MojoExecutionException: Command execution failed.
	at org.codehaus.mojo.exec.ExecMojo.execute(ExecMojo.java:302)
	at org.apache.maven.plugin.DefaultBuildPluginManager.executeMojo(DefaultBuildPluginManager.java:134)
	at org.apache.maven.lifecycle.internal.MojoExecutor.execute(MojoExecutor.java:208)
	... 31 more
Caused by: org.apache.commons.exec.ExecuteException: Process exited with an error: 1 (Exit
value: 1)
	at org.apache.commons.exec.DefaultExecutor.executeInternal(DefaultExecutor.java:404)
	at org.apache.commons.exec.DefaultExecutor.execute(DefaultExecutor.java:166)
	at org.codehaus.mojo.exec.ExecMojo.executeCommandLine(ExecMojo.java:764)
	at org.codehaus.mojo.exec.ExecMojo.executeCommandLine(ExecMojo.java:711)
	at org.codehaus.mojo.exec.ExecMojo.execute(ExecMojo.java:289)
	... 33 more
2017-03-14T00:24:28.604 [ERROR] 
2017-03-14T00:24:28.604 [ERROR] Re-run Maven using the -X switch to enable full debug logging.
2017-03-14T00:24:28.604 [ERROR] 
2017-03-14T00:24:28.604 [ERROR] For more information about the errors and possible solutions,
please read the following articles:
2017-03-14T00:24:28.604 [ERROR] [Help 1] http://cwiki.apache.org/confluence/display/MAVEN/MojoExecutionException
2017-03-14T00:24:28.604 [ERROR] 
2017-03-14T00:24:28.604 [ERROR] After correcting the problems, you can resume the build with
the command
2017-03-14T00:24:28.604 [ERROR]   mvn <goals> -rf :beam-sdks-python
channel stopped

Mime
View raw message