beam-commits mailing list archives

Site index · List index
Message view « Date » · « Thread »
Top « Date » · « Thread »
From Apache Jenkins Server <jenk...@builds.apache.org>
Subject Build failed in Jenkins: beam_PostCommit_Java_MavenInstall #3097
Date Thu, 30 Mar 2017 22:59:01 GMT
See <https://builds.apache.org/job/beam_PostCommit_Java_MavenInstall/3097/display/redirect>

------------------------------------------
[...truncated 2.02 MB...]
test_transform_no_super_init (apache_beam.pipeline_test.PipelineTest) ... ok
test_visit_entire_graph (apache_beam.pipeline_test.PipelineTest) ... ok
test_simple (apache_beam.pipeline_test.RunnerApiTest)
Tests serializing, deserializing, and running a simple pipeline. ... ok
test_pcollectionview_not_recreated (apache_beam.pvalue_test.PValueTest) ... ok
test_pvalue_expected_arguments (apache_beam.pvalue_test.PValueTest) ... ok
test_append_extra_options (apache_beam.test_pipeline_test.TestPipelineTest) ... ok
test_append_verifier_in_extra_opt (apache_beam.test_pipeline_test.TestPipelineTest) ... ok
test_create_test_pipeline_options (apache_beam.test_pipeline_test.TestPipelineTest) ... ok
test_empty_option_args_parsing (apache_beam.test_pipeline_test.TestPipelineTest) ... ok
test_get_option (apache_beam.test_pipeline_test.TestPipelineTest) ... ok
test_option_args_parsing (apache_beam.test_pipeline_test.TestPipelineTest) ... ok
test_skip_IT (apache_beam.test_pipeline_test.TestPipelineTest) ... SKIP: IT is skipped because
--test-pipeline-options is not specified
test_file_checksum_matchcer_invalid_sleep_time (apache_beam.tests.pipeline_verifiers_test.PipelineVerifiersTest)
... <https://builds.apache.org/job/beam_PostCommit_Java_MavenInstall/ws/sdks/python/apache_beam/tests/pipeline_verifiers_test.py>:129:
DeprecationWarning: BaseException.message has been deprecated as of Python 2.6
  self.assertEqual(cm.exception.message,
ok
test_file_checksum_matcher_read_failed (apache_beam.tests.pipeline_verifiers_test.PipelineVerifiersTest)
... ok
test_file_checksum_matcher_service_error (apache_beam.tests.pipeline_verifiers_test.PipelineVerifiersTest)
... ok
test_file_checksum_matcher_sleep_before_verify (apache_beam.tests.pipeline_verifiers_test.PipelineVerifiersTest)
... ok
test_file_checksum_matcher_success (apache_beam.tests.pipeline_verifiers_test.PipelineVerifiersTest)
... ok
test_pipeline_state_matcher_fails (apache_beam.tests.pipeline_verifiers_test.PipelineVerifiersTest)
Test PipelineStateMatcher fails when using default expected state ... ok
test_pipeline_state_matcher_given_state (apache_beam.tests.pipeline_verifiers_test.PipelineVerifiersTest)
Test PipelineStateMatcher successes when matches given state ... ok
test_pipeline_state_matcher_success (apache_beam.tests.pipeline_verifiers_test.PipelineVerifiersTest)
Test PipelineStateMatcher successes when using default expected state ... ok

======================================================================
FAIL: test_using_slow_impl (apache_beam.coders.slow_coders_test.SlowCoders)
----------------------------------------------------------------------
Traceback (most recent call last):
  File "<https://builds.apache.org/job/beam_PostCommit_Java_MavenInstall/ws/sdks/python/apache_beam/coders/slow_coders_test.py",>
line 41, in test_using_slow_impl
    import apache_beam.coders.stream
AssertionError: ImportError not raised

----------------------------------------------------------------------
Ran 1085 tests in 58.343s

FAILED (failures=1, skipped=13)
Test failed: <unittest.runner.TextTestResult run=1085 errors=0 failures=1>
error: Test failed: <unittest.runner.TextTestResult run=1085 errors=0 failures=1>
ERROR: InvocationError: '<https://builds.apache.org/job/beam_PostCommit_Java_MavenInstall/ws/sdks/python/target/.tox/py27gcp/bin/python>
setup.py test'
___________________________________ summary ____________________________________
  docs: commands succeeded
  lint: commands succeeded
  py27: commands succeeded
ERROR:   py27cython: commands failed
ERROR:   py27gcp: commands failed
2017-03-30T22:50:01.811 [ERROR] Command execution failed.
org.apache.commons.exec.ExecuteException: Process exited with an error: 1 (Exit value: 1)
	at org.apache.commons.exec.DefaultExecutor.executeInternal(DefaultExecutor.java:404)
	at org.apache.commons.exec.DefaultExecutor.execute(DefaultExecutor.java:166)
	at org.codehaus.mojo.exec.ExecMojo.executeCommandLine(ExecMojo.java:764)
	at org.codehaus.mojo.exec.ExecMojo.executeCommandLine(ExecMojo.java:711)
	at org.codehaus.mojo.exec.ExecMojo.execute(ExecMojo.java:289)
	at org.apache.maven.plugin.DefaultBuildPluginManager.executeMojo(DefaultBuildPluginManager.java:134)
	at org.apache.maven.lifecycle.internal.MojoExecutor.execute(MojoExecutor.java:208)
	at org.apache.maven.lifecycle.internal.MojoExecutor.execute(MojoExecutor.java:153)
	at org.apache.maven.lifecycle.internal.MojoExecutor.execute(MojoExecutor.java:145)
	at org.apache.maven.lifecycle.internal.LifecycleModuleBuilder.buildProject(LifecycleModuleBuilder.java:116)
	at org.apache.maven.lifecycle.internal.LifecycleModuleBuilder.buildProject(LifecycleModuleBuilder.java:80)
	at org.apache.maven.lifecycle.internal.builder.singlethreaded.SingleThreadedBuilder.build(SingleThreadedBuilder.java:51)
	at org.apache.maven.lifecycle.internal.LifecycleStarter.execute(LifecycleStarter.java:128)
	at org.apache.maven.DefaultMaven.doExecute(DefaultMaven.java:307)
	at org.apache.maven.DefaultMaven.doExecute(DefaultMaven.java:193)
	at org.apache.maven.DefaultMaven.execute(DefaultMaven.java:106)
	at org.jvnet.hudson.maven3.launcher.Maven33Launcher.main(Maven33Launcher.java:129)
	at sun.reflect.NativeMethodAccessorImpl.invoke0(Native Method)
	at sun.reflect.NativeMethodAccessorImpl.invoke(NativeMethodAccessorImpl.java:62)
	at sun.reflect.DelegatingMethodAccessorImpl.invoke(DelegatingMethodAccessorImpl.java:43)
	at java.lang.reflect.Method.invoke(Method.java:498)
	at org.codehaus.plexus.classworlds.launcher.Launcher.launchStandard(Launcher.java:330)
	at org.codehaus.plexus.classworlds.launcher.Launcher.launch(Launcher.java:238)
	at jenkins.maven3.agent.Maven33Main.launch(Maven33Main.java:176)
	at sun.reflect.NativeMethodAccessorImpl.invoke0(Native Method)
	at sun.reflect.NativeMethodAccessorImpl.invoke(NativeMethodAccessorImpl.java:62)
	at sun.reflect.DelegatingMethodAccessorImpl.invoke(DelegatingMethodAccessorImpl.java:43)
	at java.lang.reflect.Method.invoke(Method.java:498)
	at hudson.maven.Maven3Builder.call(Maven3Builder.java:139)
	at hudson.maven.Maven3Builder.call(Maven3Builder.java:70)
	at hudson.remoting.UserRequest.perform(UserRequest.java:153)
	at hudson.remoting.UserRequest.perform(UserRequest.java:50)
	at hudson.remoting.Request$2.run(Request.java:336)
	at hudson.remoting.InterceptingExecutorService$1.call(InterceptingExecutorService.java:68)
	at java.util.concurrent.FutureTask.run(FutureTask.java:266)
	at java.util.concurrent.ThreadPoolExecutor.runWorker(ThreadPoolExecutor.java:1142)
	at java.util.concurrent.ThreadPoolExecutor$Worker.run(ThreadPoolExecutor.java:617)
	at java.lang.Thread.run(Thread.java:745)
[JENKINS] Archiving disabled
2017-03-30T22:50:07.871 [INFO]                                                           
             
2017-03-30T22:50:07.871 [INFO] ------------------------------------------------------------------------
2017-03-30T22:50:07.871 [INFO] Skipping Apache Beam :: Parent
2017-03-30T22:50:07.871 [INFO] This project has been banned from the build due to previous
failures.
2017-03-30T22:50:07.871 [INFO] ------------------------------------------------------------------------
[JENKINS] Archiving disabled
[JENKINS] Archiving disabled
[JENKINS] Archiving disabled
[JENKINS] Archiving disabled
[JENKINS] Archiving disabled
[JENKINS] Archiving disabled
[JENKINS] Archiving disabled
[JENKINS] Archiving disabled
[JENKINS] Archiving disabled
[JENKINS] Archiving disabled
[JENKINS] Archiving disabled
[JENKINS] Archiving disabled
[JENKINS] Archiving disabled
[JENKINS] Archiving disabled
[JENKINS] Archiving disabled
[JENKINS] Archiving disabled
[JENKINS] Archiving disabled
[JENKINS] Archiving disabled
[JENKINS] Archiving disabled
[JENKINS] Archiving disabled
[JENKINS] Archiving disabled
[JENKINS] Archiving disabled
[JENKINS] Archiving disabled
[JENKINS] Archiving disabled
[JENKINS] Archiving disabled
[JENKINS] Archiving disabled
[JENKINS] Archiving disabled
[JENKINS] Archiving disabled
[JENKINS] Archiving disabled
[JENKINS] Archiving disabled
[JENKINS] Archiving disabled
[JENKINS] Archiving disabled
[JENKINS] Archiving disabled
[JENKINS] Archiving disabled
[JENKINS] Archiving disabled
[JENKINS] Archiving disabled
[JENKINS] Archiving disabled
[JENKINS] Archiving disabled
[JENKINS] Archiving disabled
[JENKINS] Archiving disabled
[JENKINS] Archiving disabled
[JENKINS] Archiving disabled
[JENKINS] Archiving disabled
2017-03-30T22:50:25.662 [INFO] ------------------------------------------------------------------------
2017-03-30T22:50:25.662 [INFO] Reactor Summary:
2017-03-30T22:50:25.662 [INFO] 
2017-03-30T22:50:25.662 [INFO] Apache Beam :: Parent .............................. SUCCESS
[ 25.018 s]
2017-03-30T22:50:25.662 [INFO] Apache Beam :: SDKs :: Java :: Build Tools ......... SUCCESS
[  9.022 s]
2017-03-30T22:50:25.662 [INFO] Apache Beam :: SDKs ................................ SUCCESS
[  8.275 s]
2017-03-30T22:50:25.662 [INFO] Apache Beam :: SDKs :: Common ...................... SUCCESS
[  2.628 s]
2017-03-30T22:50:25.662 [INFO] Apache Beam :: SDKs :: Common :: Fn API ............ SUCCESS
[ 20.685 s]
2017-03-30T22:50:25.662 [INFO] Apache Beam :: SDKs :: Common :: Runner API ........ SUCCESS
[ 15.293 s]
2017-03-30T22:50:25.662 [INFO] Apache Beam :: SDKs :: Java ........................ SUCCESS
[  5.735 s]
2017-03-30T22:50:25.662 [INFO] Apache Beam :: SDKs :: Java :: Core ................ SUCCESS
[02:36 min]
2017-03-30T22:50:25.662 [INFO] Apache Beam :: SDKs :: Java :: IO .................. SUCCESS
[  1.804 s]
2017-03-30T22:50:25.662 [INFO] Apache Beam :: SDKs :: Java :: IO :: Common ........ SUCCESS
[  3.941 s]
2017-03-30T22:50:25.662 [INFO] Apache Beam :: Runners ............................. SUCCESS
[  2.201 s]
2017-03-30T22:50:25.662 [INFO] Apache Beam :: Runners :: Core Java Construction ... SUCCESS
[ 12.399 s]
2017-03-30T22:50:25.662 [INFO] Apache Beam :: Runners :: Core Java ................ SUCCESS
[ 45.611 s]
2017-03-30T22:50:25.662 [INFO] Apache Beam :: Runners :: Direct Java .............. SUCCESS
[02:39 min]
2017-03-30T22:50:25.662 [INFO] Apache Beam :: SDKs :: Java :: IO :: Elasticsearch . SUCCESS
[ 33.329 s]
2017-03-30T22:50:25.662 [INFO] Apache Beam :: Runners :: Google Cloud Dataflow .... SUCCESS
[ 31.519 s]
2017-03-30T22:50:25.662 [INFO] Apache Beam :: SDKs :: Java :: IO :: Google Cloud Platform
SUCCESS [04:56 min]
2017-03-30T22:50:25.662 [INFO] Apache Beam :: SDKs :: Java :: IO :: Hadoop Common . SUCCESS
[ 18.619 s]
2017-03-30T22:50:25.662 [INFO] Apache Beam :: SDKs :: Java :: IO :: HBase ......... SUCCESS
[ 23.166 s]
2017-03-30T22:50:25.662 [INFO] Apache Beam :: SDKs :: Java :: IO :: HDFS .......... SUCCESS
[ 22.705 s]
2017-03-30T22:50:25.662 [INFO] Apache Beam :: SDKs :: Java :: IO :: JDBC .......... SUCCESS
[ 24.869 s]
2017-03-30T22:50:25.662 [INFO] Apache Beam :: SDKs :: Java :: IO :: JMS ........... SUCCESS
[ 30.690 s]
2017-03-30T22:50:25.662 [INFO] Apache Beam :: SDKs :: Java :: IO :: Kafka ......... SUCCESS
[ 24.097 s]
2017-03-30T22:50:25.662 [INFO] Apache Beam :: SDKs :: Java :: IO :: Kinesis ....... SUCCESS
[ 23.484 s]
2017-03-30T22:50:25.662 [INFO] Apache Beam :: SDKs :: Java :: IO :: MongoDB ....... SUCCESS
[ 29.810 s]
2017-03-30T22:50:25.662 [INFO] Apache Beam :: SDKs :: Java :: IO :: MQTT .......... SUCCESS
[ 19.515 s]
2017-03-30T22:50:25.662 [INFO] Apache Beam :: SDKs :: Java :: Maven Archetypes .... SUCCESS
[  2.525 s]
2017-03-30T22:50:25.662 [INFO] Apache Beam :: SDKs :: Java :: Maven Archetypes :: Starter
SUCCESS [ 14.287 s]
2017-03-30T22:50:25.662 [INFO] Apache Beam :: SDKs :: Java :: Maven Archetypes :: Examples
SUCCESS [ 22.552 s]
2017-03-30T22:50:25.662 [INFO] Apache Beam :: SDKs :: Java :: Maven Archetypes :: Examples
- Java 8 SUCCESS [ 22.157 s]
2017-03-30T22:50:25.662 [INFO] Apache Beam :: SDKs :: Java :: Extensions .......... SUCCESS
[  2.210 s]
2017-03-30T22:50:25.662 [INFO] Apache Beam :: SDKs :: Java :: Extensions :: Jackson SUCCESS
[ 13.836 s]
2017-03-30T22:50:25.662 [INFO] Apache Beam :: SDKs :: Java :: Extensions :: Join library SUCCESS
[ 18.406 s]
2017-03-30T22:50:25.662 [INFO] Apache Beam :: SDKs :: Java :: Extensions :: Sorter  SUCCESS
[ 28.778 s]
2017-03-30T22:50:25.662 [INFO] Apache Beam :: SDKs :: Java :: Harness ............. SUCCESS
[ 29.290 s]
2017-03-30T22:50:25.662 [INFO] Apache Beam :: SDKs :: Java :: Java 8 Tests ........ SUCCESS
[  9.884 s]
2017-03-30T22:50:25.662 [INFO] Apache Beam :: SDKs :: Python ...................... FAILURE
[06:21 min]
2017-03-30T22:50:25.662 [INFO] Apache Beam :: Runners :: Flink .................... SKIPPED
2017-03-30T22:50:25.663 [INFO] Apache Beam :: Runners :: Flink :: Core ............ SKIPPED
2017-03-30T22:50:25.663 [INFO] Apache Beam :: Runners :: Flink :: Examples ........ SKIPPED
2017-03-30T22:50:25.663 [INFO] Apache Beam :: Runners :: Spark .................... SKIPPED
2017-03-30T22:50:25.663 [INFO] Apache Beam :: Runners :: Apex ..................... SKIPPED
2017-03-30T22:50:25.663 [INFO] Apache Beam :: Examples ............................ SKIPPED
2017-03-30T22:50:25.663 [INFO] Apache Beam :: Examples :: Java .................... SKIPPED
2017-03-30T22:50:25.663 [INFO] Apache Beam :: Examples :: Java 8 .................. SKIPPED
2017-03-30T22:50:25.663 [INFO] Apache Beam :: SDKs :: Java :: Aggregated Javadoc .. SKIPPED
2017-03-30T22:50:25.663 [INFO] ------------------------------------------------------------------------
2017-03-30T22:50:25.663 [INFO] BUILD FAILURE
2017-03-30T22:50:25.663 [INFO] ------------------------------------------------------------------------
2017-03-30T22:50:25.663 [INFO] Total time: 28:45 min
2017-03-30T22:50:25.663 [INFO] Finished at: 2017-03-30T22:50:25+00:00
2017-03-30T22:50:26.359 [INFO] Final Memory: 221M/1622M
2017-03-30T22:50:26.359 [INFO] ------------------------------------------------------------------------
Waiting for Jenkins to finish collecting data
2017-03-30T22:55:38.928 [ERROR] Failed to execute goal org.codehaus.mojo:exec-maven-plugin:1.5.0:exec
(setuptools-test) on project beam-sdks-python: Command execution failed. Process exited with
an error: 1 (Exit value: 1) -> [Help 1]
org.apache.maven.lifecycle.LifecycleExecutionException: Failed to execute goal org.codehaus.mojo:exec-maven-plugin:1.5.0:exec
(setuptools-test) on project beam-sdks-python: Command execution failed.
	at org.apache.maven.lifecycle.internal.MojoExecutor.execute(MojoExecutor.java:216)
	at org.apache.maven.lifecycle.internal.MojoExecutor.execute(MojoExecutor.java:153)
	at org.apache.maven.lifecycle.internal.MojoExecutor.execute(MojoExecutor.java:145)
	at org.apache.maven.lifecycle.internal.LifecycleModuleBuilder.buildProject(LifecycleModuleBuilder.java:116)
	at org.apache.maven.lifecycle.internal.LifecycleModuleBuilder.buildProject(LifecycleModuleBuilder.java:80)
	at org.apache.maven.lifecycle.internal.builder.singlethreaded.SingleThreadedBuilder.build(SingleThreadedBuilder.java:51)
	at org.apache.maven.lifecycle.internal.LifecycleStarter.execute(LifecycleStarter.java:128)
	at org.apache.maven.DefaultMaven.doExecute(DefaultMaven.java:307)
	at org.apache.maven.DefaultMaven.doExecute(DefaultMaven.java:193)
	at org.apache.maven.DefaultMaven.execute(DefaultMaven.java:106)
	at org.jvnet.hudson.maven3.launcher.Maven33Launcher.main(Maven33Launcher.java:129)
	at sun.reflect.NativeMethodAccessorImpl.invoke0(Native Method)
	at sun.reflect.NativeMethodAccessorImpl.invoke(NativeMethodAccessorImpl.java:62)
	at sun.reflect.DelegatingMethodAccessorImpl.invoke(DelegatingMethodAccessorImpl.java:43)
	at java.lang.reflect.Method.invoke(Method.java:498)
	at org.codehaus.plexus.classworlds.launcher.Launcher.launchStandard(Launcher.java:330)
	at org.codehaus.plexus.classworlds.launcher.Launcher.launch(Launcher.java:238)
	at jenkins.maven3.agent.Maven33Main.launch(Maven33Main.java:176)
	at sun.reflect.NativeMethodAccessorImpl.invoke0(Native Method)
	at sun.reflect.NativeMethodAccessorImpl.invoke(NativeMethodAccessorImpl.java:62)
	at sun.reflect.DelegatingMethodAccessorImpl.invoke(DelegatingMethodAccessorImpl.java:43)
	at java.lang.reflect.Method.invoke(Method.java:498)
	at hudson.maven.Maven3Builder.call(Maven3Builder.java:139)
	at hudson.maven.Maven3Builder.call(Maven3Builder.java:70)
	at hudson.remoting.UserRequest.perform(UserRequest.java:153)
	at hudson.remoting.UserRequest.perform(UserRequest.java:50)
	at hudson.remoting.Request$2.run(Request.java:336)
	at hudson.remoting.InterceptingExecutorService$1.call(InterceptingExecutorService.java:68)
	at java.util.concurrent.FutureTask.run(FutureTask.java:266)
	at java.util.concurrent.ThreadPoolExecutor.runWorker(ThreadPoolExecutor.java:1142)
	at java.util.concurrent.ThreadPoolExecutor$Worker.run(ThreadPoolExecutor.java:617)
	at java.lang.Thread.run(Thread.java:745)
Caused by: org.apache.maven.plugin.MojoExecutionException: Command execution failed.
	at org.codehaus.mojo.exec.ExecMojo.execute(ExecMojo.java:302)
	at org.apache.maven.plugin.DefaultBuildPluginManager.executeMojo(DefaultBuildPluginManager.java:134)
	at org.apache.maven.lifecycle.internal.MojoExecutor.execute(MojoExecutor.java:208)
	... 31 more
Caused by: org.apache.commons.exec.ExecuteException: Process exited with an error: 1 (Exit
value: 1)
	at org.apache.commons.exec.DefaultExecutor.executeInternal(DefaultExecutor.java:404)
	at org.apache.commons.exec.DefaultExecutor.execute(DefaultExecutor.java:166)
	at org.codehaus.mojo.exec.ExecMojo.executeCommandLine(ExecMojo.java:764)
	at org.codehaus.mojo.exec.ExecMojo.executeCommandLine(ExecMojo.java:711)
	at org.codehaus.mojo.exec.ExecMojo.execute(ExecMojo.java:289)
	... 33 more
2017-03-30T22:55:38.928 [ERROR] 
2017-03-30T22:55:38.928 [ERROR] Re-run Maven using the -X switch to enable full debug logging.
2017-03-30T22:55:38.928 [ERROR] 
2017-03-30T22:55:38.928 [ERROR] For more information about the errors and possible solutions,
please read the following articles:
2017-03-30T22:55:38.928 [ERROR] [Help 1] http://cwiki.apache.org/confluence/display/MAVEN/MojoExecutionException
2017-03-30T22:55:38.928 [ERROR] 
2017-03-30T22:55:38.929 [ERROR] After correcting the problems, you can resume the build with
the command
2017-03-30T22:55:38.929 [ERROR]   mvn <goals> -rf :beam-sdks-python
channel stopped

Mime
View raw message