beam-commits mailing list archives

Site index · List index
Message view « Date » · « Thread »
Top « Date » · « Thread »
From Apache Jenkins Server <jenk...@builds.apache.org>
Subject Build failed in Jenkins: beam_PostCommit_Java_Version_Test » JDK 1.7 (latest) #3
Date Thu, 09 Mar 2017 02:32:10 GMT
See <https://builds.apache.org/job/beam_PostCommit_Java_Version_Test/jdk=JDK%201.7%20(latest)/3/display/redirect>

------------------------------------------
Started by upstream project "beam_PostCommit_Java_Version_Test" build number 3
originally caused by:
 GitHub pull request #2204 of commit 80556b4d0f97def67d28d1923afff5b4b04b0386, no merge conflicts.
[EnvInject] - Loading node environment variables.
Building remotely on H10 (Hadoop) in workspace <https://builds.apache.org/job/beam_PostCommit_Java_Version_Test/jdk=JDK%201.7%20(latest)/ws/>
Cloning the remote Git repository
Cloning repository https://github.com/apache/beam.git
 > git init <https://builds.apache.org/job/beam_PostCommit_Java_Version_Test/jdk=JDK%201.7%20(latest)/ws/>
# timeout=10
Fetching upstream changes from https://github.com/apache/beam.git
 > git --version # timeout=10
 > git fetch --tags --progress https://github.com/apache/beam.git +refs/heads/*:refs/remotes/origin/*
 > git config remote.origin.url https://github.com/apache/beam.git # timeout=10
 > git config --add remote.origin.fetch +refs/heads/*:refs/remotes/origin/* # timeout=10
 > git config remote.origin.url https://github.com/apache/beam.git # timeout=10
Fetching upstream changes from https://github.com/apache/beam.git
 > git fetch --tags --progress https://github.com/apache/beam.git +refs/heads/*:refs/remotes/origin/*
+refs/pull/*:refs/remotes/origin/pr/*
Checking out Revision 079d91c0573d4ae5366a01c5f6655d0d854b2b24 (refs/remotes/origin/pr/2204/merge)
 > git config core.sparsecheckout # timeout=10
 > git checkout -f 079d91c0573d4ae5366a01c5f6655d0d854b2b24
First time build. Skipping changelog.
Cleaning workspace
 > git rev-parse --verify HEAD # timeout=10
Resetting working tree
 > git reset --hard # timeout=10
 > git clean -fdx # timeout=10
[EnvInject] - Executing scripts and injecting environment variables after the SCM step.
[EnvInject] - Injecting as environment variables the properties content 
SPARK_LOCAL_IP=127.0.0.1

[EnvInject] - Variables injected successfully.
[JDK 1.7 (latest)] $ /home/jenkins/tools/maven/apache-maven-3.3.3/bin/mvn -f pom.xml -DghprbActualCommitAuthorEmail=markliu@google.com
-DghprbTriggerAuthorLogin=markflyhigh -DghprbGhRepository=apache/beam -DghprbTargetBranch=master
-DghprbPullId=2204 -DghprbCredentialsId=56783412-83e6-4ab7-965c-3f8c3b9dd8f1 -DghprbAuthorRepoGitUrl=https://github.com/markflyhigh/incubator-beam.git
"-DghprbTriggerAuthor=Mark Liu" -DghprbPullAuthorEmail= -DghprbPullLink=https://github.com/apache/beam/pull/2204
-Dsha1=origin/pr/2204/merge "-Djdk=JDK 1.7 (latest)" -DghprbPullAuthorLoginMention=@markflyhigh
"-DghprbPullDescription=GitHub pull request #2204 of commit 80556b4d0f97def67d28d1923afff5b4b04b0386,
no merge conflicts." -DghprbActualCommit=80556b4d0f97def67d28d1923afff5b4b04b0386 -DghprbPullAuthorLogin=markflyhigh
-DghprbSourceBranch=jenkins_java_sdk_version_test "-DghprbActualCommitAuthor=Mark Liu" -DghprbTriggerAuthorLoginMention=@markflyhigh
"-DghprbPullLongDescription=Be sure to do all of the following to help us incorporate your
contribution\r\nquickly and easily:\r\n\r\n - [x] Make sure the PR title is formatted like:\r\n
  `[BEAM-<Jira issue #>] Description of pull request`\r\n - [ ] Make sure tests pass
via `mvn clean verify`. (Even better, enable\r\n       Travis-CI on your fork and ensure the
whole test matrix passes).\r\n - [ ] Replace `<Jira issue #>` in the title with the
actual Jira issue\r\n       number, if there is one.\r\n - [ ] If this contribution is large,
please file an Apache\r\n       [Individual Contributor License Agreement](https://www.apache.org/licenses/icla.txt).\r\n\r\n---\r\n\r\nJava
JDK version tests in Jenkins." -DghprbTriggerAuthorEmail= -DGIT_BRANCH=jenkins_java_sdk_version_test
"-DghprbPullTitle=This PR is only for test purpose - Do not merge!" "-DghprbCommentBody=Run
Java Versions Test" "-Dmaven.repo.local=<https://builds.apache.org/job/beam_PostCommit_Java_Version_Test/jdk=JDK%201.7%20(latest)/ws/.repository">
-B -e -P release clean install -pl !sdks/python coveralls:report -DrepoToken=**** -B -e -P
release clean verify coveralls:report -pl examples/java -DrepoToken=**** -DskipITs=false -Dit.test=WordCountIT
'-DintegrationTestPipelineOptions=[ "--project=apache-beam-testing", "--tempRoot=gs://temp-storage-for-end-to-end-tests",
"--runner=org.apache.beam.runners.dataflow.testing.TestDataflowRunner"]'
/home/jenkins/tools/maven/apache-maven-3.3.3/bin/mvn: 200: local: 1.7: bad variable name
2017-03-09\T\02:31:58.514 [INFO] Error stacktraces are turned on.
2017-03-09\T\02:31:58.586 [INFO] Scanning for projects...
2017-03-09\T\02:31:58.861 [INFO] Downloading: https://repo.maven.apache.org/maven2/org/apache/apache/18/apache-18.pom
2017-03-09\T\02:31:59.246 [INFO] Downloaded: https://repo.maven.apache.org/maven2/org/apache/apache/18/apache-18.pom
(16 KB at 39.3 KB/sec)
2017-03-09\T\02:32:00.178 [INFO] Downloading: https://repo.maven.apache.org/maven2/kr/motd/maven/os-maven-plugin/1.4.0.Final/os-maven-plugin-1.4.0.Final.pom
2017-03-09\T\02:32:00.212 [INFO] Downloaded: https://repo.maven.apache.org/maven2/kr/motd/maven/os-maven-plugin/1.4.0.Final/os-maven-plugin-1.4.0.Final.pom
(7 KB at 177.8 KB/sec)
2017-03-09\T\02:32:00.218 [INFO] Downloading: https://repo.maven.apache.org/maven2/org/sonatype/oss/oss-parent/9/oss-parent-9.pom
2017-03-09\T\02:32:00.273 [INFO] Downloaded: https://repo.maven.apache.org/maven2/org/sonatype/oss/oss-parent/9/oss-parent-9.pom
(7 KB at 116.6 KB/sec)
2017-03-09\T\02:32:00.290 [INFO] Downloading: https://repo.maven.apache.org/maven2/org/apache/maven/maven-plugin-api/3.2.1/maven-plugin-api-3.2.1.pom
2017-03-09\T\02:32:00.321 [INFO] Downloaded: https://repo.maven.apache.org/maven2/org/apache/maven/maven-plugin-api/3.2.1/maven-plugin-api-3.2.1.pom
(4 KB at 106.5 KB/sec)
2017-03-09\T\02:32:00.325 [INFO] Downloading: https://repo.maven.apache.org/maven2/org/apache/maven/maven/3.2.1/maven-3.2.1.pom
2017-03-09\T\02:32:00.374 [INFO] Downloaded: https://repo.maven.apache.org/maven2/org/apache/maven/maven/3.2.1/maven-3.2.1.pom
(23 KB at 450.2 KB/sec)
2017-03-09\T\02:32:00.379 [INFO] Downloading: https://repo.maven.apache.org/maven2/org/apache/maven/maven-parent/23/maven-parent-23.pom
2017-03-09\T\02:32:00.443 [INFO] Downloaded: https://repo.maven.apache.org/maven2/org/apache/maven/maven-parent/23/maven-parent-23.pom
(32 KB at 497.2 KB/sec)
2017-03-09\T\02:32:00.449 [INFO] Downloading: https://repo.maven.apache.org/maven2/org/apache/apache/13/apache-13.pom
2017-03-09\T\02:32:00.468 [INFO] Downloaded: https://repo.maven.apache.org/maven2/org/apache/apache/13/apache-13.pom
(14 KB at 718.2 KB/sec)
2017-03-09\T\02:32:00.479 [INFO] Downloading: https://repo.maven.apache.org/maven2/org/apache/maven/maven-model/3.2.1/maven-model-3.2.1.pom
2017-03-09\T\02:32:00.522 [INFO] Downloaded: https://repo.maven.apache.org/maven2/org/apache/maven/maven-model/3.2.1/maven-model-3.2.1.pom
(5 KB at 94.0 KB/sec)
2017-03-09\T\02:32:00.531 [INFO] Downloading: https://repo.maven.apache.org/maven2/org/codehaus/plexus/plexus-utils/3.0.17/plexus-utils-3.0.17.pom
2017-03-09\T\02:32:00.589 [INFO] Downloaded: https://repo.maven.apache.org/maven2/org/codehaus/plexus/plexus-utils/3.0.17/plexus-utils-3.0.17.pom
(4 KB at 57.2 KB/sec)
2017-03-09\T\02:32:00.592 [INFO] Downloading: https://repo.maven.apache.org/maven2/org/codehaus/plexus/plexus/3.3.1/plexus-3.3.1.pom
2017-03-09\T\02:32:00.631 [INFO] Downloaded: https://repo.maven.apache.org/maven2/org/codehaus/plexus/plexus/3.3.1/plexus-3.3.1.pom
(20 KB at 512.0 KB/sec)
2017-03-09\T\02:32:00.634 [INFO] Downloading: https://repo.maven.apache.org/maven2/org/sonatype/spice/spice-parent/17/spice-parent-17.pom
2017-03-09\T\02:32:00.651 [INFO] Downloaded: https://repo.maven.apache.org/maven2/org/sonatype/spice/spice-parent/17/spice-parent-17.pom
(7 KB at 388.3 KB/sec)
2017-03-09\T\02:32:00.654 [INFO] Downloading: https://repo.maven.apache.org/maven2/org/sonatype/forge/forge-parent/10/forge-parent-10.pom
2017-03-09\T\02:32:00.679 [INFO] Downloaded: https://repo.maven.apache.org/maven2/org/sonatype/forge/forge-parent/10/forge-parent-10.pom
(14 KB at 529.7 KB/sec)
2017-03-09\T\02:32:00.687 [INFO] Downloading: https://repo.maven.apache.org/maven2/org/apache/maven/maven-artifact/3.2.1/maven-artifact-3.2.1.pom
2017-03-09\T\02:32:00.711 [INFO] Downloaded: https://repo.maven.apache.org/maven2/org/apache/maven/maven-artifact/3.2.1/maven-artifact-3.2.1.pom
(2 KB at 77.0 KB/sec)
2017-03-09\T\02:32:00.732 [INFO] Downloading: https://repo.maven.apache.org/maven2/org/eclipse/sisu/org.eclipse.sisu.plexus/0.0.0.M5/org.eclipse.sisu.plexus-0.0.0.M5.pom
2017-03-09\T\02:32:00.770 [INFO] Downloaded: https://repo.maven.apache.org/maven2/org/eclipse/sisu/org.eclipse.sisu.plexus/0.0.0.M5/org.eclipse.sisu.plexus-0.0.0.M5.pom
(5 KB at 124.1 KB/sec)
2017-03-09\T\02:32:00.773 [INFO] Downloading: https://repo.maven.apache.org/maven2/org/eclipse/sisu/sisu-plexus/0.0.0.M5/sisu-plexus-0.0.0.M5.pom
2017-03-09\T\02:32:00.792 [INFO] Downloaded: https://repo.maven.apache.org/maven2/org/eclipse/sisu/sisu-plexus/0.0.0.M5/sisu-plexus-0.0.0.M5.pom
(13 KB at 678.6 KB/sec)
2017-03-09\T\02:32:00.795 [INFO] Downloading: https://repo.maven.apache.org/maven2/org/sonatype/oss/oss-parent/7/oss-parent-7.pom
2017-03-09\T\02:32:00.872 [INFO] Downloaded: https://repo.maven.apache.org/maven2/org/sonatype/oss/oss-parent/7/oss-parent-7.pom
(5 KB at 61.2 KB/sec)
2017-03-09\T\02:32:00.879 [INFO] Downloading: https://repo.maven.apache.org/maven2/javax/enterprise/cdi-api/1.0/cdi-api-1.0.pom
2017-03-09\T\02:32:00.914 [INFO] Downloaded: https://repo.maven.apache.org/maven2/javax/enterprise/cdi-api/1.0/cdi-api-1.0.pom
(2 KB at 40.0 KB/sec)
2017-03-09\T\02:32:00.917 [INFO] Downloading: https://repo.maven.apache.org/maven2/org/jboss/weld/weld-api-parent/1.0/weld-api-parent-1.0.pom
2017-03-09\T\02:32:00.939 [INFO] Downloaded: https://repo.maven.apache.org/maven2/org/jboss/weld/weld-api-parent/1.0/weld-api-parent-1.0.pom
(3 KB at 104.5 KB/sec)
2017-03-09\T\02:32:00.942 [INFO] Downloading: https://repo.maven.apache.org/maven2/org/jboss/weld/weld-api-bom/1.0/weld-api-bom-1.0.pom
2017-03-09\T\02:32:00.992 [INFO] Downloaded: https://repo.maven.apache.org/maven2/org/jboss/weld/weld-api-bom/1.0/weld-api-bom-1.0.pom
(8 KB at 154.4 KB/sec)
2017-03-09\T\02:32:00.995 [INFO] Downloading: https://repo.maven.apache.org/maven2/org/jboss/weld/weld-parent/6/weld-parent-6.pom
2017-03-09\T\02:32:01.056 [INFO] Downloaded: https://repo.maven.apache.org/maven2/org/jboss/weld/weld-parent/6/weld-parent-6.pom
(21 KB at 331.3 KB/sec)
2017-03-09\T\02:32:01.067 [INFO] Downloading: https://repo.maven.apache.org/maven2/javax/annotation/jsr250-api/1.0/jsr250-api-1.0.pom
2017-03-09\T\02:32:01.104 [INFO] Downloaded: https://repo.maven.apache.org/maven2/javax/annotation/jsr250-api/1.0/jsr250-api-1.0.pom
(1023 B at 27.0 KB/sec)
2017-03-09\T\02:32:01.108 [INFO] Downloading: https://repo.maven.apache.org/maven2/javax/inject/javax.inject/1/javax.inject-1.pom
2017-03-09\T\02:32:01.146 [INFO] Downloaded: https://repo.maven.apache.org/maven2/javax/inject/javax.inject/1/javax.inject-1.pom
(612 B at 15.7 KB/sec)
2017-03-09\T\02:32:01.186 [INFO] Downloading: https://repo.maven.apache.org/maven2/com/google/guava/guava/10.0.1/guava-10.0.1.pom
2017-03-09\T\02:32:01.208 [INFO] Downloaded: https://repo.maven.apache.org/maven2/com/google/guava/guava/10.0.1/guava-10.0.1.pom
(6 KB at 250.4 KB/sec)
2017-03-09\T\02:32:01.210 [INFO] Downloading: https://repo.maven.apache.org/maven2/com/google/guava/guava-parent/10.0.1/guava-parent-10.0.1.pom
2017-03-09\T\02:32:01.251 [INFO] Downloaded: https://repo.maven.apache.org/maven2/com/google/guava/guava-parent/10.0.1/guava-parent-10.0.1.pom
(2 KB at 46.7 KB/sec)
2017-03-09\T\02:32:01.255 [INFO] Downloading: https://repo.maven.apache.org/maven2/com/google/code/findbugs/jsr305/1.3.9/jsr305-1.3.9.pom
2017-03-09\T\02:32:01.271 [INFO] Downloaded: https://repo.maven.apache.org/maven2/com/google/code/findbugs/jsr305/1.3.9/jsr305-1.3.9.pom
(965 B at 58.9 KB/sec)
2017-03-09\T\02:32:01.275 [INFO] Downloading: https://repo.maven.apache.org/maven2/org/sonatype/sisu/sisu-guice/3.1.0/sisu-guice-3.1.0.pom
2017-03-09\T\02:32:01.327 [INFO] Downloaded: https://repo.maven.apache.org/maven2/org/sonatype/sisu/sisu-guice/3.1.0/sisu-guice-3.1.0.pom
(10 KB at 194.3 KB/sec)
2017-03-09\T\02:32:01.332 [INFO] Downloading: https://repo.maven.apache.org/maven2/org/sonatype/sisu/inject/guice-parent/3.1.0/guice-parent-3.1.0.pom
2017-03-09\T\02:32:01.406 [INFO] Downloaded: https://repo.maven.apache.org/maven2/org/sonatype/sisu/inject/guice-parent/3.1.0/guice-parent-3.1.0.pom
(11 KB at 146.2 KB/sec)
2017-03-09\T\02:32:01.411 [INFO] Downloading: https://repo.maven.apache.org/maven2/aopalliance/aopalliance/1.0/aopalliance-1.0.pom
2017-03-09\T\02:32:01.426 [INFO] Downloaded: https://repo.maven.apache.org/maven2/aopalliance/aopalliance/1.0/aopalliance-1.0.pom
(363 B at 23.6 KB/sec)
2017-03-09\T\02:32:01.429 [INFO] Downloading: https://repo.maven.apache.org/maven2/org/eclipse/sisu/org.eclipse.sisu.inject/0.0.0.M5/org.eclipse.sisu.inject-0.0.0.M5.pom
2017-03-09\T\02:32:01.465 [INFO] Downloaded: https://repo.maven.apache.org/maven2/org/eclipse/sisu/org.eclipse.sisu.inject/0.0.0.M5/org.eclipse.sisu.inject-0.0.0.M5.pom
(3 KB at 68.4 KB/sec)
2017-03-09\T\02:32:01.469 [INFO] Downloading: https://repo.maven.apache.org/maven2/org/eclipse/sisu/sisu-inject/0.0.0.M5/sisu-inject-0.0.0.M5.pom
2017-03-09\T\02:32:01.514 [INFO] Downloaded: https://repo.maven.apache.org/maven2/org/eclipse/sisu/sisu-inject/0.0.0.M5/sisu-inject-0.0.0.M5.pom
(14 KB at 303.7 KB/sec)
2017-03-09\T\02:32:01.523 [INFO] Downloading: https://repo.maven.apache.org/maven2/org/codehaus/plexus/plexus-component-annotations/1.5.5/plexus-component-annotations-1.5.5.pom
2017-03-09\T\02:32:01.552 [INFO] Downloaded: https://repo.maven.apache.org/maven2/org/codehaus/plexus/plexus-component-annotations/1.5.5/plexus-component-annotations-1.5.5.pom
(815 B at 26.5 KB/sec)
2017-03-09\T\02:32:01.554 [INFO] Downloading: https://repo.maven.apache.org/maven2/org/codehaus/plexus/plexus-containers/1.5.5/plexus-containers-1.5.5.pom
2017-03-09\T\02:32:01.599 [INFO] Downloaded: https://repo.maven.apache.org/maven2/org/codehaus/plexus/plexus-containers/1.5.5/plexus-containers-1.5.5.pom
(5 KB at 92.0 KB/sec)
2017-03-09\T\02:32:01.602 [INFO] Downloading: https://repo.maven.apache.org/maven2/org/codehaus/plexus/plexus/2.0.7/plexus-2.0.7.pom
2017-03-09\T\02:32:01.650 [INFO] Downloaded: https://repo.maven.apache.org/maven2/org/codehaus/plexus/plexus/2.0.7/plexus-2.0.7.pom
(17 KB at 351.9 KB/sec)
2017-03-09\T\02:32:01.656 [INFO] Downloading: https://repo.maven.apache.org/maven2/org/codehaus/plexus/plexus-classworlds/2.4/plexus-classworlds-2.4.pom
2017-03-09\T\02:32:01.708 [INFO] Downloaded: https://repo.maven.apache.org/maven2/org/codehaus/plexus/plexus-classworlds/2.4/plexus-classworlds-2.4.pom
(4 KB at 72.9 KB/sec)
2017-03-09\T\02:32:01.754 [INFO] Downloading: https://repo.maven.apache.org/maven2/org/codehaus/plexus/plexus-utils/2.1/plexus-utils-2.1.pom
2017-03-09\T\02:32:01.810 [INFO] Downloaded: https://repo.maven.apache.org/maven2/org/codehaus/plexus/plexus-utils/2.1/plexus-utils-2.1.pom
(4 KB at 71.6 KB/sec)
2017-03-09\T\02:32:01.812 [INFO] Downloading: https://repo.maven.apache.org/maven2/org/sonatype/spice/spice-parent/16/spice-parent-16.pom
2017-03-09\T\02:32:01.855 [INFO] Downloaded: https://repo.maven.apache.org/maven2/org/sonatype/spice/spice-parent/16/spice-parent-16.pom
(9 KB at 189.8 KB/sec)
2017-03-09\T\02:32:01.860 [INFO] Downloading: https://repo.maven.apache.org/maven2/org/sonatype/forge/forge-parent/5/forge-parent-5.pom
2017-03-09\T\02:32:01.914 [INFO] Downloaded: https://repo.maven.apache.org/maven2/org/sonatype/forge/forge-parent/5/forge-parent-5.pom
(9 KB at 151.2 KB/sec)
2017-03-09\T\02:32:01.940 [INFO] Downloading: https://repo.maven.apache.org/maven2/kr/motd/maven/os-maven-plugin/1.4.0.Final/os-maven-plugin-1.4.0.Final.jar
2017-03-09\T\02:32:01.942 [INFO] Downloading: https://repo.maven.apache.org/maven2/org/apache/maven/maven-plugin-api/3.2.1/maven-plugin-api-3.2.1.jar
2017-03-09\T\02:32:01.942 [INFO] Downloading: https://repo.maven.apache.org/maven2/org/apache/maven/maven-model/3.2.1/maven-model-3.2.1.jar
2017-03-09\T\02:32:01.943 [INFO] Downloading: https://repo.maven.apache.org/maven2/org/apache/maven/maven-artifact/3.2.1/maven-artifact-3.2.1.jar
2017-03-09\T\02:32:01.945 [INFO] Downloading: https://repo.maven.apache.org/maven2/org/eclipse/sisu/org.eclipse.sisu.plexus/0.0.0.M5/org.eclipse.sisu.plexus-0.0.0.M5.jar
2017-03-09\T\02:32:02.002 [INFO] Downloaded: https://repo.maven.apache.org/maven2/org/apache/maven/maven-artifact/3.2.1/maven-artifact-3.2.1.jar
(53 KB at 873.2 KB/sec)
2017-03-09\T\02:32:02.003 [INFO] Downloading: https://repo.maven.apache.org/maven2/javax/enterprise/cdi-api/1.0/cdi-api-1.0.jar
2017-03-09\T\02:32:02.015 [INFO] Downloaded: https://repo.maven.apache.org/maven2/kr/motd/maven/os-maven-plugin/1.4.0.Final/os-maven-plugin-1.4.0.Final.jar
(29 KB at 368.8 KB/sec)
2017-03-09\T\02:32:02.015 [INFO] Downloading: https://repo.maven.apache.org/maven2/javax/annotation/jsr250-api/1.0/jsr250-api-1.0.jar
2017-03-09\T\02:32:02.069 [INFO] Downloaded: https://repo.maven.apache.org/maven2/org/apache/maven/maven-model/3.2.1/maven-model-3.2.1.jar
(157 KB at 1229.2 KB/sec)
2017-03-09\T\02:32:02.070 [INFO] Downloading: https://repo.maven.apache.org/maven2/javax/inject/javax.inject/1/javax.inject-1.jar
2017-03-09\T\02:32:02.071 [INFO] Downloaded: https://repo.maven.apache.org/maven2/org/apache/maven/maven-plugin-api/3.2.1/maven-plugin-api-3.2.1.jar
(45 KB at 341.7 KB/sec)
2017-03-09\T\02:32:02.078 [INFO] Downloading: https://repo.maven.apache.org/maven2/com/google/guava/guava/10.0.1/guava-10.0.1.jar
2017-03-09\T\02:32:02.089 [INFO] Downloaded: https://repo.maven.apache.org/maven2/org/eclipse/sisu/org.eclipse.sisu.plexus/0.0.0.M5/org.eclipse.sisu.plexus-0.0.0.M5.jar
(192 KB at 1314.6 KB/sec)
2017-03-09\T\02:32:02.091 [INFO] Downloading: https://repo.maven.apache.org/maven2/com/google/code/findbugs/jsr305/1.3.9/jsr305-1.3.9.jar
2017-03-09\T\02:32:02.092 [INFO] Downloaded: https://repo.maven.apache.org/maven2/javax/annotation/jsr250-api/1.0/jsr250-api-1.0.jar
(6 KB at 38.3 KB/sec)
2017-03-09\T\02:32:02.092 [INFO] Downloaded: https://repo.maven.apache.org/maven2/javax/enterprise/cdi-api/1.0/cdi-api-1.0.jar
(44 KB at 294.3 KB/sec)
2017-03-09\T\02:32:02.093 [INFO] Downloading: https://repo.maven.apache.org/maven2/aopalliance/aopalliance/1.0/aopalliance-1.0.jar
2017-03-09\T\02:32:02.092 [INFO] Downloading: https://repo.maven.apache.org/maven2/org/sonatype/sisu/sisu-guice/3.1.0/sisu-guice-3.1.0-no_aop.jar
2017-03-09\T\02:32:02.142 [INFO] Downloaded: https://repo.maven.apache.org/maven2/javax/inject/javax.inject/1/javax.inject-1.jar
(3 KB at 12.4 KB/sec)
2017-03-09\T\02:32:02.144 [INFO] Downloading: https://repo.maven.apache.org/maven2/org/eclipse/sisu/org.eclipse.sisu.inject/0.0.0.M5/org.eclipse.sisu.inject-0.0.0.M5.jar
2017-03-09\T\02:32:02.145 [INFO] Downloaded: https://repo.maven.apache.org/maven2/aopalliance/aopalliance/1.0/aopalliance-1.0.jar
(5 KB at 21.7 KB/sec)
2017-03-09\T\02:32:02.147 [INFO] Downloading: https://repo.maven.apache.org/maven2/org/codehaus/plexus/plexus-component-annotations/1.5.5/plexus-component-annotations-1.5.5.jar
2017-03-09\T\02:32:02.157 [INFO] Downloaded: https://repo.maven.apache.org/maven2/com/google/code/findbugs/jsr305/1.3.9/jsr305-1.3.9.jar
(33 KB at 151.4 KB/sec)
2017-03-09\T\02:32:02.157 [INFO] Downloading: https://repo.maven.apache.org/maven2/org/codehaus/plexus/plexus-classworlds/2.4/plexus-classworlds-2.4.jar
2017-03-09\T\02:32:02.164 [INFO] Downloaded: https://repo.maven.apache.org/maven2/org/codehaus/plexus/plexus-component-annotations/1.5.5/plexus-component-annotations-1.5.5.jar
(5 KB at 18.7 KB/sec)
2017-03-09\T\02:32:02.164 [INFO] Downloading: https://repo.maven.apache.org/maven2/org/codehaus/plexus/plexus-utils/3.0.17/plexus-utils-3.0.17.jar
2017-03-09\T\02:32:02.219 [INFO] Downloaded: https://repo.maven.apache.org/maven2/org/codehaus/plexus/plexus-classworlds/2.4/plexus-classworlds-2.4.jar
(46 KB at 167.1 KB/sec)
2017-03-09\T\02:32:02.219 [INFO] Downloaded: https://repo.maven.apache.org/maven2/org/eclipse/sisu/org.eclipse.sisu.inject/0.0.0.M5/org.eclipse.sisu.inject-0.0.0.M5.jar
(285 KB at 1034.8 KB/sec)
2017-03-09\T\02:32:02.281 [INFO] Downloaded: https://repo.maven.apache.org/maven2/org/sonatype/sisu/sisu-guice/3.1.0/sisu-guice-3.1.0-no_aop.jar
(350 KB at 1035.8 KB/sec)
2017-03-09\T\02:32:02.354 [INFO] Downloaded: https://repo.maven.apache.org/maven2/org/codehaus/plexus/plexus-utils/3.0.17/plexus-utils-3.0.17.jar
(246 KB at 599.7 KB/sec)
2017-03-09\T\02:32:02.520 [INFO] Downloaded: https://repo.maven.apache.org/maven2/com/google/guava/guava/10.0.1/guava-10.0.1.jar
(1467 KB at 2545.8 KB/sec)
2017-03-09\T\02:32:02.766 [INFO] Downloading: https://repo.maven.apache.org/maven2/org/apache/maven/archetype/archetype-packaging/2.4/archetype-packaging-2.4.pom
2017-03-09\T\02:32:02.815 [INFO] Downloaded: https://repo.maven.apache.org/maven2/org/apache/maven/archetype/archetype-packaging/2.4/archetype-packaging-2.4.pom
(2 KB at 31.2 KB/sec)
2017-03-09\T\02:32:02.818 [INFO] Downloading: https://repo.maven.apache.org/maven2/org/apache/maven/archetype/maven-archetype/2.4/maven-archetype-2.4.pom
2017-03-09\T\02:32:02.907 [INFO] Downloaded: https://repo.maven.apache.org/maven2/org/apache/maven/archetype/maven-archetype/2.4/maven-archetype-2.4.pom
(13 KB at 144.8 KB/sec)
2017-03-09\T\02:32:02.909 [INFO] Downloading: https://repo.maven.apache.org/maven2/org/apache/maven/maven-parent/26/maven-parent-26.pom
2017-03-09\T\02:32:02.952 [INFO] Downloaded: https://repo.maven.apache.org/maven2/org/apache/maven/maven-parent/26/maven-parent-26.pom
(39 KB at 903.5 KB/sec)
2017-03-09\T\02:32:02.958 [INFO] Downloading: https://repo.maven.apache.org/maven2/org/apache/apache/16/apache-16.pom
2017-03-09\T\02:32:03.011 [INFO] Downloaded: https://repo.maven.apache.org/maven2/org/apache/apache/16/apache-16.pom
(16 KB at 283.7 KB/sec)
2017-03-09\T\02:32:03.021 [INFO] Downloading: https://repo.maven.apache.org/maven2/org/apache/maven/archetype/archetype-packaging/2.4/archetype-packaging-2.4.jar
2017-03-09\T\02:32:03.025 [INFO] Downloading: https://repo.maven.apache.org/maven2/org/codehaus/plexus/plexus-utils/1.1/plexus-utils-1.1.jar
2017-03-09\T\02:32:03.052 [INFO] Downloaded: https://repo.maven.apache.org/maven2/org/apache/maven/archetype/archetype-packaging/2.4/archetype-packaging-2.4.jar
(8 KB at 229.9 KB/sec)
2017-03-09\T\02:32:03.095 [INFO] Downloaded: https://repo.maven.apache.org/maven2/org/codehaus/plexus/plexus-utils/1.1/plexus-utils-1.1.jar
(165 KB at 2224.6 KB/sec)
2017-03-09\T\02:32:03.217 [WARNING] 
2017-03-09\T\02:32:03.217 [WARNING] Some problems were encountered while building the effective
model for org.apache.beam:beam-runners-google-cloud-dataflow-java:jar:0.7.0-SNAPSHOT
2017-03-09\T\02:32:03.217 [WARNING] 'dependencies.dependency.(groupId:artifactId:type:classifier)'
must be unique: org.apache.beam:beam-runners-core-construction-java:jar -> duplicate declaration
of version (?) @ org.apache.beam:beam-runners-google-cloud-dataflow-java:[unknown-version],
<https://builds.apache.org/job/beam_PostCommit_Java_Version_Test/jdk=JDK%201.7%20(latest)/ws/runners/google-cloud-dataflow-java/pom.xml,>
line 360, column 19
2017-03-09\T\02:32:03.217 [WARNING] 
2017-03-09\T\02:32:03.218 [WARNING] It is highly recommended to fix these problems because
they threaten the stability of your build.
2017-03-09\T\02:32:03.218 [WARNING] 
2017-03-09\T\02:32:03.218 [WARNING] For this reason, future Maven versions might no longer
support building such malformed projects.
2017-03-09\T\02:32:03.218 [WARNING] 
2017-03-09\T\02:32:03.247 [ERROR] [ERROR] Could not find the selected project in the reactor:
sdks/python @ 
2017-03-09\T\02:32:03.248 [ERROR] Could not find the selected project in the reactor: sdks/python
-> [Help 1]
org.apache.maven.MavenExecutionException: Could not find the selected project in the reactor:
sdks/python
	at org.apache.maven.graph.DefaultGraphBuilder.trimExcludedProjects(DefaultGraphBuilder.java:273)
	at org.apache.maven.graph.DefaultGraphBuilder.dependencyGraph(DefaultGraphBuilder.java:116)
	at org.apache.maven.graph.DefaultGraphBuilder.build(DefaultGraphBuilder.java:92)
	at org.apache.maven.DefaultMaven.buildGraph(DefaultMaven.java:491)
	at org.apache.maven.DefaultMaven.doExecute(DefaultMaven.java:219)
	at org.apache.maven.DefaultMaven.doExecute(DefaultMaven.java:193)
	at org.apache.maven.DefaultMaven.execute(DefaultMaven.java:106)
	at org.apache.maven.cli.MavenCli.execute(MavenCli.java:862)
	at org.apache.maven.cli.MavenCli.doMain(MavenCli.java:286)
	at org.apache.maven.cli.MavenCli.main(MavenCli.java:197)
	at sun.reflect.NativeMethodAccessorImpl.invoke0(Native Method)
	at sun.reflect.NativeMethodAccessorImpl.invoke(NativeMethodAccessorImpl.java:57)
	at sun.reflect.DelegatingMethodAccessorImpl.invoke(DelegatingMethodAccessorImpl.java:43)
	at java.lang.reflect.Method.invoke(Method.java:606)
	at org.codehaus.plexus.classworlds.launcher.Launcher.launchEnhanced(Launcher.java:289)
	at org.codehaus.plexus.classworlds.launcher.Launcher.launch(Launcher.java:229)
	at org.codehaus.plexus.classworlds.launcher.Launcher.mainWithExitCode(Launcher.java:415)
	at org.codehaus.plexus.classworlds.launcher.Launcher.main(Launcher.java:356)
2017-03-09\T\02:32:03.249 [ERROR] 
2017-03-09\T\02:32:03.249 [ERROR] Re-run Maven using the -X switch to enable full debug logging.
2017-03-09\T\02:32:03.249 [ERROR] 
2017-03-09\T\02:32:03.249 [ERROR] For more information about the errors and possible solutions,
please read the following articles:
2017-03-09\T\02:32:03.249 [ERROR] [Help 1] http://cwiki.apache.org/confluence/display/MAVEN/MavenExecutionException
Build step 'Invoke top-level Maven targets' marked build as failure

Mime
View raw message