beam-commits mailing list archives

Site index · List index
Message view « Date » · « Thread »
Top « Date » · « Thread »
From Apache Jenkins Server <jenk...@builds.apache.org>
Subject Build failed in Jenkins: beam_PostCommit_Python_Verify #1546
Date Sat, 18 Mar 2017 21:20:38 GMT
See <https://builds.apache.org/job/beam_PostCommit_Python_Verify/1546/display/redirect>

------------------------------------------
[...truncated 423.08 KB...]
root: INFO: Completed GCS upload to gs://temp-storage-for-end-to-end-tests/staging-validatesrunner-test/beamapp-jenkins-0318210550-037025.1489871150.037199/setuptools-34.3.0.zip
root: INFO: Starting GCS upload to gs://temp-storage-for-end-to-end-tests/staging-validatesrunner-test/beamapp-jenkins-0318210550-037025.1489871150.037199/appdirs-1.4.0.tar.gz...
root: INFO: Completed GCS upload to gs://temp-storage-for-end-to-end-tests/staging-validatesrunner-test/beamapp-jenkins-0318210550-037025.1489871150.037199/appdirs-1.4.0.tar.gz
root: INFO: Starting GCS upload to gs://temp-storage-for-end-to-end-tests/staging-validatesrunner-test/beamapp-jenkins-0318210550-037025.1489871150.037199/abc.txt...
root: INFO: Completed GCS upload to gs://temp-storage-for-end-to-end-tests/staging-validatesrunner-test/beamapp-jenkins-0318210550-037025.1489871150.037199/abc.txt
root: INFO: Starting GCS upload to gs://temp-storage-for-end-to-end-tests/staging-validatesrunner-test/beamapp-jenkins-0318210550-037025.1489871150.037199/appdirs-1.4.1.tar.gz...
root: INFO: Completed GCS upload to gs://temp-storage-for-end-to-end-tests/staging-validatesrunner-test/beamapp-jenkins-0318210550-037025.1489871150.037199/appdirs-1.4.1.tar.gz
root: INFO: Starting GCS upload to gs://temp-storage-for-end-to-end-tests/staging-validatesrunner-test/beamapp-jenkins-0318210550-037025.1489871150.037199/setuptools-34.0.3.zip...
root: INFO: Completed GCS upload to gs://temp-storage-for-end-to-end-tests/staging-validatesrunner-test/beamapp-jenkins-0318210550-037025.1489871150.037199/setuptools-34.0.3.zip
root: INFO: Starting GCS upload to gs://temp-storage-for-end-to-end-tests/staging-validatesrunner-test/beamapp-jenkins-0318210550-037025.1489871150.037199/appdirs-1.4.2.tar.gz...
root: INFO: Completed GCS upload to gs://temp-storage-for-end-to-end-tests/staging-validatesrunner-test/beamapp-jenkins-0318210550-037025.1489871150.037199/appdirs-1.4.2.tar.gz
root: INFO: Starting GCS upload to gs://temp-storage-for-end-to-end-tests/staging-validatesrunner-test/beamapp-jenkins-0318210550-037025.1489871150.037199/appdirs-1.4.3.tar.gz...
root: INFO: Completed GCS upload to gs://temp-storage-for-end-to-end-tests/staging-validatesrunner-test/beamapp-jenkins-0318210550-037025.1489871150.037199/appdirs-1.4.3.tar.gz
root: INFO: Starting GCS upload to gs://temp-storage-for-end-to-end-tests/staging-validatesrunner-test/beamapp-jenkins-0318210550-037025.1489871150.037199/six-1.10.0.tar.gz...
root: INFO: Completed GCS upload to gs://temp-storage-for-end-to-end-tests/staging-validatesrunner-test/beamapp-jenkins-0318210550-037025.1489871150.037199/six-1.10.0.tar.gz
root: INFO: Starting GCS upload to gs://temp-storage-for-end-to-end-tests/staging-validatesrunner-test/beamapp-jenkins-0318210550-037025.1489871150.037199/pyparsing-2.2.0.tar.gz...
root: INFO: Completed GCS upload to gs://temp-storage-for-end-to-end-tests/staging-validatesrunner-test/beamapp-jenkins-0318210550-037025.1489871150.037199/pyparsing-2.2.0.tar.gz
root: INFO: Starting GCS upload to gs://temp-storage-for-end-to-end-tests/staging-validatesrunner-test/beamapp-jenkins-0318210550-037025.1489871150.037199/setuptools-34.1.0.zip...
root: INFO: Completed GCS upload to gs://temp-storage-for-end-to-end-tests/staging-validatesrunner-test/beamapp-jenkins-0318210550-037025.1489871150.037199/setuptools-34.1.0.zip
root: INFO: Starting GCS upload to gs://temp-storage-for-end-to-end-tests/staging-validatesrunner-test/beamapp-jenkins-0318210550-037025.1489871150.037199/setuptools-34.2.0.zip...
root: INFO: Completed GCS upload to gs://temp-storage-for-end-to-end-tests/staging-validatesrunner-test/beamapp-jenkins-0318210550-037025.1489871150.037199/setuptools-34.2.0.zip
root: INFO: Starting GCS upload to gs://temp-storage-for-end-to-end-tests/staging-validatesrunner-test/beamapp-jenkins-0318210550-037025.1489871150.037199/pbr-2.0.0.tar.gz...
root: INFO: Completed GCS upload to gs://temp-storage-for-end-to-end-tests/staging-validatesrunner-test/beamapp-jenkins-0318210550-037025.1489871150.037199/pbr-2.0.0.tar.gz
root: INFO: Starting GCS upload to gs://temp-storage-for-end-to-end-tests/staging-validatesrunner-test/beamapp-jenkins-0318210550-037025.1489871150.037199/packaging-16.8.tar.gz...
root: INFO: Completed GCS upload to gs://temp-storage-for-end-to-end-tests/staging-validatesrunner-test/beamapp-jenkins-0318210550-037025.1489871150.037199/packaging-16.8.tar.gz
root: INFO: Starting GCS upload to gs://temp-storage-for-end-to-end-tests/staging-validatesrunner-test/beamapp-jenkins-0318210550-037025.1489871150.037199/mock-2.0.0.tar.gz...
root: INFO: Completed GCS upload to gs://temp-storage-for-end-to-end-tests/staging-validatesrunner-test/beamapp-jenkins-0318210550-037025.1489871150.037199/mock-2.0.0.tar.gz
root: INFO: Starting GCS upload to gs://temp-storage-for-end-to-end-tests/staging-validatesrunner-test/beamapp-jenkins-0318210550-037025.1489871150.037199/funcsigs-1.0.2.tar.gz...
root: INFO: Completed GCS upload to gs://temp-storage-for-end-to-end-tests/staging-validatesrunner-test/beamapp-jenkins-0318210550-037025.1489871150.037199/funcsigs-1.0.2.tar.gz
root: INFO: Starting GCS upload to gs://temp-storage-for-end-to-end-tests/staging-validatesrunner-test/beamapp-jenkins-0318210550-037025.1489871150.037199/PyHamcrest-1.9.0.tar.gz...
root: INFO: Completed GCS upload to gs://temp-storage-for-end-to-end-tests/staging-validatesrunner-test/beamapp-jenkins-0318210550-037025.1489871150.037199/PyHamcrest-1.9.0.tar.gz
root: INFO: Starting GCS upload to gs://temp-storage-for-end-to-end-tests/staging-validatesrunner-test/beamapp-jenkins-0318210550-037025.1489871150.037199/pbr-1.10.0.tar.gz...
root: INFO: Completed GCS upload to gs://temp-storage-for-end-to-end-tests/staging-validatesrunner-test/beamapp-jenkins-0318210550-037025.1489871150.037199/pbr-1.10.0.tar.gz
root: INFO: Starting GCS upload to gs://temp-storage-for-end-to-end-tests/staging-validatesrunner-test/beamapp-jenkins-0318210550-037025.1489871150.037199/setuptools-34.3.1.zip...
root: INFO: Completed GCS upload to gs://temp-storage-for-end-to-end-tests/staging-validatesrunner-test/beamapp-jenkins-0318210550-037025.1489871150.037199/setuptools-34.3.1.zip
root: INFO: Starting GCS upload to gs://temp-storage-for-end-to-end-tests/staging-validatesrunner-test/beamapp-jenkins-0318210550-037025.1489871150.037199/setuptools-34.3.2.zip...
root: INFO: Completed GCS upload to gs://temp-storage-for-end-to-end-tests/staging-validatesrunner-test/beamapp-jenkins-0318210550-037025.1489871150.037199/setuptools-34.3.2.zip
root: INFO: Starting GCS upload to gs://temp-storage-for-end-to-end-tests/staging-validatesrunner-test/beamapp-jenkins-0318210550-037025.1489871150.037199/setuptools-34.1.1.zip...
root: INFO: Completed GCS upload to gs://temp-storage-for-end-to-end-tests/staging-validatesrunner-test/beamapp-jenkins-0318210550-037025.1489871150.037199/setuptools-34.1.1.zip
root: INFO: Starting GCS upload to gs://temp-storage-for-end-to-end-tests/staging-validatesrunner-test/beamapp-jenkins-0318210550-037025.1489871150.037199/pyparsing-2.1.10.zip...
root: INFO: Completed GCS upload to gs://temp-storage-for-end-to-end-tests/staging-validatesrunner-test/beamapp-jenkins-0318210550-037025.1489871150.037199/pyparsing-2.1.10.zip
root: INFO: Starting GCS upload to gs://temp-storage-for-end-to-end-tests/staging-validatesrunner-test/beamapp-jenkins-0318210550-037025.1489871150.037199/setuptools-34.0.2.zip...
root: INFO: Completed GCS upload to gs://temp-storage-for-end-to-end-tests/staging-validatesrunner-test/beamapp-jenkins-0318210550-037025.1489871150.037199/setuptools-34.0.2.zip
root: INFO: Copying Beam SDK "dist/apache-beam-0.7.0.dev0.tar.gz" to staging location.
root: INFO: Starting GCS upload to gs://temp-storage-for-end-to-end-tests/staging-validatesrunner-test/beamapp-jenkins-0318210550-037025.1489871150.037199/dataflow_python_sdk.tar...
root: INFO: Completed GCS upload to gs://temp-storage-for-end-to-end-tests/staging-validatesrunner-test/beamapp-jenkins-0318210550-037025.1489871150.037199/dataflow_python_sdk.tar
--------------------- >> end captured logging << ---------------------

======================================================================
ERROR: test_empty_side_outputs (apache_beam.transforms.ptransform_test.PTransformTest)
----------------------------------------------------------------------
Traceback (most recent call last):
  File "<https://builds.apache.org/job/beam_PostCommit_Python_Verify/ws/sdks/python/apache_beam/transforms/ptransform_test.py",>
line 233, in test_empty_side_outputs
    pipeline.run()
  File "<https://builds.apache.org/job/beam_PostCommit_Python_Verify/ws/sdks/python/apache_beam/test_pipeline.py",>
line 91, in run
    result = super(TestPipeline, self).run()
  File "<https://builds.apache.org/job/beam_PostCommit_Python_Verify/ws/sdks/python/apache_beam/pipeline.py",>
line 163, in run
    return self.runner.run(self)
  File "<https://builds.apache.org/job/beam_PostCommit_Python_Verify/ws/sdks/python/apache_beam/runners/dataflow/test_dataflow_runner.py",>
line 32, in run
    self.result = super(TestDataflowRunner, self).run(pipeline)
  File "<https://builds.apache.org/job/beam_PostCommit_Python_Verify/ws/sdks/python/apache_beam/runners/dataflow/dataflow_runner.py",>
line 175, in run
    self.dataflow_client.create_job(self.job), self)
  File "<https://builds.apache.org/job/beam_PostCommit_Python_Verify/ws/sdks/python/apache_beam/utils/retry.py",>
line 174, in wrapper
    return fun(*args, **kwargs)
  File "<https://builds.apache.org/job/beam_PostCommit_Python_Verify/ws/sdks/python/apache_beam/runners/dataflow/internal/apiclient.py",>
line 411, in create_job
    self.create_job_description(job)
  File "<https://builds.apache.org/job/beam_PostCommit_Python_Verify/ws/sdks/python/apache_beam/runners/dataflow/internal/apiclient.py",>
line 432, in create_job_description
    job.options, file_copy=self._gcs_file_copy)
  File "<https://builds.apache.org/job/beam_PostCommit_Python_Verify/ws/sdks/python/apache_beam/runners/dataflow/internal/dependency.py",>
line 395, in stage_job_resources
    shutil.rmtree(temp_dir)
  File "/usr/lib/python2.7/shutil.py", line 239, in rmtree
    onerror(os.listdir, path, sys.exc_info())
  File "/usr/lib/python2.7/shutil.py", line 237, in rmtree
    names = os.listdir(path)
OSError: [Errno 2] No such file or directory: '/tmp/tmpgkktFJ'
-------------------- >> begin captured logging << --------------------
root: DEBUG: PValue computed by Some Numbers (tag 1): refcount: 1 => 0
root: DEBUG: PValue computed by ClassifyNumbers/FlatMap(<lambda at ptransform_test.py:227>)
(tag 1): refcount: 1 => 0
root: DEBUG: PValue computed by assert_that/WindowInto(WindowIntoFn) (tag 1): refcount: 1
=> 0
root: DEBUG: PValue computed by assert_that/ToVoidKey (tag 1): refcount: 1 => 0
root: DEBUG: PValue computed by assert_that/Group (tag 1): refcount: 1 => 0
root: DEBUG: PValue computed by assert_that/UnKey (tag 1): refcount: 1 => 0
root: DEBUG: PValue computed by ClassifyNumbers/FlatMap(<lambda at ptransform_test.py:227>)
(tag 1): refcount: 1 => 0
root: DEBUG: PValue computed by assert:odd/WindowInto(WindowIntoFn) (tag 1): refcount: 1 =>
0
root: DEBUG: PValue computed by assert:odd/ToVoidKey (tag 1): refcount: 1 => 0
root: DEBUG: PValue computed by assert:odd/Group (tag 1): refcount: 1 => 0
root: DEBUG: PValue computed by assert:odd/UnKey (tag 1): refcount: 1 => 0
root: DEBUG: PValue computed by ClassifyNumbers/FlatMap(<lambda at ptransform_test.py:227>)
(tag 1): refcount: 1 => 0
root: DEBUG: PValue computed by assert:even/WindowInto(WindowIntoFn) (tag 1): refcount: 1
=> 0
root: DEBUG: PValue computed by assert:even/ToVoidKey (tag 1): refcount: 1 => 0
root: DEBUG: PValue computed by assert:even/Group (tag 1): refcount: 1 => 0
root: DEBUG: PValue computed by assert:even/UnKey (tag 1): refcount: 1 => 0
root: INFO: Starting GCS upload to gs://temp-storage-for-end-to-end-tests/staging-validatesrunner-test/beamapp-jenkins-0318210549-952836.1489871149.953023/requirements.txt...
root: INFO: Completed GCS upload to gs://temp-storage-for-end-to-end-tests/staging-validatesrunner-test/beamapp-jenkins-0318210549-952836.1489871149.953023/requirements.txt
root: INFO: Executing command: ['<https://builds.apache.org/job/beam_PostCommit_Python_Verify/ws/sdks/python/bin/python',>
'-m', 'pip', 'install', '--download', '/tmp/dataflow-requirements-cache', '-r', 'postcommit_requirements.txt',
'--no-binary', ':all:']
root: INFO: Starting GCS upload to gs://temp-storage-for-end-to-end-tests/staging-validatesrunner-test/beamapp-jenkins-0318210549-952836.1489871149.953023/def.txt...
root: INFO: Completed GCS upload to gs://temp-storage-for-end-to-end-tests/staging-validatesrunner-test/beamapp-jenkins-0318210549-952836.1489871149.953023/def.txt
root: INFO: Starting GCS upload to gs://temp-storage-for-end-to-end-tests/staging-validatesrunner-test/beamapp-jenkins-0318210549-952836.1489871149.953023/setuptools-34.3.0.zip...
root: INFO: Completed GCS upload to gs://temp-storage-for-end-to-end-tests/staging-validatesrunner-test/beamapp-jenkins-0318210549-952836.1489871149.953023/setuptools-34.3.0.zip
root: INFO: Starting GCS upload to gs://temp-storage-for-end-to-end-tests/staging-validatesrunner-test/beamapp-jenkins-0318210549-952836.1489871149.953023/appdirs-1.4.0.tar.gz...
root: INFO: Completed GCS upload to gs://temp-storage-for-end-to-end-tests/staging-validatesrunner-test/beamapp-jenkins-0318210549-952836.1489871149.953023/appdirs-1.4.0.tar.gz
root: INFO: Starting GCS upload to gs://temp-storage-for-end-to-end-tests/staging-validatesrunner-test/beamapp-jenkins-0318210549-952836.1489871149.953023/abc.txt...
root: INFO: Completed GCS upload to gs://temp-storage-for-end-to-end-tests/staging-validatesrunner-test/beamapp-jenkins-0318210549-952836.1489871149.953023/abc.txt
root: INFO: Starting GCS upload to gs://temp-storage-for-end-to-end-tests/staging-validatesrunner-test/beamapp-jenkins-0318210549-952836.1489871149.953023/appdirs-1.4.1.tar.gz...
root: INFO: Completed GCS upload to gs://temp-storage-for-end-to-end-tests/staging-validatesrunner-test/beamapp-jenkins-0318210549-952836.1489871149.953023/appdirs-1.4.1.tar.gz
root: INFO: Starting GCS upload to gs://temp-storage-for-end-to-end-tests/staging-validatesrunner-test/beamapp-jenkins-0318210549-952836.1489871149.953023/setuptools-34.0.3.zip...
root: INFO: Completed GCS upload to gs://temp-storage-for-end-to-end-tests/staging-validatesrunner-test/beamapp-jenkins-0318210549-952836.1489871149.953023/setuptools-34.0.3.zip
root: INFO: Starting GCS upload to gs://temp-storage-for-end-to-end-tests/staging-validatesrunner-test/beamapp-jenkins-0318210549-952836.1489871149.953023/appdirs-1.4.2.tar.gz...
root: INFO: Completed GCS upload to gs://temp-storage-for-end-to-end-tests/staging-validatesrunner-test/beamapp-jenkins-0318210549-952836.1489871149.953023/appdirs-1.4.2.tar.gz
root: INFO: Starting GCS upload to gs://temp-storage-for-end-to-end-tests/staging-validatesrunner-test/beamapp-jenkins-0318210549-952836.1489871149.953023/appdirs-1.4.3.tar.gz...
root: INFO: Completed GCS upload to gs://temp-storage-for-end-to-end-tests/staging-validatesrunner-test/beamapp-jenkins-0318210549-952836.1489871149.953023/appdirs-1.4.3.tar.gz
root: INFO: Starting GCS upload to gs://temp-storage-for-end-to-end-tests/staging-validatesrunner-test/beamapp-jenkins-0318210549-952836.1489871149.953023/six-1.10.0.tar.gz...
root: INFO: Completed GCS upload to gs://temp-storage-for-end-to-end-tests/staging-validatesrunner-test/beamapp-jenkins-0318210549-952836.1489871149.953023/six-1.10.0.tar.gz
root: INFO: Starting GCS upload to gs://temp-storage-for-end-to-end-tests/staging-validatesrunner-test/beamapp-jenkins-0318210549-952836.1489871149.953023/pyparsing-2.2.0.tar.gz...
root: INFO: Completed GCS upload to gs://temp-storage-for-end-to-end-tests/staging-validatesrunner-test/beamapp-jenkins-0318210549-952836.1489871149.953023/pyparsing-2.2.0.tar.gz
root: INFO: Starting GCS upload to gs://temp-storage-for-end-to-end-tests/staging-validatesrunner-test/beamapp-jenkins-0318210549-952836.1489871149.953023/setuptools-34.1.0.zip...
root: INFO: Completed GCS upload to gs://temp-storage-for-end-to-end-tests/staging-validatesrunner-test/beamapp-jenkins-0318210549-952836.1489871149.953023/setuptools-34.1.0.zip
root: INFO: Starting GCS upload to gs://temp-storage-for-end-to-end-tests/staging-validatesrunner-test/beamapp-jenkins-0318210549-952836.1489871149.953023/setuptools-34.2.0.zip...
root: INFO: Completed GCS upload to gs://temp-storage-for-end-to-end-tests/staging-validatesrunner-test/beamapp-jenkins-0318210549-952836.1489871149.953023/setuptools-34.2.0.zip
root: INFO: Starting GCS upload to gs://temp-storage-for-end-to-end-tests/staging-validatesrunner-test/beamapp-jenkins-0318210549-952836.1489871149.953023/pbr-2.0.0.tar.gz...
root: INFO: Completed GCS upload to gs://temp-storage-for-end-to-end-tests/staging-validatesrunner-test/beamapp-jenkins-0318210549-952836.1489871149.953023/pbr-2.0.0.tar.gz
root: INFO: Starting GCS upload to gs://temp-storage-for-end-to-end-tests/staging-validatesrunner-test/beamapp-jenkins-0318210549-952836.1489871149.953023/packaging-16.8.tar.gz...
root: INFO: Completed GCS upload to gs://temp-storage-for-end-to-end-tests/staging-validatesrunner-test/beamapp-jenkins-0318210549-952836.1489871149.953023/packaging-16.8.tar.gz
root: INFO: Starting GCS upload to gs://temp-storage-for-end-to-end-tests/staging-validatesrunner-test/beamapp-jenkins-0318210549-952836.1489871149.953023/mock-2.0.0.tar.gz...
root: INFO: Completed GCS upload to gs://temp-storage-for-end-to-end-tests/staging-validatesrunner-test/beamapp-jenkins-0318210549-952836.1489871149.953023/mock-2.0.0.tar.gz
root: INFO: Starting GCS upload to gs://temp-storage-for-end-to-end-tests/staging-validatesrunner-test/beamapp-jenkins-0318210549-952836.1489871149.953023/funcsigs-1.0.2.tar.gz...
root: INFO: Completed GCS upload to gs://temp-storage-for-end-to-end-tests/staging-validatesrunner-test/beamapp-jenkins-0318210549-952836.1489871149.953023/funcsigs-1.0.2.tar.gz
root: INFO: Starting GCS upload to gs://temp-storage-for-end-to-end-tests/staging-validatesrunner-test/beamapp-jenkins-0318210549-952836.1489871149.953023/PyHamcrest-1.9.0.tar.gz...
root: INFO: Completed GCS upload to gs://temp-storage-for-end-to-end-tests/staging-validatesrunner-test/beamapp-jenkins-0318210549-952836.1489871149.953023/PyHamcrest-1.9.0.tar.gz
root: INFO: Starting GCS upload to gs://temp-storage-for-end-to-end-tests/staging-validatesrunner-test/beamapp-jenkins-0318210549-952836.1489871149.953023/pbr-1.10.0.tar.gz...
root: INFO: Completed GCS upload to gs://temp-storage-for-end-to-end-tests/staging-validatesrunner-test/beamapp-jenkins-0318210549-952836.1489871149.953023/pbr-1.10.0.tar.gz
root: INFO: Starting GCS upload to gs://temp-storage-for-end-to-end-tests/staging-validatesrunner-test/beamapp-jenkins-0318210549-952836.1489871149.953023/setuptools-34.3.1.zip...
root: INFO: Completed GCS upload to gs://temp-storage-for-end-to-end-tests/staging-validatesrunner-test/beamapp-jenkins-0318210549-952836.1489871149.953023/setuptools-34.3.1.zip
root: INFO: Starting GCS upload to gs://temp-storage-for-end-to-end-tests/staging-validatesrunner-test/beamapp-jenkins-0318210549-952836.1489871149.953023/setuptools-34.3.2.zip...
root: INFO: Completed GCS upload to gs://temp-storage-for-end-to-end-tests/staging-validatesrunner-test/beamapp-jenkins-0318210549-952836.1489871149.953023/setuptools-34.3.2.zip
root: INFO: Starting GCS upload to gs://temp-storage-for-end-to-end-tests/staging-validatesrunner-test/beamapp-jenkins-0318210549-952836.1489871149.953023/setuptools-34.1.1.zip...
root: INFO: Completed GCS upload to gs://temp-storage-for-end-to-end-tests/staging-validatesrunner-test/beamapp-jenkins-0318210549-952836.1489871149.953023/setuptools-34.1.1.zip
root: INFO: Starting GCS upload to gs://temp-storage-for-end-to-end-tests/staging-validatesrunner-test/beamapp-jenkins-0318210549-952836.1489871149.953023/pyparsing-2.1.10.zip...
root: INFO: Completed GCS upload to gs://temp-storage-for-end-to-end-tests/staging-validatesrunner-test/beamapp-jenkins-0318210549-952836.1489871149.953023/pyparsing-2.1.10.zip
root: INFO: Starting GCS upload to gs://temp-storage-for-end-to-end-tests/staging-validatesrunner-test/beamapp-jenkins-0318210549-952836.1489871149.953023/setuptools-34.0.2.zip...
root: INFO: Completed GCS upload to gs://temp-storage-for-end-to-end-tests/staging-validatesrunner-test/beamapp-jenkins-0318210549-952836.1489871149.953023/setuptools-34.0.2.zip
root: INFO: Copying Beam SDK "dist/apache-beam-0.7.0.dev0.tar.gz" to staging location.
root: INFO: Starting GCS upload to gs://temp-storage-for-end-to-end-tests/staging-validatesrunner-test/beamapp-jenkins-0318210549-952836.1489871149.953023/dataflow_python_sdk.tar...
root: INFO: Completed GCS upload to gs://temp-storage-for-end-to-end-tests/staging-validatesrunner-test/beamapp-jenkins-0318210549-952836.1489871149.953023/dataflow_python_sdk.tar
--------------------- >> end captured logging << ---------------------

======================================================================
ERROR: test_par_do_with_multiple_outputs_and_using_return (apache_beam.transforms.ptransform_test.PTransformTest)
----------------------------------------------------------------------
Traceback (most recent call last):
  File "<https://builds.apache.org/job/beam_PostCommit_Python_Verify/ws/sdks/python/apache_beam/transforms/ptransform_test.py",>
line 207, in test_par_do_with_multiple_outputs_and_using_return
    pipeline.run()
  File "<https://builds.apache.org/job/beam_PostCommit_Python_Verify/ws/sdks/python/apache_beam/test_pipeline.py",>
line 91, in run
    result = super(TestPipeline, self).run()
  File "<https://builds.apache.org/job/beam_PostCommit_Python_Verify/ws/sdks/python/apache_beam/pipeline.py",>
line 163, in run
    return self.runner.run(self)
  File "<https://builds.apache.org/job/beam_PostCommit_Python_Verify/ws/sdks/python/apache_beam/runners/dataflow/test_dataflow_runner.py",>
line 32, in run
    self.result = super(TestDataflowRunner, self).run(pipeline)
  File "<https://builds.apache.org/job/beam_PostCommit_Python_Verify/ws/sdks/python/apache_beam/runners/dataflow/dataflow_runner.py",>
line 175, in run
    self.dataflow_client.create_job(self.job), self)
  File "<https://builds.apache.org/job/beam_PostCommit_Python_Verify/ws/sdks/python/apache_beam/utils/retry.py",>
line 174, in wrapper
    return fun(*args, **kwargs)
  File "<https://builds.apache.org/job/beam_PostCommit_Python_Verify/ws/sdks/python/apache_beam/runners/dataflow/internal/apiclient.py",>
line 411, in create_job
    self.create_job_description(job)
  File "<https://builds.apache.org/job/beam_PostCommit_Python_Verify/ws/sdks/python/apache_beam/runners/dataflow/internal/apiclient.py",>
line 432, in create_job_description
    job.options, file_copy=self._gcs_file_copy)
  File "<https://builds.apache.org/job/beam_PostCommit_Python_Verify/ws/sdks/python/apache_beam/runners/dataflow/internal/dependency.py",>
line 395, in stage_job_resources
    shutil.rmtree(temp_dir)
  File "/usr/lib/python2.7/shutil.py", line 239, in rmtree
    onerror(os.listdir, path, sys.exc_info())
  File "/usr/lib/python2.7/shutil.py", line 237, in rmtree
    names = os.listdir(path)
OSError: [Errno 2] No such file or directory: '/tmp/tmp_ph3XQ'
-------------------- >> begin captured logging << --------------------
root: DEBUG: PValue computed by Some Numbers (tag 1): refcount: 1 => 0
root: DEBUG: PValue computed by ClassifyNumbers/FlatMap(some_fn) (tag 1): refcount: 1 =>
0
root: DEBUG: PValue computed by assert_that/WindowInto(WindowIntoFn) (tag 1): refcount: 1
=> 0
root: DEBUG: PValue computed by assert_that/ToVoidKey (tag 1): refcount: 1 => 0
root: DEBUG: PValue computed by assert_that/Group (tag 1): refcount: 1 => 0
root: DEBUG: PValue computed by assert_that/UnKey (tag 1): refcount: 1 => 0
root: DEBUG: PValue computed by ClassifyNumbers/FlatMap(some_fn) (tag 1): refcount: 1 =>
0
root: DEBUG: PValue computed by assert:odd/WindowInto(WindowIntoFn) (tag 1): refcount: 1 =>
0
root: DEBUG: PValue computed by assert:odd/ToVoidKey (tag 1): refcount: 1 => 0
root: DEBUG: PValue computed by assert:odd/Group (tag 1): refcount: 1 => 0
root: DEBUG: PValue computed by assert:odd/UnKey (tag 1): refcount: 1 => 0
root: DEBUG: PValue computed by ClassifyNumbers/FlatMap(some_fn) (tag 1): refcount: 1 =>
0
root: DEBUG: PValue computed by assert:even/WindowInto(WindowIntoFn) (tag 1): refcount: 1
=> 0
root: DEBUG: PValue computed by assert:even/ToVoidKey (tag 1): refcount: 1 => 0
root: DEBUG: PValue computed by assert:even/Group (tag 1): refcount: 1 => 0
root: DEBUG: PValue computed by assert:even/UnKey (tag 1): refcount: 1 => 0
root: INFO: Starting GCS upload to gs://temp-storage-for-end-to-end-tests/staging-validatesrunner-test/beamapp-jenkins-0318210549-971976.1489871149.972192/requirements.txt...
root: INFO: Completed GCS upload to gs://temp-storage-for-end-to-end-tests/staging-validatesrunner-test/beamapp-jenkins-0318210549-971976.1489871149.972192/requirements.txt
root: INFO: Executing command: ['<https://builds.apache.org/job/beam_PostCommit_Python_Verify/ws/sdks/python/bin/python',>
'-m', 'pip', 'install', '--download', '/tmp/dataflow-requirements-cache', '-r', 'postcommit_requirements.txt',
'--no-binary', ':all:']
root: INFO: Starting GCS upload to gs://temp-storage-for-end-to-end-tests/staging-validatesrunner-test/beamapp-jenkins-0318210549-971976.1489871149.972192/def.txt...
root: INFO: Completed GCS upload to gs://temp-storage-for-end-to-end-tests/staging-validatesrunner-test/beamapp-jenkins-0318210549-971976.1489871149.972192/def.txt
root: INFO: Starting GCS upload to gs://temp-storage-for-end-to-end-tests/staging-validatesrunner-test/beamapp-jenkins-0318210549-971976.1489871149.972192/setuptools-34.3.0.zip...
root: INFO: Completed GCS upload to gs://temp-storage-for-end-to-end-tests/staging-validatesrunner-test/beamapp-jenkins-0318210549-971976.1489871149.972192/setuptools-34.3.0.zip
root: INFO: Starting GCS upload to gs://temp-storage-for-end-to-end-tests/staging-validatesrunner-test/beamapp-jenkins-0318210549-971976.1489871149.972192/appdirs-1.4.0.tar.gz...
root: INFO: Completed GCS upload to gs://temp-storage-for-end-to-end-tests/staging-validatesrunner-test/beamapp-jenkins-0318210549-971976.1489871149.972192/appdirs-1.4.0.tar.gz
root: INFO: Starting GCS upload to gs://temp-storage-for-end-to-end-tests/staging-validatesrunner-test/beamapp-jenkins-0318210549-971976.1489871149.972192/abc.txt...
root: INFO: Completed GCS upload to gs://temp-storage-for-end-to-end-tests/staging-validatesrunner-test/beamapp-jenkins-0318210549-971976.1489871149.972192/abc.txt
root: INFO: Starting GCS upload to gs://temp-storage-for-end-to-end-tests/staging-validatesrunner-test/beamapp-jenkins-0318210549-971976.1489871149.972192/appdirs-1.4.1.tar.gz...
root: INFO: Completed GCS upload to gs://temp-storage-for-end-to-end-tests/staging-validatesrunner-test/beamapp-jenkins-0318210549-971976.1489871149.972192/appdirs-1.4.1.tar.gz
root: INFO: Starting GCS upload to gs://temp-storage-for-end-to-end-tests/staging-validatesrunner-test/beamapp-jenkins-0318210549-971976.1489871149.972192/setuptools-34.0.3.zip...
root: INFO: Completed GCS upload to gs://temp-storage-for-end-to-end-tests/staging-validatesrunner-test/beamapp-jenkins-0318210549-971976.1489871149.972192/setuptools-34.0.3.zip
root: INFO: Starting GCS upload to gs://temp-storage-for-end-to-end-tests/staging-validatesrunner-test/beamapp-jenkins-0318210549-971976.1489871149.972192/appdirs-1.4.2.tar.gz...
root: INFO: Completed GCS upload to gs://temp-storage-for-end-to-end-tests/staging-validatesrunner-test/beamapp-jenkins-0318210549-971976.1489871149.972192/appdirs-1.4.2.tar.gz
root: INFO: Starting GCS upload to gs://temp-storage-for-end-to-end-tests/staging-validatesrunner-test/beamapp-jenkins-0318210549-971976.1489871149.972192/appdirs-1.4.3.tar.gz...
root: INFO: Completed GCS upload to gs://temp-storage-for-end-to-end-tests/staging-validatesrunner-test/beamapp-jenkins-0318210549-971976.1489871149.972192/appdirs-1.4.3.tar.gz
root: INFO: Starting GCS upload to gs://temp-storage-for-end-to-end-tests/staging-validatesrunner-test/beamapp-jenkins-0318210549-971976.1489871149.972192/six-1.10.0.tar.gz...
root: INFO: Completed GCS upload to gs://temp-storage-for-end-to-end-tests/staging-validatesrunner-test/beamapp-jenkins-0318210549-971976.1489871149.972192/six-1.10.0.tar.gz
root: INFO: Starting GCS upload to gs://temp-storage-for-end-to-end-tests/staging-validatesrunner-test/beamapp-jenkins-0318210549-971976.1489871149.972192/pyparsing-2.2.0.tar.gz...
root: INFO: Completed GCS upload to gs://temp-storage-for-end-to-end-tests/staging-validatesrunner-test/beamapp-jenkins-0318210549-971976.1489871149.972192/pyparsing-2.2.0.tar.gz
root: INFO: Starting GCS upload to gs://temp-storage-for-end-to-end-tests/staging-validatesrunner-test/beamapp-jenkins-0318210549-971976.1489871149.972192/setuptools-34.1.0.zip...
root: INFO: Completed GCS upload to gs://temp-storage-for-end-to-end-tests/staging-validatesrunner-test/beamapp-jenkins-0318210549-971976.1489871149.972192/setuptools-34.1.0.zip
root: INFO: Starting GCS upload to gs://temp-storage-for-end-to-end-tests/staging-validatesrunner-test/beamapp-jenkins-0318210549-971976.1489871149.972192/setuptools-34.2.0.zip...
root: INFO: Completed GCS upload to gs://temp-storage-for-end-to-end-tests/staging-validatesrunner-test/beamapp-jenkins-0318210549-971976.1489871149.972192/setuptools-34.2.0.zip
root: INFO: Starting GCS upload to gs://temp-storage-for-end-to-end-tests/staging-validatesrunner-test/beamapp-jenkins-0318210549-971976.1489871149.972192/pbr-2.0.0.tar.gz...
root: INFO: Completed GCS upload to gs://temp-storage-for-end-to-end-tests/staging-validatesrunner-test/beamapp-jenkins-0318210549-971976.1489871149.972192/pbr-2.0.0.tar.gz
root: INFO: Starting GCS upload to gs://temp-storage-for-end-to-end-tests/staging-validatesrunner-test/beamapp-jenkins-0318210549-971976.1489871149.972192/packaging-16.8.tar.gz...
root: INFO: Completed GCS upload to gs://temp-storage-for-end-to-end-tests/staging-validatesrunner-test/beamapp-jenkins-0318210549-971976.1489871149.972192/packaging-16.8.tar.gz
root: INFO: Starting GCS upload to gs://temp-storage-for-end-to-end-tests/staging-validatesrunner-test/beamapp-jenkins-0318210549-971976.1489871149.972192/mock-2.0.0.tar.gz...
root: INFO: Completed GCS upload to gs://temp-storage-for-end-to-end-tests/staging-validatesrunner-test/beamapp-jenkins-0318210549-971976.1489871149.972192/mock-2.0.0.tar.gz
root: INFO: Starting GCS upload to gs://temp-storage-for-end-to-end-tests/staging-validatesrunner-test/beamapp-jenkins-0318210549-971976.1489871149.972192/funcsigs-1.0.2.tar.gz...
root: INFO: Completed GCS upload to gs://temp-storage-for-end-to-end-tests/staging-validatesrunner-test/beamapp-jenkins-0318210549-971976.1489871149.972192/funcsigs-1.0.2.tar.gz
root: INFO: Starting GCS upload to gs://temp-storage-for-end-to-end-tests/staging-validatesrunner-test/beamapp-jenkins-0318210549-971976.1489871149.972192/PyHamcrest-1.9.0.tar.gz...
root: INFO: Completed GCS upload to gs://temp-storage-for-end-to-end-tests/staging-validatesrunner-test/beamapp-jenkins-0318210549-971976.1489871149.972192/PyHamcrest-1.9.0.tar.gz
root: INFO: Starting GCS upload to gs://temp-storage-for-end-to-end-tests/staging-validatesrunner-test/beamapp-jenkins-0318210549-971976.1489871149.972192/pbr-1.10.0.tar.gz...
root: INFO: Completed GCS upload to gs://temp-storage-for-end-to-end-tests/staging-validatesrunner-test/beamapp-jenkins-0318210549-971976.1489871149.972192/pbr-1.10.0.tar.gz
root: INFO: Starting GCS upload to gs://temp-storage-for-end-to-end-tests/staging-validatesrunner-test/beamapp-jenkins-0318210549-971976.1489871149.972192/setuptools-34.3.1.zip...
root: INFO: Completed GCS upload to gs://temp-storage-for-end-to-end-tests/staging-validatesrunner-test/beamapp-jenkins-0318210549-971976.1489871149.972192/setuptools-34.3.1.zip
root: INFO: Starting GCS upload to gs://temp-storage-for-end-to-end-tests/staging-validatesrunner-test/beamapp-jenkins-0318210549-971976.1489871149.972192/setuptools-34.3.2.zip...
root: INFO: Completed GCS upload to gs://temp-storage-for-end-to-end-tests/staging-validatesrunner-test/beamapp-jenkins-0318210549-971976.1489871149.972192/setuptools-34.3.2.zip
root: INFO: Starting GCS upload to gs://temp-storage-for-end-to-end-tests/staging-validatesrunner-test/beamapp-jenkins-0318210549-971976.1489871149.972192/setuptools-34.1.1.zip...
root: INFO: Completed GCS upload to gs://temp-storage-for-end-to-end-tests/staging-validatesrunner-test/beamapp-jenkins-0318210549-971976.1489871149.972192/setuptools-34.1.1.zip
root: INFO: Starting GCS upload to gs://temp-storage-for-end-to-end-tests/staging-validatesrunner-test/beamapp-jenkins-0318210549-971976.1489871149.972192/pyparsing-2.1.10.zip...
root: INFO: Completed GCS upload to gs://temp-storage-for-end-to-end-tests/staging-validatesrunner-test/beamapp-jenkins-0318210549-971976.1489871149.972192/pyparsing-2.1.10.zip
root: INFO: Starting GCS upload to gs://temp-storage-for-end-to-end-tests/staging-validatesrunner-test/beamapp-jenkins-0318210549-971976.1489871149.972192/setuptools-34.0.2.zip...
root: INFO: Completed GCS upload to gs://temp-storage-for-end-to-end-tests/staging-validatesrunner-test/beamapp-jenkins-0318210549-971976.1489871149.972192/setuptools-34.0.2.zip
root: INFO: Copying Beam SDK "dist/apache-beam-0.7.0.dev0.tar.gz" to staging location.
root: INFO: Starting GCS upload to gs://temp-storage-for-end-to-end-tests/staging-validatesrunner-test/beamapp-jenkins-0318210549-971976.1489871149.972192/dataflow_python_sdk.tar...
root: INFO: Completed GCS upload to gs://temp-storage-for-end-to-end-tests/staging-validatesrunner-test/beamapp-jenkins-0318210549-971976.1489871149.972192/dataflow_python_sdk.tar
--------------------- >> end captured logging << ---------------------

----------------------------------------------------------------------
Ran 14 tests in 888.872s

FAILED (errors=4)
Build step 'Execute shell' marked build as failure

Mime
View raw message