beam-commits mailing list archives

Site index · List index
Message view « Date » · « Thread »
Top « Date » · « Thread »
From Apache Jenkins Server <jenk...@builds.apache.org>
Subject Build failed in Jenkins: beam_PostCommit_Java_Version_Test » JDK 1.7 (latest),linux #2
Date Thu, 09 Mar 2017 02:16:38 GMT
See <https://builds.apache.org/job/beam_PostCommit_Java_Version_Test/jdk=JDK%201.7%20(latest),label=linux/2/display/redirect>

------------------------------------------
Started by upstream project "beam_PostCommit_Java_Version_Test" build number 2
originally caused by:
 GitHub pull request #2204 of commit cd9ca662d596d87a09b4ca16cb97a457095fefb7, no merge conflicts.
[EnvInject] - Loading node environment variables.
Building remotely on beam2 (beam) in workspace <https://builds.apache.org/job/beam_PostCommit_Java_Version_Test/jdk=JDK%201.7%20(latest),label=linux/ws/>
 > git rev-parse --is-inside-work-tree # timeout=10
Fetching changes from the remote Git repository
 > git config remote.origin.url https://github.com/apache/beam.git # timeout=10
Fetching upstream changes from https://github.com/apache/beam.git
 > git --version # timeout=10
 > git fetch --tags --progress https://github.com/apache/beam.git +refs/heads/*:refs/remotes/origin/*
+refs/pull/*:refs/remotes/origin/pr/*
Checking out Revision 110b9592a6e081a6d9375a627b5b601a6aedf4ef (refs/remotes/origin/pr/2204/merge)
 > git config core.sparsecheckout # timeout=10
 > git checkout -f 110b9592a6e081a6d9375a627b5b601a6aedf4ef
 > git rev-list e88fe3a0e630bc60aef755a2519cfdf4e4dba7b2 # timeout=10
First time build. Skipping changelog.
Cleaning workspace
 > git rev-parse --verify HEAD # timeout=10
Resetting working tree
 > git reset --hard # timeout=10
 > git clean -fdx # timeout=10
[EnvInject] - Executing scripts and injecting environment variables after the SCM step.
[EnvInject] - Injecting as environment variables the properties content 
SPARK_LOCAL_IP=127.0.0.1

[EnvInject] - Variables injected successfully.
[linux] $ /home/jenkins/tools/maven/apache-maven-3.3.3/bin/mvn -f pom.xml -DghprbTriggerAuthorLogin=markflyhigh
-DghprbGhRepository=apache/beam -DghprbAuthorRepoGitUrl=https://github.com/markflyhigh/incubator-beam.git
"-DghprbTriggerAuthor=Mark Liu" -DghprbPullLink=https://github.com/apache/beam/pull/2204 -DghprbActualCommit=cd9ca662d596d87a09b4ca16cb97a457095fefb7
-DghprbPullAuthorLogin=markflyhigh -DghprbSourceBranch=jenkins_java_sdk_version_test -DghprbTriggerAuthorLoginMention=@markflyhigh
"-DghprbPullLongDescription=Be sure to do all of the following to help us incorporate your
contribution\r\nquickly and easily:\r\n\r\n - [x] Make sure the PR title is formatted like:\r\n
  `[BEAM-<Jira issue #>] Description of pull request`\r\n - [ ] Make sure tests pass
via `mvn clean verify`. (Even better, enable\r\n       Travis-CI on your fork and ensure the
whole test matrix passes).\r\n - [ ] Replace `<Jira issue #>` in the title with the
actual Jira issue\r\n       number, if there is one.\r\n - [ ] If this contribution is large,
please file an Apache\r\n       [Individual Contributor License Agreement](https://www.apache.org/licenses/icla.txt).\r\n\r\n---\r\n\r\nJava
JDK version tests in Jenkins." -DghprbTriggerAuthorEmail= "-DghprbPullTitle=This PR is only
for test purpose - Do not merge!" -DghprbActualCommitAuthorEmail=markliu@google.com -DghprbTargetBranch=master
-DghprbPullId=2204 -DghprbCredentialsId=56783412-83e6-4ab7-965c-3f8c3b9dd8f1 -DghprbPullAuthorEmail=
-Dlabel=linux -Dsha1=origin/pr/2204/merge "-Djdk=JDK 1.7 (latest)" -DghprbPullAuthorLoginMention=@markflyhigh
"-DghprbPullDescription=GitHub pull request #2204 of commit cd9ca662d596d87a09b4ca16cb97a457095fefb7,
no merge conflicts." "-DghprbActualCommitAuthor=Mark Liu" -DGIT_BRANCH=jenkins_java_sdk_version_test
"-DghprbCommentBody=Run Java Versions Test" "-Dmaven.repo.local=<https://builds.apache.org/job/beam_PostCommit_Java_Version_Test/jdk=JDK%201.7%20(latest),label=linux/ws/.repository">
-B -e -P release clean install -pl !sdks/python coveralls:report -DrepoToken=**** -B -e -P
release clean verify coveralls:report -pl examples/java -DrepoToken=**** -DskipITs=false -Dit.test=WordCountIT
'-DintegrationTestPipelineOptions=[ "--project=apache-beam-testing", "--tempRoot=gs://temp-storage-for-end-to-end-tests",
"--runner=org.apache.beam.runners.dataflow.testing.TestDataflowRunner"]'
/home/jenkins/tools/maven/apache-maven-3.3.3/bin/mvn: 200: local: 1.7: bad variable name
2017-03-09\T\02:16:30.321 [INFO] Error stacktraces are turned on.
2017-03-09\T\02:16:30.370 [INFO] Scanning for projects...
2017-03-09\T\02:16:31.015 [INFO] Downloading: https://repo.maven.apache.org/maven2/org/apache/apache/18/apache-18.pom
2017-03-09\T\02:16:31.445 [INFO] Downloaded: https://repo.maven.apache.org/maven2/org/apache/apache/18/apache-18.pom
(16 KB at 35.3 KB/sec)
2017-03-09\T\02:16:31.850 [INFO] Downloading: https://repo.maven.apache.org/maven2/kr/motd/maven/os-maven-plugin/1.4.0.Final/os-maven-plugin-1.4.0.Final.pom
2017-03-09\T\02:16:31.881 [INFO] Downloaded: https://repo.maven.apache.org/maven2/kr/motd/maven/os-maven-plugin/1.4.0.Final/os-maven-plugin-1.4.0.Final.pom
(7 KB at 188.9 KB/sec)
2017-03-09\T\02:16:31.886 [INFO] Downloading: https://repo.maven.apache.org/maven2/org/sonatype/oss/oss-parent/9/oss-parent-9.pom
2017-03-09\T\02:16:31.919 [INFO] Downloaded: https://repo.maven.apache.org/maven2/org/sonatype/oss/oss-parent/9/oss-parent-9.pom
(7 KB at 194.4 KB/sec)
2017-03-09\T\02:16:31.927 [INFO] Downloading: https://repo.maven.apache.org/maven2/org/apache/maven/maven-plugin-api/3.2.1/maven-plugin-api-3.2.1.pom
2017-03-09\T\02:16:31.956 [INFO] Downloaded: https://repo.maven.apache.org/maven2/org/apache/maven/maven-plugin-api/3.2.1/maven-plugin-api-3.2.1.pom
(4 KB at 113.9 KB/sec)
2017-03-09\T\02:16:31.958 [INFO] Downloading: https://repo.maven.apache.org/maven2/org/apache/maven/maven/3.2.1/maven-3.2.1.pom
2017-03-09\T\02:16:31.996 [INFO] Downloaded: https://repo.maven.apache.org/maven2/org/apache/maven/maven/3.2.1/maven-3.2.1.pom
(23 KB at 580.5 KB/sec)
2017-03-09\T\02:16:31.999 [INFO] Downloading: https://repo.maven.apache.org/maven2/org/apache/maven/maven-parent/23/maven-parent-23.pom
2017-03-09\T\02:16:32.039 [INFO] Downloaded: https://repo.maven.apache.org/maven2/org/apache/maven/maven-parent/23/maven-parent-23.pom
(32 KB at 795.6 KB/sec)
2017-03-09\T\02:16:32.042 [INFO] Downloading: https://repo.maven.apache.org/maven2/org/apache/apache/13/apache-13.pom
2017-03-09\T\02:16:32.073 [INFO] Downloaded: https://repo.maven.apache.org/maven2/org/apache/apache/13/apache-13.pom
(14 KB at 440.2 KB/sec)
2017-03-09\T\02:16:32.079 [INFO] Downloading: https://repo.maven.apache.org/maven2/org/apache/maven/maven-model/3.2.1/maven-model-3.2.1.pom
2017-03-09\T\02:16:32.108 [INFO] Downloaded: https://repo.maven.apache.org/maven2/org/apache/maven/maven-model/3.2.1/maven-model-3.2.1.pom
(5 KB at 139.4 KB/sec)
2017-03-09\T\02:16:32.112 [INFO] Downloading: https://repo.maven.apache.org/maven2/org/codehaus/plexus/plexus-utils/3.0.17/plexus-utils-3.0.17.pom
2017-03-09\T\02:16:32.141 [INFO] Downloaded: https://repo.maven.apache.org/maven2/org/codehaus/plexus/plexus-utils/3.0.17/plexus-utils-3.0.17.pom
(4 KB at 114.3 KB/sec)
2017-03-09\T\02:16:32.143 [INFO] Downloading: https://repo.maven.apache.org/maven2/org/codehaus/plexus/plexus/3.3.1/plexus-3.3.1.pom
2017-03-09\T\02:16:32.175 [INFO] Downloaded: https://repo.maven.apache.org/maven2/org/codehaus/plexus/plexus/3.3.1/plexus-3.3.1.pom
(20 KB at 644.1 KB/sec)
2017-03-09\T\02:16:32.177 [INFO] Downloading: https://repo.maven.apache.org/maven2/org/sonatype/spice/spice-parent/17/spice-parent-17.pom
2017-03-09\T\02:16:32.205 [INFO] Downloaded: https://repo.maven.apache.org/maven2/org/sonatype/spice/spice-parent/17/spice-parent-17.pom
(7 KB at 235.7 KB/sec)
2017-03-09\T\02:16:32.206 [INFO] Downloading: https://repo.maven.apache.org/maven2/org/sonatype/forge/forge-parent/10/forge-parent-10.pom
2017-03-09\T\02:16:32.240 [INFO] Downloaded: https://repo.maven.apache.org/maven2/org/sonatype/forge/forge-parent/10/forge-parent-10.pom
(14 KB at 389.5 KB/sec)
2017-03-09\T\02:16:32.243 [INFO] Downloading: https://repo.maven.apache.org/maven2/org/apache/maven/maven-artifact/3.2.1/maven-artifact-3.2.1.pom
2017-03-09\T\02:16:32.270 [INFO] Downloaded: https://repo.maven.apache.org/maven2/org/apache/maven/maven-artifact/3.2.1/maven-artifact-3.2.1.pom
(2 KB at 71.3 KB/sec)
2017-03-09\T\02:16:32.276 [INFO] Downloading: https://repo.maven.apache.org/maven2/org/eclipse/sisu/org.eclipse.sisu.plexus/0.0.0.M5/org.eclipse.sisu.plexus-0.0.0.M5.pom
2017-03-09\T\02:16:32.303 [INFO] Downloaded: https://repo.maven.apache.org/maven2/org/eclipse/sisu/org.eclipse.sisu.plexus/0.0.0.M5/org.eclipse.sisu.plexus-0.0.0.M5.pom
(5 KB at 174.7 KB/sec)
2017-03-09\T\02:16:32.305 [INFO] Downloading: https://repo.maven.apache.org/maven2/org/eclipse/sisu/sisu-plexus/0.0.0.M5/sisu-plexus-0.0.0.M5.pom
2017-03-09\T\02:16:32.337 [INFO] Downloaded: https://repo.maven.apache.org/maven2/org/eclipse/sisu/sisu-plexus/0.0.0.M5/sisu-plexus-0.0.0.M5.pom
(13 KB at 402.9 KB/sec)
2017-03-09\T\02:16:32.339 [INFO] Downloading: https://repo.maven.apache.org/maven2/org/sonatype/oss/oss-parent/7/oss-parent-7.pom
2017-03-09\T\02:16:32.366 [INFO] Downloaded: https://repo.maven.apache.org/maven2/org/sonatype/oss/oss-parent/7/oss-parent-7.pom
(5 KB at 174.5 KB/sec)
2017-03-09\T\02:16:32.369 [INFO] Downloading: https://repo.maven.apache.org/maven2/javax/enterprise/cdi-api/1.0/cdi-api-1.0.pom
2017-03-09\T\02:16:32.397 [INFO] Downloaded: https://repo.maven.apache.org/maven2/javax/enterprise/cdi-api/1.0/cdi-api-1.0.pom
(2 KB at 50.0 KB/sec)
2017-03-09\T\02:16:32.399 [INFO] Downloading: https://repo.maven.apache.org/maven2/org/jboss/weld/weld-api-parent/1.0/weld-api-parent-1.0.pom
2017-03-09\T\02:16:32.427 [INFO] Downloaded: https://repo.maven.apache.org/maven2/org/jboss/weld/weld-api-parent/1.0/weld-api-parent-1.0.pom
(3 KB at 82.1 KB/sec)
2017-03-09\T\02:16:32.428 [INFO] Downloading: https://repo.maven.apache.org/maven2/org/jboss/weld/weld-api-bom/1.0/weld-api-bom-1.0.pom
2017-03-09\T\02:16:32.460 [INFO] Downloaded: https://repo.maven.apache.org/maven2/org/jboss/weld/weld-api-bom/1.0/weld-api-bom-1.0.pom
(8 KB at 241.3 KB/sec)
2017-03-09\T\02:16:32.462 [INFO] Downloading: https://repo.maven.apache.org/maven2/org/jboss/weld/weld-parent/6/weld-parent-6.pom
2017-03-09\T\02:16:32.496 [INFO] Downloaded: https://repo.maven.apache.org/maven2/org/jboss/weld/weld-parent/6/weld-parent-6.pom
(21 KB at 594.3 KB/sec)
2017-03-09\T\02:16:32.500 [INFO] Downloading: https://repo.maven.apache.org/maven2/javax/annotation/jsr250-api/1.0/jsr250-api-1.0.pom
2017-03-09\T\02:16:32.528 [INFO] Downloaded: https://repo.maven.apache.org/maven2/javax/annotation/jsr250-api/1.0/jsr250-api-1.0.pom
(1023 B at 35.7 KB/sec)
2017-03-09\T\02:16:32.530 [INFO] Downloading: https://repo.maven.apache.org/maven2/javax/inject/javax.inject/1/javax.inject-1.pom
2017-03-09\T\02:16:32.557 [INFO] Downloaded: https://repo.maven.apache.org/maven2/javax/inject/javax.inject/1/javax.inject-1.pom
(612 B at 22.1 KB/sec)
2017-03-09\T\02:16:32.559 [INFO] Downloading: https://repo.maven.apache.org/maven2/com/google/guava/guava/10.0.1/guava-10.0.1.pom
2017-03-09\T\02:16:32.587 [INFO] Downloaded: https://repo.maven.apache.org/maven2/com/google/guava/guava/10.0.1/guava-10.0.1.pom
(6 KB at 187.8 KB/sec)
2017-03-09\T\02:16:32.589 [INFO] Downloading: https://repo.maven.apache.org/maven2/com/google/guava/guava-parent/10.0.1/guava-parent-10.0.1.pom
2017-03-09\T\02:16:32.616 [INFO] Downloaded: https://repo.maven.apache.org/maven2/com/google/guava/guava-parent/10.0.1/guava-parent-10.0.1.pom
(2 KB at 70.9 KB/sec)
2017-03-09\T\02:16:32.619 [INFO] Downloading: https://repo.maven.apache.org/maven2/com/google/code/findbugs/jsr305/1.3.9/jsr305-1.3.9.pom
2017-03-09\T\02:16:32.647 [INFO] Downloaded: https://repo.maven.apache.org/maven2/com/google/code/findbugs/jsr305/1.3.9/jsr305-1.3.9.pom
(965 B at 34.9 KB/sec)
2017-03-09\T\02:16:32.649 [INFO] Downloading: https://repo.maven.apache.org/maven2/org/sonatype/sisu/sisu-guice/3.1.0/sisu-guice-3.1.0.pom
2017-03-09\T\02:16:32.679 [INFO] Downloaded: https://repo.maven.apache.org/maven2/org/sonatype/sisu/sisu-guice/3.1.0/sisu-guice-3.1.0.pom
(10 KB at 330.4 KB/sec)
2017-03-09\T\02:16:32.681 [INFO] Downloading: https://repo.maven.apache.org/maven2/org/sonatype/sisu/inject/guice-parent/3.1.0/guice-parent-3.1.0.pom
2017-03-09\T\02:16:32.711 [INFO] Downloaded: https://repo.maven.apache.org/maven2/org/sonatype/sisu/inject/guice-parent/3.1.0/guice-parent-3.1.0.pom
(11 KB at 355.7 KB/sec)
2017-03-09\T\02:16:32.715 [INFO] Downloading: https://repo.maven.apache.org/maven2/aopalliance/aopalliance/1.0/aopalliance-1.0.pom
2017-03-09\T\02:16:32.741 [INFO] Downloaded: https://repo.maven.apache.org/maven2/aopalliance/aopalliance/1.0/aopalliance-1.0.pom
(363 B at 13.6 KB/sec)
2017-03-09\T\02:16:32.744 [INFO] Downloading: https://repo.maven.apache.org/maven2/org/eclipse/sisu/org.eclipse.sisu.inject/0.0.0.M5/org.eclipse.sisu.inject-0.0.0.M5.pom
2017-03-09\T\02:16:32.771 [INFO] Downloaded: https://repo.maven.apache.org/maven2/org/eclipse/sisu/org.eclipse.sisu.inject/0.0.0.M5/org.eclipse.sisu.inject-0.0.0.M5.pom
(3 KB at 91.1 KB/sec)
2017-03-09\T\02:16:32.773 [INFO] Downloading: https://repo.maven.apache.org/maven2/org/eclipse/sisu/sisu-inject/0.0.0.M5/sisu-inject-0.0.0.M5.pom
2017-03-09\T\02:16:32.804 [INFO] Downloaded: https://repo.maven.apache.org/maven2/org/eclipse/sisu/sisu-inject/0.0.0.M5/sisu-inject-0.0.0.M5.pom
(14 KB at 440.9 KB/sec)
2017-03-09\T\02:16:32.807 [INFO] Downloading: https://repo.maven.apache.org/maven2/org/codehaus/plexus/plexus-component-annotations/1.5.5/plexus-component-annotations-1.5.5.pom
2017-03-09\T\02:16:32.833 [INFO] Downloaded: https://repo.maven.apache.org/maven2/org/codehaus/plexus/plexus-component-annotations/1.5.5/plexus-component-annotations-1.5.5.pom
(815 B at 30.6 KB/sec)
2017-03-09\T\02:16:32.835 [INFO] Downloading: https://repo.maven.apache.org/maven2/org/codehaus/plexus/plexus-containers/1.5.5/plexus-containers-1.5.5.pom
2017-03-09\T\02:16:32.862 [INFO] Downloaded: https://repo.maven.apache.org/maven2/org/codehaus/plexus/plexus-containers/1.5.5/plexus-containers-1.5.5.pom
(5 KB at 153.4 KB/sec)
2017-03-09\T\02:16:32.864 [INFO] Downloading: https://repo.maven.apache.org/maven2/org/codehaus/plexus/plexus/2.0.7/plexus-2.0.7.pom
2017-03-09\T\02:16:32.893 [INFO] Downloaded: https://repo.maven.apache.org/maven2/org/codehaus/plexus/plexus/2.0.7/plexus-2.0.7.pom
(17 KB at 582.4 KB/sec)
2017-03-09\T\02:16:32.896 [INFO] Downloading: https://repo.maven.apache.org/maven2/org/codehaus/plexus/plexus-classworlds/2.4/plexus-classworlds-2.4.pom
2017-03-09\T\02:16:32.924 [INFO] Downloaded: https://repo.maven.apache.org/maven2/org/codehaus/plexus/plexus-classworlds/2.4/plexus-classworlds-2.4.pom
(4 KB at 135.4 KB/sec)
2017-03-09\T\02:16:32.927 [INFO] Downloading: https://repo.maven.apache.org/maven2/org/codehaus/plexus/plexus-utils/2.1/plexus-utils-2.1.pom
2017-03-09\T\02:16:32.983 [INFO] Downloaded: https://repo.maven.apache.org/maven2/org/codehaus/plexus/plexus-utils/2.1/plexus-utils-2.1.pom
(4 KB at 70.3 KB/sec)
2017-03-09\T\02:16:32.985 [INFO] Downloading: https://repo.maven.apache.org/maven2/org/sonatype/spice/spice-parent/16/spice-parent-16.pom
2017-03-09\T\02:16:33.015 [INFO] Downloaded: https://repo.maven.apache.org/maven2/org/sonatype/spice/spice-parent/16/spice-parent-16.pom
(9 KB at 272.1 KB/sec)
2017-03-09\T\02:16:33.017 [INFO] Downloading: https://repo.maven.apache.org/maven2/org/sonatype/forge/forge-parent/5/forge-parent-5.pom
2017-03-09\T\02:16:33.046 [INFO] Downloaded: https://repo.maven.apache.org/maven2/org/sonatype/forge/forge-parent/5/forge-parent-5.pom
(9 KB at 281.6 KB/sec)
2017-03-09\T\02:16:33.084 [INFO] Downloading: https://repo.maven.apache.org/maven2/kr/motd/maven/os-maven-plugin/1.4.0.Final/os-maven-plugin-1.4.0.Final.jar
2017-03-09\T\02:16:33.085 [INFO] Downloading: https://repo.maven.apache.org/maven2/org/apache/maven/maven-model/3.2.1/maven-model-3.2.1.jar
2017-03-09\T\02:16:33.084 [INFO] Downloading: https://repo.maven.apache.org/maven2/org/apache/maven/maven-plugin-api/3.2.1/maven-plugin-api-3.2.1.jar
2017-03-09\T\02:16:33.085 [INFO] Downloading: https://repo.maven.apache.org/maven2/org/apache/maven/maven-artifact/3.2.1/maven-artifact-3.2.1.jar
2017-03-09\T\02:16:33.086 [INFO] Downloading: https://repo.maven.apache.org/maven2/org/eclipse/sisu/org.eclipse.sisu.plexus/0.0.0.M5/org.eclipse.sisu.plexus-0.0.0.M5.jar
2017-03-09\T\02:16:33.149 [INFO] Downloaded: https://repo.maven.apache.org/maven2/kr/motd/maven/os-maven-plugin/1.4.0.Final/os-maven-plugin-1.4.0.Final.jar
(29 KB at 431.2 KB/sec)
2017-03-09\T\02:16:33.149 [INFO] Downloading: https://repo.maven.apache.org/maven2/javax/enterprise/cdi-api/1.0/cdi-api-1.0.jar
2017-03-09\T\02:16:33.168 [INFO] Downloaded: https://repo.maven.apache.org/maven2/org/apache/maven/maven-plugin-api/3.2.1/maven-plugin-api-3.2.1.jar
(45 KB at 532.8 KB/sec)
2017-03-09\T\02:16:33.168 [INFO] Downloaded: https://repo.maven.apache.org/maven2/org/apache/maven/maven-model/3.2.1/maven-model-3.2.1.jar
(157 KB at 1858.4 KB/sec)
2017-03-09\T\02:16:33.169 [INFO] Downloading: https://repo.maven.apache.org/maven2/javax/annotation/jsr250-api/1.0/jsr250-api-1.0.jar
2017-03-09\T\02:16:33.169 [INFO] Downloading: https://repo.maven.apache.org/maven2/javax/inject/javax.inject/1/javax.inject-1.jar
2017-03-09\T\02:16:33.193 [INFO] Downloaded: https://repo.maven.apache.org/maven2/javax/enterprise/cdi-api/1.0/cdi-api-1.0.jar
(44 KB at 406.1 KB/sec)
2017-03-09\T\02:16:33.193 [INFO] Downloading: https://repo.maven.apache.org/maven2/com/google/guava/guava/10.0.1/guava-10.0.1.jar
2017-03-09\T\02:16:33.195 [INFO] Downloaded: https://repo.maven.apache.org/maven2/javax/inject/javax.inject/1/javax.inject-1.jar
(3 KB at 22.4 KB/sec)
2017-03-09\T\02:16:33.196 [INFO] Downloading: https://repo.maven.apache.org/maven2/com/google/code/findbugs/jsr305/1.3.9/jsr305-1.3.9.jar
2017-03-09\T\02:16:33.197 [INFO] Downloaded: https://repo.maven.apache.org/maven2/javax/annotation/jsr250-api/1.0/jsr250-api-1.0.jar
(6 KB at 51.4 KB/sec)
2017-03-09\T\02:16:33.197 [INFO] Downloading: https://repo.maven.apache.org/maven2/org/sonatype/sisu/sisu-guice/3.1.0/sisu-guice-3.1.0-no_aop.jar
2017-03-09\T\02:16:33.232 [INFO] Downloaded: https://repo.maven.apache.org/maven2/com/google/code/findbugs/jsr305/1.3.9/jsr305-1.3.9.jar
(33 KB at 220.8 KB/sec)
2017-03-09\T\02:16:33.232 [INFO] Downloading: https://repo.maven.apache.org/maven2/aopalliance/aopalliance/1.0/aopalliance-1.0.jar
2017-03-09\T\02:16:33.258 [INFO] Downloaded: https://repo.maven.apache.org/maven2/aopalliance/aopalliance/1.0/aopalliance-1.0.jar
(5 KB at 25.4 KB/sec)
2017-03-09\T\02:16:33.258 [INFO] Downloading: https://repo.maven.apache.org/maven2/org/eclipse/sisu/org.eclipse.sisu.inject/0.0.0.M5/org.eclipse.sisu.inject-0.0.0.M5.jar
2017-03-09\T\02:16:33.263 [INFO] Downloaded: https://repo.maven.apache.org/maven2/org/sonatype/sisu/sisu-guice/3.1.0/sisu-guice-3.1.0-no_aop.jar
(350 KB at 1972.0 KB/sec)
2017-03-09\T\02:16:33.264 [INFO] Downloading: https://repo.maven.apache.org/maven2/org/codehaus/plexus/plexus-component-annotations/1.5.5/plexus-component-annotations-1.5.5.jar
2017-03-09\T\02:16:33.282 [INFO] Downloaded: https://repo.maven.apache.org/maven2/org/apache/maven/maven-artifact/3.2.1/maven-artifact-3.2.1.jar
(53 KB at 264.6 KB/sec)
2017-03-09\T\02:16:33.282 [INFO] Downloading: https://repo.maven.apache.org/maven2/org/codehaus/plexus/plexus-classworlds/2.4/plexus-classworlds-2.4.jar
2017-03-09\T\02:16:33.291 [INFO] Downloaded: https://repo.maven.apache.org/maven2/org/eclipse/sisu/org.eclipse.sisu.plexus/0.0.0.M5/org.eclipse.sisu.plexus-0.0.0.M5.jar
(192 KB at 931.7 KB/sec)
2017-03-09\T\02:16:33.291 [INFO] Downloading: https://repo.maven.apache.org/maven2/org/codehaus/plexus/plexus-utils/3.0.17/plexus-utils-3.0.17.jar
2017-03-09\T\02:16:33.292 [INFO] Downloaded: https://repo.maven.apache.org/maven2/org/codehaus/plexus/plexus-component-annotations/1.5.5/plexus-component-annotations-1.5.5.jar
(5 KB at 20.0 KB/sec)
2017-03-09\T\02:16:33.330 [INFO] Downloaded: https://repo.maven.apache.org/maven2/org/codehaus/plexus/plexus-classworlds/2.4/plexus-classworlds-2.4.jar
(46 KB at 188.3 KB/sec)
2017-03-09\T\02:16:33.337 [INFO] Downloaded: https://repo.maven.apache.org/maven2/org/eclipse/sisu/org.eclipse.sisu.inject/0.0.0.M5/org.eclipse.sisu.inject-0.0.0.M5.jar
(285 KB at 1138.3 KB/sec)
2017-03-09\T\02:16:33.384 [INFO] Downloaded: https://repo.maven.apache.org/maven2/org/codehaus/plexus/plexus-utils/3.0.17/plexus-utils-3.0.17.jar
(246 KB at 825.1 KB/sec)
2017-03-09\T\02:16:33.431 [INFO] Downloaded: https://repo.maven.apache.org/maven2/com/google/guava/guava/10.0.1/guava-10.0.1.jar
(1467 KB at 4262.7 KB/sec)
2017-03-09\T\02:16:33.553 [INFO] Downloading: https://repo.maven.apache.org/maven2/org/apache/maven/archetype/archetype-packaging/2.4/archetype-packaging-2.4.pom
2017-03-09\T\02:16:33.580 [INFO] Downloaded: https://repo.maven.apache.org/maven2/org/apache/maven/archetype/archetype-packaging/2.4/archetype-packaging-2.4.pom
(2 KB at 56.7 KB/sec)
2017-03-09\T\02:16:33.582 [INFO] Downloading: https://repo.maven.apache.org/maven2/org/apache/maven/archetype/maven-archetype/2.4/maven-archetype-2.4.pom
2017-03-09\T\02:16:33.610 [INFO] Downloaded: https://repo.maven.apache.org/maven2/org/apache/maven/archetype/maven-archetype/2.4/maven-archetype-2.4.pom
(13 KB at 460.4 KB/sec)
2017-03-09\T\02:16:33.612 [INFO] Downloading: https://repo.maven.apache.org/maven2/org/apache/maven/maven-parent/26/maven-parent-26.pom
2017-03-09\T\02:16:33.643 [INFO] Downloaded: https://repo.maven.apache.org/maven2/org/apache/maven/maven-parent/26/maven-parent-26.pom
(39 KB at 1253.3 KB/sec)
2017-03-09\T\02:16:33.646 [INFO] Downloading: https://repo.maven.apache.org/maven2/org/apache/apache/16/apache-16.pom
2017-03-09\T\02:16:33.672 [INFO] Downloaded: https://repo.maven.apache.org/maven2/org/apache/apache/16/apache-16.pom
(16 KB at 578.3 KB/sec)
2017-03-09\T\02:16:33.677 [INFO] Downloading: https://repo.maven.apache.org/maven2/org/apache/maven/archetype/archetype-packaging/2.4/archetype-packaging-2.4.jar
2017-03-09\T\02:16:33.677 [INFO] Downloading: https://repo.maven.apache.org/maven2/org/codehaus/plexus/plexus-utils/1.1/plexus-utils-1.1.jar
2017-03-09\T\02:16:33.706 [INFO] Downloaded: https://repo.maven.apache.org/maven2/org/apache/maven/archetype/archetype-packaging/2.4/archetype-packaging-2.4.jar
(8 KB at 245.2 KB/sec)
2017-03-09\T\02:16:33.738 [INFO] Downloaded: https://repo.maven.apache.org/maven2/org/codehaus/plexus/plexus-utils/1.1/plexus-utils-1.1.jar
(165 KB at 2698.6 KB/sec)
2017-03-09\T\02:16:33.818 [WARNING] 
2017-03-09\T\02:16:33.818 [WARNING] Some problems were encountered while building the effective
model for org.apache.beam:beam-runners-google-cloud-dataflow-java:jar:0.7.0-SNAPSHOT
2017-03-09\T\02:16:33.818 [WARNING] 'dependencies.dependency.(groupId:artifactId:type:classifier)'
must be unique: org.apache.beam:beam-runners-core-construction-java:jar -> duplicate declaration
of version (?) @ org.apache.beam:beam-runners-google-cloud-dataflow-java:[unknown-version],
<https://builds.apache.org/job/beam_PostCommit_Java_Version_Test/jdk=JDK%201.7%20(latest),label=linux/ws/runners/google-cloud-dataflow-java/pom.xml,>
line 360, column 19
2017-03-09\T\02:16:33.818 [WARNING] 
2017-03-09\T\02:16:33.818 [WARNING] It is highly recommended to fix these problems because
they threaten the stability of your build.
2017-03-09\T\02:16:33.818 [WARNING] 
2017-03-09\T\02:16:33.818 [WARNING] For this reason, future Maven versions might no longer
support building such malformed projects.
2017-03-09\T\02:16:33.818 [WARNING] 
2017-03-09\T\02:16:33.845 [ERROR] [ERROR] Could not find the selected project in the reactor:
sdks/python @ 
2017-03-09\T\02:16:33.845 [ERROR] Could not find the selected project in the reactor: sdks/python
-> [Help 1]
org.apache.maven.MavenExecutionException: Could not find the selected project in the reactor:
sdks/python
	at org.apache.maven.graph.DefaultGraphBuilder.trimExcludedProjects(DefaultGraphBuilder.java:273)
	at org.apache.maven.graph.DefaultGraphBuilder.dependencyGraph(DefaultGraphBuilder.java:116)
	at org.apache.maven.graph.DefaultGraphBuilder.build(DefaultGraphBuilder.java:92)
	at org.apache.maven.DefaultMaven.buildGraph(DefaultMaven.java:491)
	at org.apache.maven.DefaultMaven.doExecute(DefaultMaven.java:219)
	at org.apache.maven.DefaultMaven.doExecute(DefaultMaven.java:193)
	at org.apache.maven.DefaultMaven.execute(DefaultMaven.java:106)
	at org.apache.maven.cli.MavenCli.execute(MavenCli.java:862)
	at org.apache.maven.cli.MavenCli.doMain(MavenCli.java:286)
	at org.apache.maven.cli.MavenCli.main(MavenCli.java:197)
	at sun.reflect.NativeMethodAccessorImpl.invoke0(Native Method)
	at sun.reflect.NativeMethodAccessorImpl.invoke(NativeMethodAccessorImpl.java:57)
	at sun.reflect.DelegatingMethodAccessorImpl.invoke(DelegatingMethodAccessorImpl.java:43)
	at java.lang.reflect.Method.invoke(Method.java:606)
	at org.codehaus.plexus.classworlds.launcher.Launcher.launchEnhanced(Launcher.java:289)
	at org.codehaus.plexus.classworlds.launcher.Launcher.launch(Launcher.java:229)
	at org.codehaus.plexus.classworlds.launcher.Launcher.mainWithExitCode(Launcher.java:415)
	at org.codehaus.plexus.classworlds.launcher.Launcher.main(Launcher.java:356)
2017-03-09\T\02:16:33.846 [ERROR] 
2017-03-09\T\02:16:33.846 [ERROR] Re-run Maven using the -X switch to enable full debug logging.
2017-03-09\T\02:16:33.846 [ERROR] 
2017-03-09\T\02:16:33.846 [ERROR] For more information about the errors and possible solutions,
please read the following articles:
2017-03-09\T\02:16:33.846 [ERROR] [Help 1] http://cwiki.apache.org/confluence/display/MAVEN/MavenExecutionException
Build step 'Invoke top-level Maven targets' marked build as failure

Mime
View raw message