beam-commits mailing list archives

Site index · List index
Message view « Date » · « Thread »
Top « Date » · « Thread »
From Apache Jenkins Server <jenk...@builds.apache.org>
Subject Build failed in Jenkins: beam_PostCommit_Java_MavenInstall #2562
Date Tue, 07 Feb 2017 18:11:02 GMT
See <https://builds.apache.org/job/beam_PostCommit_Java_MavenInstall/2562/>

------------------------------------------
[...truncated 4755 lines...]
2017-02-07T18:10:37.366 [INFO] ------------------------------------------------------------------------
2017-02-07T18:10:37.395 [INFO] Downloading: https://repo.maven.apache.org/maven2/com/google/cloud/datastore/datastore-v1-proto-client/1.4.0/datastore-v1-proto-client-1.4.0.pom
2017-02-07T18:10:37.438 [INFO] Downloaded: https://repo.maven.apache.org/maven2/com/google/cloud/datastore/datastore-v1-proto-client/1.4.0/datastore-v1-proto-client-1.4.0.pom
(4 KB at 73.4 KB/sec)
2017-02-07T18:10:37.441 [INFO] Downloading: https://repo.maven.apache.org/maven2/com/google/cloud/datastore/datastore-v1-proto-client-parent/1.4.0/datastore-v1-proto-client-parent-1.4.0.pom
2017-02-07T18:10:37.469 [INFO] Downloaded: https://repo.maven.apache.org/maven2/com/google/cloud/datastore/datastore-v1-proto-client-parent/1.4.0/datastore-v1-proto-client-parent-1.4.0.pom
(7 KB at 245.2 KB/sec)
2017-02-07T18:10:37.473 [INFO] Downloading: https://repo.maven.apache.org/maven2/com/google/cloud/bigtable/bigtable-protos/0.9.2/bigtable-protos-0.9.2.pom
2017-02-07T18:10:37.502 [INFO] Downloaded: https://repo.maven.apache.org/maven2/com/google/cloud/bigtable/bigtable-protos/0.9.2/bigtable-protos-0.9.2.pom
(8 KB at 242.4 KB/sec)
2017-02-07T18:10:37.506 [INFO] Downloading: https://repo.maven.apache.org/maven2/com/google/cloud/bigtable/bigtable-client-core-parent/0.9.2/bigtable-client-core-parent-0.9.2.pom
2017-02-07T18:10:37.535 [INFO] Downloaded: https://repo.maven.apache.org/maven2/com/google/cloud/bigtable/bigtable-client-core-parent/0.9.2/bigtable-client-core-parent-0.9.2.pom
(2 KB at 48.4 KB/sec)
2017-02-07T18:10:37.537 [INFO] Downloading: https://repo.maven.apache.org/maven2/com/google/cloud/bigtable/bigtable-client-parent/0.9.2/bigtable-client-parent-0.9.2.pom
2017-02-07T18:10:37.569 [INFO] Downloaded: https://repo.maven.apache.org/maven2/com/google/cloud/bigtable/bigtable-client-parent/0.9.2/bigtable-client-parent-0.9.2.pom
(30 KB at 911.9 KB/sec)
2017-02-07T18:10:37.588 [INFO] Downloading: https://repo.maven.apache.org/maven2/com/google/cloud/bigtable/bigtable-client-core/0.9.2/bigtable-client-core-0.9.2.pom
2017-02-07T18:10:37.618 [INFO] Downloaded: https://repo.maven.apache.org/maven2/com/google/cloud/bigtable/bigtable-client-core/0.9.2/bigtable-client-core-0.9.2.pom
(5 KB at 156.4 KB/sec)
2017-02-07T18:10:37.622 [INFO] Downloading: https://repo.maven.apache.org/maven2/commons-logging/commons-logging/1.2/commons-logging-1.2.pom
2017-02-07T18:10:37.652 [INFO] Downloaded: https://repo.maven.apache.org/maven2/commons-logging/commons-logging/1.2/commons-logging-1.2.pom
(19 KB at 625.2 KB/sec)
2017-02-07T18:10:37.657 [INFO] Downloading: https://repo.maven.apache.org/maven2/com/google/auth/google-auth-library-appengine/0.4.0/google-auth-library-appengine-0.4.0.pom
2017-02-07T18:10:37.686 [INFO] Downloaded: https://repo.maven.apache.org/maven2/com/google/auth/google-auth-library-appengine/0.4.0/google-auth-library-appengine-0.4.0.pom
(3 KB at 78.9 KB/sec)
2017-02-07T18:10:37.689 [INFO] Downloading: https://repo.maven.apache.org/maven2/com/google/auth/google-auth-library-parent/0.4.0/google-auth-library-parent-0.4.0.pom
2017-02-07T18:10:37.718 [INFO] Downloaded: https://repo.maven.apache.org/maven2/com/google/auth/google-auth-library-parent/0.4.0/google-auth-library-parent-0.4.0.pom
(6 KB at 206.8 KB/sec)
2017-02-07T18:10:37.722 [INFO] Downloading: https://repo.maven.apache.org/maven2/com/google/appengine/appengine-api-1.0-sdk/1.9.34/appengine-api-1.0-sdk-1.9.34.pom
2017-02-07T18:10:37.749 [INFO] Downloaded: https://repo.maven.apache.org/maven2/com/google/appengine/appengine-api-1.0-sdk/1.9.34/appengine-api-1.0-sdk-1.9.34.pom
(607 B at 22.0 KB/sec)
2017-02-07T18:10:37.751 [INFO] Downloading: https://repo.maven.apache.org/maven2/com/google/appengine/appengine/1.9.34/appengine-1.9.34.pom
2017-02-07T18:10:37.779 [INFO] Downloaded: https://repo.maven.apache.org/maven2/com/google/appengine/appengine/1.9.34/appengine-1.9.34.pom
(845 B at 29.5 KB/sec)
2017-02-07T18:10:37.782 [INFO] Downloading: https://repo.maven.apache.org/maven2/org/sonatype/oss/oss-parent/4/oss-parent-4.pom
2017-02-07T18:10:37.809 [INFO] Downloaded: https://repo.maven.apache.org/maven2/org/sonatype/oss/oss-parent/4/oss-parent-4.pom
(4 KB at 144.7 KB/sec)
2017-02-07T18:10:37.837 [INFO] Downloading: https://repository.apache.org/content/repositories/snapshots/io/netty/netty-codec-http2/maven-metadata.xml
2017-02-07T18:10:37.837 [INFO] Downloading: https://oss.sonatype.org/content/repositories/snapshots/io/netty/netty-codec-http2/maven-metadata.xml
2017-02-07T18:10:38.056 [INFO] Downloaded: https://oss.sonatype.org/content/repositories/snapshots/io/netty/netty-codec-http2/maven-metadata.xml
(405 B at 1.8 KB/sec)
2017-02-07T18:10:38.059 [INFO] Downloading: https://repo.maven.apache.org/maven2/io/dropwizard/metrics/metrics-core/3.1.2/metrics-core-3.1.2.pom
2017-02-07T18:10:38.085 [INFO] Downloaded: https://repo.maven.apache.org/maven2/io/dropwizard/metrics/metrics-core/3.1.2/metrics-core-3.1.2.pom
(846 B at 31.8 KB/sec)
2017-02-07T18:10:38.086 [INFO] Downloading: https://repo.maven.apache.org/maven2/io/dropwizard/metrics/metrics-parent/3.1.2/metrics-parent-3.1.2.pom
2017-02-07T18:10:38.117 [INFO] Downloaded: https://repo.maven.apache.org/maven2/io/dropwizard/metrics/metrics-parent/3.1.2/metrics-parent-3.1.2.pom
(12 KB at 378.1 KB/sec)
2017-02-07T18:10:38.120 [INFO] Downloading: https://repo.maven.apache.org/maven2/io/netty/netty-tcnative-boringssl-static/1.1.33.Fork18/netty-tcnative-boringssl-static-1.1.33.Fork18.pom
2017-02-07T18:10:38.147 [INFO] Downloaded: https://repo.maven.apache.org/maven2/io/netty/netty-tcnative-boringssl-static/1.1.33.Fork18/netty-tcnative-boringssl-static-1.1.33.Fork18.pom
(17 KB at 609.8 KB/sec)
2017-02-07T18:10:38.150 [INFO] Downloading: https://repo.maven.apache.org/maven2/io/netty/netty-tcnative-parent/1.1.33.Fork18/netty-tcnative-parent-1.1.33.Fork18.pom
2017-02-07T18:10:38.180 [INFO] Downloaded: https://repo.maven.apache.org/maven2/io/netty/netty-tcnative-parent/1.1.33.Fork18/netty-tcnative-parent-1.1.33.Fork18.pom
(19 KB at 612.0 KB/sec)
2017-02-07T18:10:38.182 [INFO] Downloading: https://repo.maven.apache.org/maven2/io/netty/netty-parent/4.0.18.Final/netty-parent-4.0.18.Final.pom
2017-02-07T18:10:38.211 [INFO] Downloaded: https://repo.maven.apache.org/maven2/io/netty/netty-parent/4.0.18.Final/netty-parent-4.0.18.Final.pom
(31 KB at 1061.2 KB/sec)
2017-02-07T18:10:38.255 [INFO] Downloading: https://repo.maven.apache.org/maven2/com/google/cloud/datastore/datastore-v1-proto-client/1.4.0/datastore-v1-proto-client-1.4.0.jar
2017-02-07T18:10:38.269 [INFO] Downloading: https://repo.maven.apache.org/maven2/com/google/cloud/bigtable/bigtable-protos/0.9.2/bigtable-protos-0.9.2.jar
2017-02-07T18:10:38.275 [INFO] Downloading: https://repo.maven.apache.org/maven2/com/google/cloud/bigtable/bigtable-client-core/0.9.2/bigtable-client-core-0.9.2.jar
2017-02-07T18:10:38.277 [INFO] Downloading: https://repo.maven.apache.org/maven2/commons-logging/commons-logging/1.2/commons-logging-1.2.jar
2017-02-07T18:10:38.284 [INFO] Downloading: https://repo.maven.apache.org/maven2/com/google/auth/google-auth-library-appengine/0.4.0/google-auth-library-appengine-0.4.0.jar
[INFO] I/O exception (java.net.SocketException) caught when processing request to {s}->https://repo.maven.apache.org:443:
Connection reset
[INFO] Retrying request to {s}->https://repo.maven.apache.org:443
[INFO] I/O exception (java.net.SocketException) caught when processing request to {s}->https://repo.maven.apache.org:443:
Connection reset
[INFO] Retrying request to {s}->https://repo.maven.apache.org:443
2017-02-07T18:10:38.314 [INFO] Downloaded: https://repo.maven.apache.org/maven2/com/google/cloud/datastore/datastore-v1-proto-client/1.4.0/datastore-v1-proto-client-1.4.0.jar
(40 KB at 568.5 KB/sec)
2017-02-07T18:10:38.314 [INFO] Downloading: https://repo.maven.apache.org/maven2/com/google/appengine/appengine-api-1.0-sdk/1.9.34/appengine-api-1.0-sdk-1.9.34.jar
2017-02-07T18:10:38.326 [INFO] Downloading: https://repo.maven.apache.org/maven2/io/dropwizard/metrics/metrics-core/3.1.2/metrics-core-3.1.2.jar
2017-02-07T18:10:38.365 [INFO] Downloaded: https://repo.maven.apache.org/maven2/com/google/cloud/bigtable/bigtable-client-core/0.9.2/bigtable-client-core-0.9.2.jar
(173 KB at 1783.2 KB/sec)
2017-02-07T18:10:38.365 [INFO] Downloading: https://repo.maven.apache.org/maven2/io/netty/netty-tcnative-boringssl-static/1.1.33.Fork18/netty-tcnative-boringssl-static-1.1.33.Fork18.jar
2017-02-07T18:10:38.424 [INFO] Downloaded: https://repo.maven.apache.org/maven2/commons-logging/commons-logging/1.2/commons-logging-1.2.jar
(61 KB at 405.2 KB/sec)
2017-02-07T18:10:38.464 [INFO] Downloaded: https://repo.maven.apache.org/maven2/io/dropwizard/metrics/metrics-core/3.1.2/metrics-core-3.1.2.jar
(110 KB at 610.7 KB/sec)
2017-02-07T18:10:38.544 [INFO] Downloaded: https://repo.maven.apache.org/maven2/com/google/cloud/bigtable/bigtable-protos/0.9.2/bigtable-protos-0.9.2.jar
(1052 KB at 3625.1 KB/sec)
2017-02-07T18:10:38.768 [INFO] Downloaded: https://repo.maven.apache.org/maven2/io/netty/netty-tcnative-boringssl-static/1.1.33.Fork18/netty-tcnative-boringssl-static-1.1.33.Fork18.jar
(2499 KB at 5162.2 KB/sec)
2017-02-07T18:10:39.681 [INFO] Downloaded: https://repo.maven.apache.org/maven2/com/google/appengine/appengine-api-1.0-sdk/1.9.34/appengine-api-1.0-sdk-1.9.34.jar
(17206 KB at 12315.7 KB/sec)
2017-02-07T18:10:39.688 [INFO] Downloading: https://repository.apache.org/content/repositories/snapshots/com/google/auth/google-auth-library-appengine/0.4.0/google-auth-library-appengine-0.4.0.jar
2017-02-07T18:10:39.808 [INFO] Downloading: https://oss.sonatype.org/content/repositories/snapshots/com/google/auth/google-auth-library-appengine/0.4.0/google-auth-library-appengine-0.4.0.jar
[JENKINS] Archiving disabled
2017-02-07T18:10:40.366 [INFO]                                                           
             
2017-02-07T18:10:40.367 [INFO] ------------------------------------------------------------------------
2017-02-07T18:10:40.367 [INFO] Skipping Apache Beam :: Parent
2017-02-07T18:10:40.367 [INFO] This project has been banned from the build due to previous
failures.
2017-02-07T18:10:40.368 [INFO] ------------------------------------------------------------------------
[JENKINS] Archiving disabled
[JENKINS] Archiving disabled
[JENKINS] Archiving disabled
[JENKINS] Archiving disabled
[JENKINS] Archiving disabled
[JENKINS] Archiving disabled
[JENKINS] Archiving disabled
[JENKINS] Archiving disabled
[JENKINS] Archiving disabled
[JENKINS] Archiving disabled
[JENKINS] Archiving disabled
[JENKINS] Archiving disabled
[JENKINS] Archiving disabled
[JENKINS] Archiving disabled
[JENKINS] Archiving disabled
[JENKINS] Archiving disabled
[JENKINS] Archiving disabled
[JENKINS] Archiving disabled
[JENKINS] Archiving disabled
[JENKINS] Archiving disabled
[JENKINS] Archiving disabled
[JENKINS] Archiving disabled
[JENKINS] Archiving disabled
[JENKINS] Archiving disabled
[JENKINS] Archiving disabled
[JENKINS] Archiving disabled
[JENKINS] Archiving disabled
[JENKINS] Archiving disabled
[JENKINS] Archiving disabled
[JENKINS] Archiving disabled
[JENKINS] Archiving disabled
[JENKINS] Archiving disabled
[JENKINS] Archiving disabled
[JENKINS] Archiving disabled
[JENKINS] Archiving disabled
[JENKINS] Archiving disabled
[JENKINS] Archiving disabled
2017-02-07T18:10:50.188 [INFO] ------------------------------------------------------------------------
2017-02-07T18:10:50.188 [INFO] Reactor Summary:
2017-02-07T18:10:50.188 [INFO] 
2017-02-07T18:10:50.188 [INFO] Apache Beam :: Parent .............................. SUCCESS
[ 27.435 s]
2017-02-07T18:10:50.188 [INFO] Apache Beam :: SDKs :: Java :: Build Tools ......... SUCCESS
[  4.195 s]
2017-02-07T18:10:50.188 [INFO] Apache Beam :: SDKs ................................ SUCCESS
[  8.606 s]
2017-02-07T18:10:50.188 [INFO] Apache Beam :: SDKs :: Common ...................... SUCCESS
[  2.006 s]
2017-02-07T18:10:50.188 [INFO] Apache Beam :: SDKs :: Common :: Fn API ............ SUCCESS
[ 25.199 s]
2017-02-07T18:10:50.188 [INFO] Apache Beam :: SDKs :: Java ........................ SUCCESS
[  1.818 s]
2017-02-07T18:10:50.188 [INFO] Apache Beam :: SDKs :: Java :: Core ................ SUCCESS
[03:25 min]
2017-02-07T18:10:50.188 [INFO] Apache Beam :: Runners ............................. SUCCESS
[  1.636 s]
2017-02-07T18:10:50.188 [INFO] Apache Beam :: Runners :: Core Java ................ SUCCESS
[ 44.999 s]
2017-02-07T18:10:50.189 [INFO] Apache Beam :: Runners :: Direct Java .............. SUCCESS
[03:25 min]
2017-02-07T18:10:50.189 [INFO] Apache Beam :: Runners :: Google Cloud Dataflow .... SUCCESS
[ 27.089 s]
2017-02-07T18:10:50.189 [INFO] Apache Beam :: SDKs :: Java :: IO .................. SUCCESS
[  2.100 s]
2017-02-07T18:10:50.189 [INFO] Apache Beam :: SDKs :: Java :: IO :: Google Cloud Platform
FAILURE [  2.687 s]
2017-02-07T18:10:50.189 [INFO] Apache Beam :: SDKs :: Java :: IO :: HDFS .......... SKIPPED
2017-02-07T18:10:50.189 [INFO] Apache Beam :: SDKs :: Java :: IO :: JMS ........... SKIPPED
2017-02-07T18:10:50.189 [INFO] Apache Beam :: SDKs :: Java :: IO :: Kafka ......... SKIPPED
2017-02-07T18:10:50.189 [INFO] Apache Beam :: SDKs :: Java :: IO :: Kinesis ....... SKIPPED
2017-02-07T18:10:50.189 [INFO] Apache Beam :: SDKs :: Java :: IO :: MongoDB ....... SKIPPED
2017-02-07T18:10:50.189 [INFO] Apache Beam :: SDKs :: Java :: IO :: JDBC .......... SKIPPED
2017-02-07T18:10:50.189 [INFO] Apache Beam :: SDKs :: Java :: IO :: Elasticsearch . SKIPPED
2017-02-07T18:10:50.189 [INFO] Apache Beam :: SDKs :: Java :: IO :: MQTT .......... SKIPPED
2017-02-07T18:10:50.189 [INFO] Apache Beam :: SDKs :: Java :: Maven Archetypes .... SKIPPED
2017-02-07T18:10:50.189 [INFO] Apache Beam :: SDKs :: Java :: Maven Archetypes :: Starter
SKIPPED
2017-02-07T18:10:50.189 [INFO] Apache Beam :: SDKs :: Java :: Maven Archetypes :: Examples
SKIPPED
2017-02-07T18:10:50.190 [INFO] Apache Beam :: SDKs :: Java :: Maven Archetypes :: Examples
- Java 8 SKIPPED
2017-02-07T18:10:50.190 [INFO] Apache Beam :: SDKs :: Java :: Extensions .......... SKIPPED
2017-02-07T18:10:50.190 [INFO] Apache Beam :: SDKs :: Java :: Extensions :: Join library SKIPPED
2017-02-07T18:10:50.190 [INFO] Apache Beam :: SDKs :: Java :: Extensions :: Sorter  SKIPPED
2017-02-07T18:10:50.190 [INFO] Apache Beam :: SDKs :: Java :: Harness ............. SKIPPED
2017-02-07T18:10:50.190 [INFO] Apache Beam :: SDKs :: Java :: Java 8 Tests ........ SKIPPED
2017-02-07T18:10:50.190 [INFO] Apache Beam :: SDKs :: Python ...................... SKIPPED
2017-02-07T18:10:50.190 [INFO] Apache Beam :: Runners :: Flink .................... SKIPPED
2017-02-07T18:10:50.190 [INFO] Apache Beam :: Runners :: Flink :: Core ............ SKIPPED
2017-02-07T18:10:50.190 [INFO] Apache Beam :: Runners :: Flink :: Examples ........ SKIPPED
2017-02-07T18:10:50.190 [INFO] Apache Beam :: Runners :: Spark .................... SKIPPED
2017-02-07T18:10:50.190 [INFO] Apache Beam :: Runners :: Apex ..................... SKIPPED
2017-02-07T18:10:50.190 [INFO] Apache Beam :: Examples ............................ SKIPPED
2017-02-07T18:10:50.190 [INFO] Apache Beam :: Examples :: Java .................... SKIPPED
2017-02-07T18:10:50.190 [INFO] Apache Beam :: Examples :: Java 8 .................. SKIPPED
2017-02-07T18:10:50.190 [INFO] Apache Beam :: SDKs :: Java :: Aggregated Javadoc .. SKIPPED
2017-02-07T18:10:50.191 [INFO] ------------------------------------------------------------------------
2017-02-07T18:10:50.191 [INFO] BUILD FAILURE
2017-02-07T18:10:50.191 [INFO] ------------------------------------------------------------------------
2017-02-07T18:10:50.191 [INFO] Total time: 09:50 min
2017-02-07T18:10:50.191 [INFO] Finished at: 2017-02-07T18:10:50+00:00
2017-02-07T18:10:51.136 [INFO] Final Memory: 123M/1579M
2017-02-07T18:10:51.136 [INFO] ------------------------------------------------------------------------
2017-02-07T18:10:51.161 [ERROR] Failed to execute goal on project beam-sdks-java-io-google-cloud-platform:
Could not resolve dependencies for project org.apache.beam:beam-sdks-java-io-google-cloud-platform:jar:0.6.0-SNAPSHOT:
Could not transfer artifact com.google.auth:google-auth-library-appengine:jar:0.4.0 from/to
central (https://repo.maven.apache.org/maven2): handshake alert:  unrecognized_name ->
[Help 1]
org.apache.maven.lifecycle.LifecycleExecutionException: Failed to execute goal on project
beam-sdks-java-io-google-cloud-platform: Could not resolve dependencies for project org.apache.beam:beam-sdks-java-io-google-cloud-platform:jar:0.6.0-SNAPSHOT:
Could not transfer artifact com.google.auth:google-auth-library-appengine:jar:0.4.0 from/to
central (https://repo.maven.apache.org/maven2): handshake alert:  unrecognized_name
	at org.apache.maven.lifecycle.internal.LifecycleDependencyResolver.getDependencies(LifecycleDependencyResolver.java:221)
	at org.apache.maven.lifecycle.internal.LifecycleDependencyResolver.resolveProjectDependencies(LifecycleDependencyResolver.java:127)
	at org.apache.maven.lifecycle.internal.MojoExecutor.ensureDependenciesAreResolved(MojoExecutor.java:257)
	at org.apache.maven.lifecycle.internal.MojoExecutor.execute(MojoExecutor.java:200)
	at org.apache.maven.lifecycle.internal.MojoExecutor.execute(MojoExecutor.java:153)
	at org.apache.maven.lifecycle.internal.MojoExecutor.execute(MojoExecutor.java:145)
	at org.apache.maven.lifecycle.internal.LifecycleModuleBuilder.buildProject(LifecycleModuleBuilder.java:116)
	at org.apache.maven.lifecycle.internal.LifecycleModuleBuilder.buildProject(LifecycleModuleBuilder.java:80)
	at org.apache.maven.lifecycle.internal.builder.singlethreaded.SingleThreadedBuilder.build(SingleThreadedBuilder.java:51)
	at org.apache.maven.lifecycle.internal.LifecycleStarter.execute(LifecycleStarter.java:128)
	at org.apache.maven.DefaultMaven.doExecute(DefaultMaven.java:307)
	at org.apache.maven.DefaultMaven.doExecute(DefaultMaven.java:193)
	at org.apache.maven.DefaultMaven.execute(DefaultMaven.java:106)
	at org.jvnet.hudson.maven3.launcher.Maven32Launcher.main(Maven32Launcher.java:132)
	at sun.reflect.NativeMethodAccessorImpl.invoke0(Native Method)
	at sun.reflect.NativeMethodAccessorImpl.invoke(NativeMethodAccessorImpl.java:62)
	at sun.reflect.DelegatingMethodAccessorImpl.invoke(DelegatingMethodAccessorImpl.java:43)
	at java.lang.reflect.Method.invoke(Method.java:498)
	at org.codehaus.plexus.classworlds.launcher.Launcher.launchStandard(Launcher.java:330)
	at org.codehaus.plexus.classworlds.launcher.Launcher.launch(Launcher.java:238)
	at jenkins.maven3.agent.Maven32Main.launch(Maven32Main.java:186)
	at sun.reflect.NativeMethodAccessorImpl.invoke0(Native Method)
	at sun.reflect.NativeMethodAccessorImpl.invoke(NativeMethodAccessorImpl.java:62)
	at sun.reflect.DelegatingMethodAccessorImpl.invoke(DelegatingMethodAccessorImpl.java:43)
	at java.lang.reflect.Method.invoke(Method.java:498)
	at hudson.maven.Maven3Builder.call(Maven3Builder.java:136)
	at hudson.maven.Maven3Builder.call(Maven3Builder.java:71)
	at hudson.remoting.UserRequest.perform(UserRequest.java:153)
	at hudson.remoting.UserRequest.perform(UserRequest.java:50)
	at hudson.remoting.Request$2.run(Request.java:332)
	at hudson.remoting.InterceptingExecutorService$1.call(InterceptingExecutorService.java:68)
	at java.util.concurrent.FutureTask.run(FutureTask.java:266)
	at java.util.concurrent.ThreadPoolExecutor.runWorker(ThreadPoolExecutor.java:1142)
	at java.util.concurrent.ThreadPoolExecutor$Worker.run(ThreadPoolExecutor.java:617)
	at java.lang.Thread.run(Thread.java:745)
Caused by: org.apache.maven.project.DependencyResolutionException: Could not resolve dependencies
for project org.apache.beam:beam-sdks-java-io-google-cloud-platform:jar:0.6.0-SNAPSHOT: Could
not transfer artifact com.google.auth:google-auth-library-appengine:jar:0.4.0 from/to central
(https://repo.maven.apache.org/maven2): handshake alert:  unrecognized_name
	at org.apache.maven.project.DefaultProjectDependenciesResolver.resolve(DefaultProjectDependenciesResolver.java:211)
	at org.apache.maven.lifecycle.internal.LifecycleDependencyResolver.getDependencies(LifecycleDependencyResolver.java:195)
	... 34 more
Caused by: org.eclipse.aether.resolution.DependencyResolutionException: Could not transfer
artifact com.google.auth:google-auth-library-appengine:jar:0.4.0 from/to central (https://repo.maven.apache.org/maven2):
handshake alert:  unrecognized_name
	at org.eclipse.aether.internal.impl.DefaultRepositorySystem.resolveDependencies(DefaultRepositorySystem.java:384)
	at org.apache.maven.project.DefaultProjectDependenciesResolver.resolve(DefaultProjectDependenciesResolver.java:205)
	... 35 more
Caused by: org.eclipse.aether.resolution.ArtifactResolutionException: Could not transfer artifact
com.google.auth:google-auth-library-appengine:jar:0.4.0 from/to central (https://repo.maven.apache.org/maven2):
handshake alert:  unrecognized_name
	at org.eclipse.aether.internal.impl.DefaultArtifactResolver.resolve(DefaultArtifactResolver.java:444)
	at org.eclipse.aether.internal.impl.DefaultArtifactResolver.resolveArtifacts(DefaultArtifactResolver.java:246)
	at org.eclipse.aether.internal.impl.DefaultRepositorySystem.resolveDependencies(DefaultRepositorySystem.java:367)
	... 36 more
Caused by: org.eclipse.aether.transfer.ArtifactTransferException: Could not transfer artifact
com.google.auth:google-auth-library-appengine:jar:0.4.0 from/to central (https://repo.maven.apache.org/maven2):
handshake alert:  unrecognized_name
	at org.eclipse.aether.connector.basic.ArtifactTransportListener.transferFailed(ArtifactTransportListener.java:43)
	at org.eclipse.aether.connector.basic.BasicRepositoryConnector$TaskRunner.run(BasicRepositoryConnector.java:355)
	at org.eclipse.aether.util.concurrency.RunnableErrorForwarder$1.run(RunnableErrorForwarder.java:67)
	... 3 more
Caused by: org.apache.maven.wagon.TransferFailedException: handshake alert:  unrecognized_name
	at org.apache.maven.wagon.providers.http.AbstractHttpClientWagon.fillInputData(AbstractHttpClientWagon.java:1066)
	at org.apache.maven.wagon.providers.http.AbstractHttpClientWagon.fillInputData(AbstractHttpClientWagon.java:960)
	at org.apache.maven.wagon.StreamWagon.getInputStream(StreamWagon.java:116)
	at org.apache.maven.wagon.StreamWagon.getIfNewer(StreamWagon.java:88)
	at org.apache.maven.wagon.StreamWagon.get(StreamWagon.java:61)
	at org.eclipse.aether.transport.wagon.WagonTransporter$GetTaskRunner.run(WagonTransporter.java:560)
	at org.eclipse.aether.transport.wagon.WagonTransporter.execute(WagonTransporter.java:427)
	at org.eclipse.aether.transport.wagon.WagonTransporter.get(WagonTransporter.java:404)
	at org.eclipse.aether.connector.basic.BasicRepositoryConnector$GetTaskRunner.runTask(BasicRepositoryConnector.java:447)
	at org.eclipse.aether.connector.basic.BasicRepositoryConnector$TaskRunner.run(BasicRepositoryConnector.java:350)
	... 4 more
Caused by: javax.net.ssl.SSLProtocolException: handshake alert:  unrecognized_name
	at sun.security.ssl.ClientHandshaker.handshakeAlert(ClientHandshaker.java:1441)
	at sun.security.ssl.SSLSocketImpl.recvAlert(SSLSocketImpl.java:2016)
	at sun.security.ssl.SSLSocketImpl.readRecord(SSLSocketImpl.java:1125)
	at sun.security.ssl.SSLSocketImpl.performInitialHandshake(SSLSocketImpl.java:1375)
	at sun.security.ssl.SSLSocketImpl.startHandshake(SSLSocketImpl.java:1403)
	at sun.security.ssl.SSLSocketImpl.startHandshake(SSLSocketImpl.java:1387)
	at org.apache.maven.wagon.providers.http.httpclient.conn.ssl.SSLConnectionSocketFactory.createLayeredSocket(SSLConnectionSocketFactory.java:275)
	at org.apache.maven.wagon.providers.http.httpclient.conn.ssl.SSLConnectionSocketFactory.connectSocket(SSLConnectionSocketFactory.java:254)
	at org.apache.maven.wagon.providers.http.httpclient.impl.conn.HttpClientConnectionOperator.connect(HttpClientConnectionOperator.java:123)
	at org.apache.maven.wagon.providers.http.httpclient.impl.conn.PoolingHttpClientConnectionManager.connect(PoolingHttpClientConnectionManager.java:318)
	at org.apache.maven.wagon.providers.http.httpclient.impl.execchain.MainClientExec.establishRoute(MainClientExec.java:363)
	at org.apache.maven.wagon.providers.http.httpclient.impl.execchain.MainClientExec.execute(MainClientExec.java:219)
	at org.apache.maven.wagon.providers.http.httpclient.impl.execchain.ProtocolExec.execute(ProtocolExec.java:195)
	at org.apache.maven.wagon.providers.http.httpclient.impl.execchain.RetryExec.execute(RetryExec.java:86)
	at org.apache.maven.wagon.providers.http.httpclient.impl.execchain.RedirectExec.execute(RedirectExec.java:108)
	at org.apache.maven.wagon.providers.http.httpclient.impl.client.InternalHttpClient.doExecute(InternalHttpClient.java:184)
	at org.apache.maven.wagon.providers.http.httpclient.impl.client.CloseableHttpClient.execute(CloseableHttpClient.java:82)
	at org.apache.maven.wagon.providers.http.AbstractHttpClientWagon.execute(AbstractHttpClientWagon.java:832)
	at org.apache.maven.wagon.providers.http.AbstractHttpClientWagon.fillInputData(AbstractHttpClientWagon.java:983)
	... 13 more
2017-02-07T18:10:51.165 [ERROR] 
2017-02-07T18:10:51.165 [ERROR] Re-run Maven using the -X switch to enable full debug logging.
2017-02-07T18:10:51.165 [ERROR] 
2017-02-07T18:10:51.165 [ERROR] For more information about the errors and possible solutions,
please read the following articles:
2017-02-07T18:10:51.165 [ERROR] [Help 1] http://cwiki.apache.org/confluence/display/MAVEN/DependencyResolutionException
2017-02-07T18:10:51.166 [ERROR] 
2017-02-07T18:10:51.166 [ERROR] After correcting the problems, you can resume the build with
the command
2017-02-07T18:10:51.166 [ERROR]   mvn <goals> -rf :beam-sdks-java-io-google-cloud-platform
channel stopped

Mime
View raw message