beam-commits mailing list archives

Site index · List index
Message view « Date » · « Thread »
Top « Date » · « Thread »
From Apache Jenkins Server <jenk...@builds.apache.org>
Subject Build failed in Jenkins: beam_PostCommit_Java_RunnableOnService_Dataflow #2234
Date Wed, 08 Feb 2017 12:05:42 GMT
See <https://builds.apache.org/job/beam_PostCommit_Java_RunnableOnService_Dataflow/2234/>

------------------------------------------
[...truncated 10553 lines...]
	at sun.reflect.DelegatingMethodAccessorImpl.invoke(DelegatingMethodAccessorImpl.java:43)
	at java.lang.reflect.Method.invoke(Method.java:498)
	at org.codehaus.plexus.classworlds.launcher.Launcher.launchStandard(Launcher.java:330)
	at org.codehaus.plexus.classworlds.launcher.Launcher.launch(Launcher.java:238)
	at jenkins.maven3.agent.Maven32Main.launch(Maven32Main.java:186)
	at sun.reflect.NativeMethodAccessorImpl.invoke0(Native Method)
	at sun.reflect.NativeMethodAccessorImpl.invoke(NativeMethodAccessorImpl.java:62)
	at sun.reflect.DelegatingMethodAccessorImpl.invoke(DelegatingMethodAccessorImpl.java:43)
	at java.lang.reflect.Method.invoke(Method.java:498)
	at hudson.maven.Maven3Builder.call(Maven3Builder.java:136)
	at hudson.maven.Maven3Builder.call(Maven3Builder.java:71)
	at hudson.remoting.UserRequest.perform(UserRequest.java:153)
	at hudson.remoting.UserRequest.perform(UserRequest.java:50)
	at hudson.remoting.Request$2.run(Request.java:332)
	at hudson.remoting.InterceptingExecutorService$1.call(InterceptingExecutorService.java:68)
	at java.util.concurrent.FutureTask.run(FutureTask.java:266)
	at java.util.concurrent.ThreadPoolExecutor.runWorker(ThreadPoolExecutor.java:1142)
	at java.util.concurrent.ThreadPoolExecutor$Worker.run(ThreadPoolExecutor.java:617)
	at java.lang.Thread.run(Thread.java:745)
[INFO] Uploading 1 files from PipelineOptions.filesToStage to staging location to prepare
for execution.
[ERROR] Uploaded failed due to permissions error, will NOT retry staging of classpath /tmp/junit1088346690846004575/file.txt.
Please verify credentials are valid and that you have write access to gs://somebucket/base/path/file-cC7coLIYHBXUV-rKw53jmw.txt.
Stale credentials can be resolved by executing 'gcloud auth application-default login'.
Tests run: 18, Failures: 0, Errors: 0, Skipped: 0, Time elapsed: 0.501 sec - in org.apache.beam.runners.dataflow.util.PackageUtilTest
Running org.apache.beam.runners.dataflow.util.TimeUtilTest
Tests run: 4, Failures: 0, Errors: 0, Skipped: 0, Time elapsed: 0.002 sec - in org.apache.beam.runners.dataflow.util.TimeUtilTest
Running org.apache.beam.runners.dataflow.util.MonitoringUtilTest
[ERROR] 1970-01-01T00:00:01.000Z: ERRORERROR
[WARNING] 1970-01-01T00:00:02.000Z: WARNINGWARNING
[INFO] 1970-01-01T00:00:03.000Z: BASICBASIC
[INFO] 1970-01-01T00:00:04.000Z: DETAILEDDETAILED
Tests run: 7, Failures: 0, Errors: 0, Skipped: 0, Time elapsed: 0.044 sec - in org.apache.beam.runners.dataflow.util.MonitoringUtilTest
Running org.apache.beam.runners.dataflow.util.RandomAccessDataTest
Tests run: 11, Failures: 0, Errors: 0, Skipped: 0, Time elapsed: 0.017 sec - in org.apache.beam.runners.dataflow.util.RandomAccessDataTest

Results :

Tests run: 217, Failures: 0, Errors: 0, Skipped: 0

[JENKINS] Recording test results
2017-02-08T12:05:30.953 [INFO] 
2017-02-08T12:05:30.953 [INFO] --- jacoco-maven-plugin:0.7.8:report (report) @ beam-runners-google-cloud-dataflow-java
---
2017-02-08T12:05:30.955 [INFO] Skipping JaCoCo execution due to missing execution data file.
2017-02-08T12:05:31.103 [INFO] 
2017-02-08T12:05:31.103 [INFO] --- maven-jar-plugin:3.0.2:jar (default-jar) @ beam-runners-google-cloud-dataflow-java
---
2017-02-08T12:05:31.137 [INFO] Building jar: <https://builds.apache.org/job/beam_PostCommit_Java_RunnableOnService_Dataflow/ws/runners/google-cloud-dataflow-java/target/beam-runners-google-cloud-dataflow-java-0.6.0-SNAPSHOT.jar>
2017-02-08T12:05:31.247 [INFO] 
2017-02-08T12:05:31.247 [INFO] --- maven-site-plugin:3.5.1:attach-descriptor (attach-descriptor)
@ beam-runners-google-cloud-dataflow-java ---
2017-02-08T12:05:31.347 [INFO] 
2017-02-08T12:05:31.347 [INFO] --- maven-jar-plugin:3.0.2:test-jar (default-test-jar) @ beam-runners-google-cloud-dataflow-java
---
2017-02-08T12:05:31.355 [INFO] Building jar: <https://builds.apache.org/job/beam_PostCommit_Java_RunnableOnService_Dataflow/ws/runners/google-cloud-dataflow-java/target/beam-runners-google-cloud-dataflow-java-0.6.0-SNAPSHOT-tests.jar>
2017-02-08T12:05:31.428 [INFO] 
2017-02-08T12:05:31.428 [INFO] --- maven-shade-plugin:2.4.3:shade (bundle-and-repackage) @
beam-runners-google-cloud-dataflow-java ---
2017-02-08T12:05:31.434 [INFO] Excluding org.apache.beam:beam-sdks-java-core:jar:0.6.0-SNAPSHOT
from the shaded jar.
2017-02-08T12:05:31.434 [INFO] Excluding io.grpc:grpc-auth:jar:1.0.1 from the shaded jar.
2017-02-08T12:05:31.434 [INFO] Excluding io.grpc:grpc-core:jar:1.0.1 from the shaded jar.
2017-02-08T12:05:31.434 [INFO] Excluding io.grpc:grpc-context:jar:1.0.1 from the shaded jar.
2017-02-08T12:05:31.434 [INFO] Excluding io.grpc:grpc-netty:jar:1.0.1 from the shaded jar.
2017-02-08T12:05:31.434 [INFO] Excluding io.netty:netty-codec-http2:jar:4.1.3.Final from the
shaded jar.
2017-02-08T12:05:31.434 [INFO] Excluding io.netty:netty-codec-http:jar:4.1.3.Final from the
shaded jar.
2017-02-08T12:05:31.435 [INFO] Excluding io.grpc:grpc-stub:jar:1.0.1 from the shaded jar.
2017-02-08T12:05:31.435 [INFO] Excluding io.grpc:grpc-all:jar:1.0.1 from the shaded jar.
2017-02-08T12:05:31.435 [INFO] Excluding io.grpc:grpc-protobuf:jar:1.0.1 from the shaded jar.
2017-02-08T12:05:31.435 [INFO] Excluding com.google.protobuf:protobuf-java-util:jar:3.0.0
from the shaded jar.
2017-02-08T12:05:31.435 [INFO] Excluding com.google.code.gson:gson:jar:2.3 from the shaded
jar.
2017-02-08T12:05:31.435 [INFO] Excluding io.grpc:grpc-protobuf-nano:jar:1.0.1 from the shaded
jar.
2017-02-08T12:05:31.435 [INFO] Excluding com.google.protobuf.nano:protobuf-javanano:jar:3.0.0-alpha-5
from the shaded jar.
2017-02-08T12:05:31.435 [INFO] Excluding io.grpc:grpc-okhttp:jar:1.0.1 from the shaded jar.
2017-02-08T12:05:31.435 [INFO] Excluding com.squareup.okio:okio:jar:1.6.0 from the shaded
jar.
2017-02-08T12:05:31.435 [INFO] Excluding com.squareup.okhttp:okhttp:jar:2.5.0 from the shaded
jar.
2017-02-08T12:05:31.435 [INFO] Excluding io.grpc:grpc-protobuf-lite:jar:1.0.1 from the shaded
jar.
2017-02-08T12:05:31.435 [INFO] Excluding io.netty:netty-handler:jar:4.1.3.Final from the shaded
jar.
2017-02-08T12:05:31.435 [INFO] Excluding io.netty:netty-buffer:jar:4.1.3.Final from the shaded
jar.
2017-02-08T12:05:31.435 [INFO] Excluding io.netty:netty-common:jar:4.1.3.Final from the shaded
jar.
2017-02-08T12:05:31.435 [INFO] Excluding io.netty:netty-transport:jar:4.1.3.Final from the
shaded jar.
2017-02-08T12:05:31.435 [INFO] Excluding io.netty:netty-resolver:jar:4.1.3.Final from the
shaded jar.
2017-02-08T12:05:31.436 [INFO] Excluding io.netty:netty-codec:jar:4.1.3.Final from the shaded
jar.
2017-02-08T12:05:31.436 [INFO] Excluding com.google.api.grpc:grpc-google-pubsub-v1:jar:0.1.0
from the shaded jar.
2017-02-08T12:05:31.436 [INFO] Excluding com.google.api.grpc:grpc-google-iam-v1:jar:0.1.0
from the shaded jar.
2017-02-08T12:05:31.436 [INFO] Excluding com.google.apis:google-api-services-bigquery:jar:v2-rev295-1.22.0
from the shaded jar.
2017-02-08T12:05:31.436 [INFO] Excluding com.google.apis:google-api-services-cloudresourcemanager:jar:v1-rev6-1.22.0
from the shaded jar.
2017-02-08T12:05:31.436 [INFO] Excluding com.google.apis:google-api-services-pubsub:jar:v1-rev10-1.22.0
from the shaded jar.
2017-02-08T12:05:31.436 [INFO] Excluding com.google.http-client:google-http-client-jackson:jar:1.22.0
from the shaded jar.
2017-02-08T12:05:31.436 [INFO] Excluding com.google.oauth-client:google-oauth-client:jar:1.22.0
from the shaded jar.
2017-02-08T12:05:31.436 [INFO] Excluding com.google.cloud.bigdataoss:gcsio:jar:1.4.5 from
the shaded jar.
2017-02-08T12:05:31.436 [INFO] Excluding net.bytebuddy:byte-buddy:jar:1.5.5 from the shaded
jar.
2017-02-08T12:05:31.436 [INFO] Excluding org.apache.avro:avro:jar:1.8.1 from the shaded jar.
2017-02-08T12:05:31.436 [INFO] Excluding org.codehaus.jackson:jackson-core-asl:jar:1.9.13
from the shaded jar.
2017-02-08T12:05:31.436 [INFO] Excluding org.codehaus.jackson:jackson-mapper-asl:jar:1.9.13
from the shaded jar.
2017-02-08T12:05:31.436 [INFO] Excluding com.thoughtworks.paranamer:paranamer:jar:2.7 from
the shaded jar.
2017-02-08T12:05:31.436 [INFO] Excluding org.tukaani:xz:jar:1.5 from the shaded jar.
2017-02-08T12:05:31.436 [INFO] Excluding org.xerial.snappy:snappy-java:jar:1.1.2.1 from the
shaded jar.
2017-02-08T12:05:31.436 [INFO] Excluding org.apache.commons:commons-compress:jar:1.9 from
the shaded jar.
2017-02-08T12:05:31.436 [INFO] Excluding com.google.api-client:google-api-client:jar:1.22.0
from the shaded jar.
2017-02-08T12:05:31.436 [INFO] Excluding com.google.http-client:google-http-client:jar:1.22.0
from the shaded jar.
2017-02-08T12:05:31.436 [INFO] Excluding org.apache.httpcomponents:httpclient:jar:4.0.1 from
the shaded jar.
2017-02-08T12:05:31.436 [INFO] Excluding org.apache.httpcomponents:httpcore:jar:4.0.1 from
the shaded jar.
2017-02-08T12:05:31.436 [INFO] Excluding commons-logging:commons-logging:jar:1.1.1 from the
shaded jar.
2017-02-08T12:05:31.436 [INFO] Excluding commons-codec:commons-codec:jar:1.3 from the shaded
jar.
2017-02-08T12:05:31.436 [INFO] Excluding com.google.http-client:google-http-client-jackson2:jar:1.22.0
from the shaded jar.
2017-02-08T12:05:31.436 [INFO] Excluding com.google.http-client:google-http-client-protobuf:jar:1.22.0
from the shaded jar.
2017-02-08T12:05:31.436 [INFO] Excluding com.google.apis:google-api-services-dataflow:jar:v1b3-rev43-1.22.0
from the shaded jar.
2017-02-08T12:05:31.436 [INFO] Excluding com.google.apis:google-api-services-clouddebugger:jar:v2-rev8-1.22.0
from the shaded jar.
2017-02-08T12:05:31.436 [INFO] Excluding com.google.apis:google-api-services-storage:jar:v1-rev71-1.22.0
from the shaded jar.
2017-02-08T12:05:31.436 [INFO] Excluding com.google.auth:google-auth-library-credentials:jar:0.6.0
from the shaded jar.
2017-02-08T12:05:31.436 [INFO] Excluding com.google.auth:google-auth-library-oauth2-http:jar:0.6.0
from the shaded jar.
2017-02-08T12:05:31.436 [INFO] Excluding com.google.cloud.bigdataoss:util:jar:1.4.5 from the
shaded jar.
2017-02-08T12:05:31.436 [INFO] Excluding com.google.api-client:google-api-client-java6:jar:1.22.0
from the shaded jar.
2017-02-08T12:05:31.436 [INFO] Excluding com.google.api-client:google-api-client-jackson2:jar:1.22.0
from the shaded jar.
2017-02-08T12:05:31.436 [INFO] Excluding com.google.oauth-client:google-oauth-client-java6:jar:1.22.0
from the shaded jar.
2017-02-08T12:05:31.436 [INFO] Including com.google.guava:guava:jar:20.0 in the shaded jar.
2017-02-08T12:05:31.437 [INFO] Excluding joda-time:joda-time:jar:2.4 from the shaded jar.
2017-02-08T12:05:31.437 [INFO] Excluding com.google.protobuf:protobuf-java:jar:3.1.0 from
the shaded jar.
2017-02-08T12:05:31.437 [INFO] Excluding com.google.protobuf:protobuf-lite:jar:3.0.1 from
the shaded jar.
2017-02-08T12:05:31.437 [INFO] Excluding com.google.code.findbugs:jsr305:jar:3.0.1 from the
shaded jar.
2017-02-08T12:05:31.437 [INFO] Excluding com.fasterxml.jackson.core:jackson-core:jar:2.7.2
from the shaded jar.
2017-02-08T12:05:31.437 [INFO] Excluding com.fasterxml.jackson.core:jackson-annotations:jar:2.7.2
from the shaded jar.
2017-02-08T12:05:31.437 [INFO] Excluding com.fasterxml.jackson.core:jackson-databind:jar:2.7.2
from the shaded jar.
2017-02-08T12:05:31.437 [INFO] Excluding org.slf4j:slf4j-api:jar:1.7.14 from the shaded jar.
2017-02-08T12:05:31.437 [INFO] Excluding com.google.auto.service:auto-service:jar:1.0-rc2
from the shaded jar.
2017-02-08T12:05:31.437 [INFO] Excluding com.google.auto:auto-common:jar:0.3 from the shaded
jar.
2017-02-08T12:05:31.437 [INFO] Excluding com.google.api.grpc:grpc-google-common-protos:jar:0.1.0
from the shaded jar.
2017-02-08T12:05:35.107 [INFO] Replacing original artifact with shaded artifact.
2017-02-08T12:05:35.108 [INFO] Replacing <https://builds.apache.org/job/beam_PostCommit_Java_RunnableOnService_Dataflow/ws/runners/google-cloud-dataflow-java/target/beam-runners-google-cloud-dataflow-java-0.6.0-SNAPSHOT.jar>
with <https://builds.apache.org/job/beam_PostCommit_Java_RunnableOnService_Dataflow/ws/runners/google-cloud-dataflow-java/target/beam-runners-google-cloud-dataflow-java-0.6.0-SNAPSHOT-shaded.jar>
2017-02-08T12:05:35.109 [INFO] Replacing original test artifact with shaded test artifact.
2017-02-08T12:05:35.109 [INFO] Replacing <https://builds.apache.org/job/beam_PostCommit_Java_RunnableOnService_Dataflow/ws/runners/google-cloud-dataflow-java/target/beam-runners-google-cloud-dataflow-java-0.6.0-SNAPSHOT-tests.jar>
with <https://builds.apache.org/job/beam_PostCommit_Java_RunnableOnService_Dataflow/ws/runners/google-cloud-dataflow-java/target/beam-runners-google-cloud-dataflow-java-0.6.0-SNAPSHOT-shaded-tests.jar>
2017-02-08T12:05:35.110 [INFO] Dependency-reduced POM written at: <https://builds.apache.org/job/beam_PostCommit_Java_RunnableOnService_Dataflow/ws/runners/google-cloud-dataflow-java/dependency-reduced-pom.xml>
2017-02-08T12:05:35.250 [INFO] Dependency-reduced POM written at: <https://builds.apache.org/job/beam_PostCommit_Java_RunnableOnService_Dataflow/ws/runners/google-cloud-dataflow-java/dependency-reduced-pom.xml>
2017-02-08T12:05:35.375 [INFO] 
2017-02-08T12:05:35.375 [INFO] --- maven-surefire-plugin:2.19.1:test (runnable-on-service-tests)
@ beam-runners-google-cloud-dataflow-java ---
2017-02-08T12:05:35.380 [WARNING] useSystemClassloader setting has no effect when not forking
2017-02-08T12:05:35.442 [INFO] Surefire report directory: <https://builds.apache.org/job/beam_PostCommit_Java_RunnableOnService_Dataflow/ws/runners/google-cloud-dataflow-java/target/surefire-reports>
2017-02-08T12:05:35.443 [INFO] Using configured provider org.apache.maven.surefire.junitcore.JUnitCoreProvider
2017-02-08T12:05:35.444 [INFO] parallel='all', perCoreThreadCount=true, threadCount=4, useUnlimitedThreads=false,
threadCountSuites=0, threadCountClasses=0, threadCountMethods=0, parallelOptimized=true
[JENKINS] Recording test results
[JENKINS] Archiving disabled
[JENKINS] Archiving disabled
[JENKINS] Archiving disabled
[JENKINS] Archiving disabled
[JENKINS] Archiving disabled
[JENKINS] Archiving disabled
[JENKINS] Archiving disabled
[JENKINS] Archiving disabled
[JENKINS] Archiving disabled
[JENKINS] Archiving disabled
2017-02-08T12:05:39.282 [INFO] ------------------------------------------------------------------------
2017-02-08T12:05:39.282 [INFO] Reactor Summary:
2017-02-08T12:05:39.282 [INFO] 
2017-02-08T12:05:39.282 [INFO] Apache Beam :: Parent .............................. SUCCESS
[ 21.204 s]
2017-02-08T12:05:39.282 [INFO] Apache Beam :: SDKs :: Java :: Build Tools ......... SUCCESS
[  5.389 s]
2017-02-08T12:05:39.282 [INFO] Apache Beam :: SDKs ................................ SUCCESS
[  4.521 s]
2017-02-08T12:05:39.282 [INFO] Apache Beam :: SDKs :: Common ...................... SUCCESS
[  1.415 s]
2017-02-08T12:05:39.282 [INFO] Apache Beam :: SDKs :: Common :: Fn API ............ SUCCESS
[ 17.650 s]
2017-02-08T12:05:39.282 [INFO] Apache Beam :: SDKs :: Java ........................ SUCCESS
[  1.490 s]
2017-02-08T12:05:39.282 [INFO] Apache Beam :: SDKs :: Java :: Core ................ SUCCESS
[02:42 min]
2017-02-08T12:05:39.282 [INFO] Apache Beam :: Runners ............................. SUCCESS
[  4.458 s]
2017-02-08T12:05:39.282 [INFO] Apache Beam :: Runners :: Google Cloud Dataflow .... FAILURE
[ 27.136 s]
2017-02-08T12:05:39.282 [INFO] ------------------------------------------------------------------------
2017-02-08T12:05:39.283 [INFO] BUILD FAILURE
2017-02-08T12:05:39.283 [INFO] ------------------------------------------------------------------------
2017-02-08T12:05:39.283 [INFO] Total time: 04:44 min
2017-02-08T12:05:39.283 [INFO] Finished at: 2017-02-08T12:05:39+00:00
2017-02-08T12:05:40.305 [INFO] Final Memory: 136M/1438M
2017-02-08T12:05:40.305 [INFO] ------------------------------------------------------------------------
2017-02-08T12:05:40.312 [ERROR] Failed to execute goal org.apache.maven.plugins:maven-surefire-plugin:2.19.1:test
(runnable-on-service-tests) on project beam-runners-google-cloud-dataflow-java: Exception
in provider: com/fasterxml/jackson/dataformat/yaml/YAMLFactory: com.fasterxml.jackson.dataformat.yaml.YAMLFactory
-> [Help 1]
org.apache.maven.lifecycle.LifecycleExecutionException: Failed to execute goal org.apache.maven.plugins:maven-surefire-plugin:2.19.1:test
(runnable-on-service-tests) on project beam-runners-google-cloud-dataflow-java: Exception
in provider
	at org.apache.maven.lifecycle.internal.MojoExecutor.execute(MojoExecutor.java:212)
	at org.apache.maven.lifecycle.internal.MojoExecutor.execute(MojoExecutor.java:153)
	at org.apache.maven.lifecycle.internal.MojoExecutor.execute(MojoExecutor.java:145)
	at org.apache.maven.lifecycle.internal.LifecycleModuleBuilder.buildProject(LifecycleModuleBuilder.java:116)
	at org.apache.maven.lifecycle.internal.LifecycleModuleBuilder.buildProject(LifecycleModuleBuilder.java:80)
	at org.apache.maven.lifecycle.internal.builder.singlethreaded.SingleThreadedBuilder.build(SingleThreadedBuilder.java:51)
	at org.apache.maven.lifecycle.internal.LifecycleStarter.execute(LifecycleStarter.java:128)
	at org.apache.maven.DefaultMaven.doExecute(DefaultMaven.java:307)
	at org.apache.maven.DefaultMaven.doExecute(DefaultMaven.java:193)
	at org.apache.maven.DefaultMaven.execute(DefaultMaven.java:106)
	at org.jvnet.hudson.maven3.launcher.Maven32Launcher.main(Maven32Launcher.java:132)
	at sun.reflect.NativeMethodAccessorImpl.invoke0(Native Method)
	at sun.reflect.NativeMethodAccessorImpl.invoke(NativeMethodAccessorImpl.java:62)
	at sun.reflect.DelegatingMethodAccessorImpl.invoke(DelegatingMethodAccessorImpl.java:43)
	at java.lang.reflect.Method.invoke(Method.java:498)
	at org.codehaus.plexus.classworlds.launcher.Launcher.launchStandard(Launcher.java:330)
	at org.codehaus.plexus.classworlds.launcher.Launcher.launch(Launcher.java:238)
	at jenkins.maven3.agent.Maven32Main.launch(Maven32Main.java:186)
	at sun.reflect.NativeMethodAccessorImpl.invoke0(Native Method)
	at sun.reflect.NativeMethodAccessorImpl.invoke(NativeMethodAccessorImpl.java:62)
	at sun.reflect.DelegatingMethodAccessorImpl.invoke(DelegatingMethodAccessorImpl.java:43)
	at java.lang.reflect.Method.invoke(Method.java:498)
	at hudson.maven.Maven3Builder.call(Maven3Builder.java:136)
	at hudson.maven.Maven3Builder.call(Maven3Builder.java:71)
	at hudson.remoting.UserRequest.perform(UserRequest.java:153)
	at hudson.remoting.UserRequest.perform(UserRequest.java:50)
	at hudson.remoting.Request$2.run(Request.java:332)
	at hudson.remoting.InterceptingExecutorService$1.call(InterceptingExecutorService.java:68)
	at java.util.concurrent.FutureTask.run(FutureTask.java:266)
	at java.util.concurrent.ThreadPoolExecutor.runWorker(ThreadPoolExecutor.java:1142)
	at java.util.concurrent.ThreadPoolExecutor$Worker.run(ThreadPoolExecutor.java:617)
	at java.lang.Thread.run(Thread.java:745)
Caused by: org.apache.maven.plugin.MojoFailureException: Exception in provider
	at org.apache.maven.plugin.surefire.SurefirePlugin.assertNoException(SurefirePlugin.java:328)
	at org.apache.maven.plugin.surefire.SurefirePlugin.handleSummary(SurefirePlugin.java:318)
	at org.apache.maven.plugin.surefire.AbstractSurefireMojo.executeAfterPreconditionsChecked(AbstractSurefireMojo.java:892)
	at org.apache.maven.plugin.surefire.AbstractSurefireMojo.execute(AbstractSurefireMojo.java:755)
	at org.apache.maven.plugin.DefaultBuildPluginManager.executeMojo(DefaultBuildPluginManager.java:134)
	at org.apache.maven.lifecycle.internal.MojoExecutor.execute(MojoExecutor.java:208)
	... 31 more
Caused by: org.apache.maven.surefire.booter.SurefireExecutionException: Exception in provider
	at org.apache.maven.plugin.surefire.InPluginVMSurefireStarter.runSuitesInProcess(InPluginVMSurefireStarter.java:87)
	at org.apache.maven.plugin.surefire.AbstractSurefireMojo.executeProvider(AbstractSurefireMojo.java:1010)
	at org.apache.maven.plugin.surefire.AbstractSurefireMojo.executeAfterPreconditionsChecked(AbstractSurefireMojo.java:862)
	... 34 more
Caused by: java.lang.NoClassDefFoundError: com/fasterxml/jackson/dataformat/yaml/YAMLFactory
	at java.lang.Class.getDeclaredMethods0(Native Method)
	at java.lang.Class.privateGetDeclaredMethods(Class.java:2701)
	at java.lang.Class.privateGetMethodRecursive(Class.java:3048)
	at java.lang.Class.getMethod0(Class.java:3018)
	at java.lang.Class.getMethod(Class.java:1784)
	at org.apache.maven.surefire.util.ReflectionUtils.tryGetMethod(ReflectionUtils.java:61)
	at org.apache.maven.surefire.common.junit3.JUnit3TestChecker.isSuiteOnly(JUnit3TestChecker.java:64)
	at org.apache.maven.surefire.common.junit3.JUnit3TestChecker.isValidJUnit3Test(JUnit3TestChecker.java:59)
	at org.apache.maven.surefire.common.junit3.JUnit3TestChecker.accept(JUnit3TestChecker.java:54)
	at org.apache.maven.surefire.common.junit4.JUnit4TestChecker.accept(JUnit4TestChecker.java:52)
	at org.apache.maven.surefire.common.junit48.JUnit48TestChecker.accept(JUnit48TestChecker.java:50)
	at org.apache.maven.surefire.util.DefaultScanResult.applyFilter(DefaultScanResult.java:98)
	at org.apache.maven.surefire.junitcore.JUnitCoreProvider.scanClassPath(JUnitCoreProvider.java:295)
	at org.apache.maven.surefire.junitcore.JUnitCoreProvider.setTestsToRun(JUnitCoreProvider.java:203)
	at org.apache.maven.surefire.junitcore.JUnitCoreProvider.invoke(JUnitCoreProvider.java:138)
	at sun.reflect.NativeMethodAccessorImpl.invoke0(Native Method)
	at sun.reflect.NativeMethodAccessorImpl.invoke(NativeMethodAccessorImpl.java:62)
	at sun.reflect.DelegatingMethodAccessorImpl.invoke(DelegatingMethodAccessorImpl.java:43)
	at java.lang.reflect.Method.invoke(Method.java:498)
	at org.apache.maven.surefire.util.ReflectionUtils.invokeMethodWithArray2(ReflectionUtils.java:202)
	at org.apache.maven.surefire.booter.ProviderFactory$ProviderProxy.invoke(ProviderFactory.java:155)
	at org.apache.maven.surefire.booter.ProviderFactory.invokeProvider(ProviderFactory.java:81)
	at org.apache.maven.plugin.surefire.InPluginVMSurefireStarter.runSuitesInProcess(InPluginVMSurefireStarter.java:82)
	... 36 more
Caused by: java.lang.ClassNotFoundException: com.fasterxml.jackson.dataformat.yaml.YAMLFactory
	at java.net.URLClassLoader.findClass(URLClassLoader.java:381)
	at java.lang.ClassLoader.loadClass(ClassLoader.java:424)
	at java.lang.ClassLoader.loadClass(ClassLoader.java:357)
	at org.apache.maven.surefire.booter.IsolatedClassLoader.loadClass(IsolatedClassLoader.java:97)
	... 59 more
2017-02-08T12:05:40.313 [ERROR] 
2017-02-08T12:05:40.313 [ERROR] Re-run Maven using the -X switch to enable full debug logging.
2017-02-08T12:05:40.313 [ERROR] 
2017-02-08T12:05:40.313 [ERROR] For more information about the errors and possible solutions,
please read the following articles:
2017-02-08T12:05:40.313 [ERROR] [Help 1] http://cwiki.apache.org/confluence/display/MAVEN/MojoFailureException
2017-02-08T12:05:40.313 [ERROR] 
2017-02-08T12:05:40.313 [ERROR] After correcting the problems, you can resume the build with
the command
2017-02-08T12:05:40.313 [ERROR]   mvn <goals> -rf :beam-runners-google-cloud-dataflow-java
channel stopped

Mime
View raw message