beam-commits mailing list archives

Site index · List index
Message view « Date » · « Thread »
Top « Date » · « Thread »
From Apache Jenkins Server <>
Subject Build failed in Jenkins: beam_PostCommit_Java_RunnableOnService_Apex #429
Date Tue, 07 Feb 2017 17:00:19 GMT
See <>


[tgroh] Check that Elements, Timers have permitted Timestamps

Started by GitHub push by asfgit
[EnvInject] - Loading node environment variables.
Building remotely on beam2 (beam) in workspace <>
 > git rev-parse --is-inside-work-tree # timeout=10
Fetching changes from the remote Git repository
 > git config remote.origin.url # timeout=10
Fetching upstream changes from
 > git --version # timeout=10
 > git -c core.askpass=true fetch --tags --progress
+refs/heads/*:refs/remotes/origin/* +refs/pull/*:refs/remotes/origin/pr/*
 > git rev-parse origin/master^{commit} # timeout=10
Checking out Revision 459a8f836bcd9c94f6c91e6327df67238ae8dd08 (origin/master)
 > git config core.sparsecheckout # timeout=10
 > git checkout -f 459a8f836bcd9c94f6c91e6327df67238ae8dd08
 > git rev-list 144bffd4024decbc586bf16efe05caeda9427d77 # timeout=10
Cleaning workspace
 > git rev-parse --verify HEAD # timeout=10
Resetting working tree
 > git reset --hard # timeout=10
 > git clean -fdx # timeout=10
[EnvInject] - Executing scripts and injecting environment variables after the SCM step.
[EnvInject] - Injecting as environment variables the properties content 

[EnvInject] - Variables injected successfully.
Parsing POMs
Downloaded artifact
Established TCP socket on 37932
maven32-agent.jar already up to date
maven32-interceptor.jar already up to date
maven3-interceptor-commons.jar already up to date
[beam_PostCommit_Java_RunnableOnService_Apex] $ /home/jenkins/tools/java/latest1.8/bin/java
-Dorg.slf4j.simpleLogger.showDateTime=true -Dorg.slf4j.simpleLogger.dateTimeFormat=yyyy-MM-dd'T'HH:mm:ss.SSS
-cp /home/jenkins/jenkins-slave/maven32-agent.jar:/home/jenkins/tools/maven/apache-maven-3.3.3/boot/plexus-classworlds-2.5.2.jar:/home/jenkins/tools/maven/apache-maven-3.3.3/conf/logging
jenkins.maven3.agent.Maven32Main /home/jenkins/tools/maven/apache-maven-3.3.3 /home/jenkins/jenkins-slave/slave.jar
/home/jenkins/jenkins-slave/maven32-interceptor.jar /home/jenkins/jenkins-slave/maven3-interceptor-commons.jar
<===[JENKINS REMOTING CAPACITY]===>   channel started
Executing Maven:  -B -f <>
clean verify --projects runners/apex --also-make --batch-mode --errors --activate-profiles
runnable-on-service-tests --activate-profiles local-runnable-on-service-tests
2017-02-07T17:00:04.667 [INFO] Error stacktraces are turned on.
2017-02-07T17:00:04.747 [INFO] Scanning for projects...
2017-02-07T17:00:06.230 [INFO] Downloading:
2017-02-07T17:00:06.827 [INFO] Downloaded:
(7 KB at 10.0 KB/sec)
2017-02-07T17:00:06.843 [INFO] Downloading:
2017-02-07T17:00:06.894 [INFO] Downloaded:
(7 KB at 125.8 KB/sec)
2017-02-07T17:00:06.909 [INFO] Downloading:
2017-02-07T17:00:06.961 [INFO] Downloaded:
(4 KB at 63.5 KB/sec)
2017-02-07T17:00:06.964 [INFO] Downloading:
2017-02-07T17:00:07.052 [INFO] Downloaded:
(23 KB at 250.7 KB/sec)
2017-02-07T17:00:07.087 [INFO] Downloading:
2017-02-07T17:00:07.150 [INFO] Downloaded:
(32 KB at 505.1 KB/sec)
2017-02-07T17:00:07.167 [INFO] Downloading:
2017-02-07T17:00:07.217 [INFO] Downloaded:
(14 KB at 272.9 KB/sec)
2017-02-07T17:00:07.235 [INFO] Downloading:
2017-02-07T17:00:07.277 [INFO] Downloaded:
(5 KB at 96.3 KB/sec)
2017-02-07T17:00:07.287 [INFO] Downloading:
2017-02-07T17:00:07.332 [INFO] Downloaded:
(4 KB at 73.7 KB/sec)
2017-02-07T17:00:07.338 [INFO] Downloading:
2017-02-07T17:00:07.381 [INFO] Downloaded:
(20 KB at 464.3 KB/sec)
2017-02-07T17:00:07.386 [INFO] Downloading:
2017-02-07T17:00:07.417 [INFO] Downloaded:
(7 KB at 212.9 KB/sec)
2017-02-07T17:00:07.420 [INFO] Downloading:
2017-02-07T17:00:07.459 [INFO] Downloaded:
(14 KB at 339.5 KB/sec)
2017-02-07T17:00:07.469 [INFO] Downloading:
2017-02-07T17:00:07.503 [INFO] Downloaded:
(2 KB at 55.0 KB/sec)
2017-02-07T17:00:07.511 [INFO] Downloading:
2017-02-07T17:00:07.550 [INFO] Downloaded:
(5 KB at 120.9 KB/sec)
2017-02-07T17:00:07.553 [INFO] Downloading:
2017-02-07T17:00:07.589 [INFO] Downloaded:
(13 KB at 358.2 KB/sec)
2017-02-07T17:00:07.600 [INFO] Downloading:
2017-02-07T17:00:07.637 [INFO] Downloaded:
(5 KB at 127.3 KB/sec)
2017-02-07T17:00:07.646 [INFO] Downloading:
2017-02-07T17:00:07.683 [INFO] Downloaded:
(2 KB at 37.8 KB/sec)
2017-02-07T17:00:07.686 [INFO] Downloading:
2017-02-07T17:00:07.717 [INFO] Downloaded:
(3 KB at 74.2 KB/sec)
2017-02-07T17:00:07.724 [INFO] Downloading:
2017-02-07T17:00:07.762 [INFO] Downloaded:
(8 KB at 203.2 KB/sec)
2017-02-07T17:00:07.765 [INFO] Downloading:
2017-02-07T17:00:07.806 [INFO] Downloaded:
(21 KB at 492.9 KB/sec)
2017-02-07T17:00:07.814 [INFO] Downloading:
2017-02-07T17:00:07.857 [INFO] Downloaded:
(1023 B at 23.2 KB/sec)
2017-02-07T17:00:07.862 [INFO] Downloading:
2017-02-07T17:00:07.893 [INFO] Downloaded:
(612 B at 19.3 KB/sec)
2017-02-07T17:00:07.903 [INFO] Downloading:
2017-02-07T17:00:07.939 [INFO] Downloaded:
(6 KB at 131.5 KB/sec)
2017-02-07T17:00:07.943 [INFO] Downloading:
2017-02-07T17:00:07.997 [INFO] Downloaded:
(2 KB at 34.8 KB/sec)
2017-02-07T17:00:08.001 [INFO] Downloading:
2017-02-07T17:00:08.049 [INFO] Downloaded:
(965 B at 19.6 KB/sec)
2017-02-07T17:00:08.057 [INFO] Downloading:
2017-02-07T17:00:08.095 [INFO] Downloaded:
(10 KB at 260.8 KB/sec)
2017-02-07T17:00:08.099 [INFO] Downloading:
2017-02-07T17:00:08.142 [INFO] Downloaded:
(11 KB at 242.5 KB/sec)
2017-02-07T17:00:08.160 [INFO] Downloading:
2017-02-07T17:00:08.193 [INFO] Downloaded:
(363 B at 10.7 KB/sec)
2017-02-07T17:00:08.204 [INFO] Downloading:
2017-02-07T17:00:08.247 [INFO] Downloaded:
(3 KB at 57.2 KB/sec)
2017-02-07T17:00:08.251 [INFO] Downloading:
2017-02-07T17:00:08.294 [INFO] Downloaded:
(14 KB at 317.8 KB/sec)
2017-02-07T17:00:08.312 [INFO] Downloading:
2017-02-07T17:00:08.350 [INFO] Downloaded:
(815 B at 20.9 KB/sec)
2017-02-07T17:00:08.357 [INFO] Downloading:
2017-02-07T17:00:08.391 [INFO] Downloaded:
(5 KB at 125.5 KB/sec)
2017-02-07T17:00:08.394 [INFO] Downloading:
2017-02-07T17:00:08.432 [INFO] Downloaded:
(17 KB at 444.5 KB/sec)
2017-02-07T17:00:08.441 [INFO] Downloading:
2017-02-07T17:00:08.472 [INFO] Downloaded:
(4 KB at 122.3 KB/sec)
2017-02-07T17:00:08.493 [INFO] Downloading:
2017-02-07T17:00:08.530 [INFO] Downloaded:
(4 KB at 106.5 KB/sec)
2017-02-07T17:00:08.533 [INFO] Downloading:
2017-02-07T17:00:08.565 [INFO] Downloaded:
(9 KB at 255.1 KB/sec)
2017-02-07T17:00:08.568 [INFO] Downloading:
2017-02-07T17:00:08.605 [INFO] Downloaded:
(9 KB at 220.7 KB/sec)
2017-02-07T17:00:08.672 [INFO] Downloading:
2017-02-07T17:00:08.689 [INFO] Downloading:
2017-02-07T17:00:08.702 [INFO] Downloading:
2017-02-07T17:00:08.739 [INFO] Downloading:
2017-02-07T17:00:08.756 [INFO] Downloading:
2017-02-07T17:00:08.804 [INFO] Downloading:
2017-02-07T17:00:08.808 [INFO] Downloaded:
(29 KB at 194.6 KB/sec)
2017-02-07T17:00:08.808 [INFO] Downloading:
2017-02-07T17:00:08.838 [INFO] Downloaded:
(6 KB at 57.7 KB/sec)
2017-02-07T17:00:08.839 [INFO] Downloading:
2017-02-07T17:00:08.857 [INFO] Downloaded:
(45 KB at 239.3 KB/sec)
2017-02-07T17:00:08.859 [INFO] Downloading:
2017-02-07T17:00:08.862 [INFO] Downloaded:
(53 KB at 327.5 KB/sec)
2017-02-07T17:00:08.862 [INFO] Downloading:
2017-02-07T17:00:08.869 [INFO] Downloaded:
(3 KB at 18.9 KB/sec)
2017-02-07T17:00:08.869 [INFO] Downloading:
2017-02-07T17:00:08.883 [INFO] Downloaded:
(44 KB at 304.6 KB/sec)
2017-02-07T17:00:08.887 [INFO] Downloading:
2017-02-07T17:00:08.910 [INFO] Downloaded:
(33 KB at 190.8 KB/sec)
2017-02-07T17:00:08.910 [INFO] Downloading:
2017-02-07T17:00:08.920 [INFO] Downloaded:
(192 KB at 1026.4 KB/sec)
2017-02-07T17:00:08.920 [INFO] Downloading:
2017-02-07T17:00:08.938 [INFO] Downloaded:
(5 KB at 21.9 KB/sec)
2017-02-07T17:00:08.939 [INFO] Downloading:
2017-02-07T17:00:08.950 [INFO] Downloaded:
(5 KB at 19.5 KB/sec)
2017-02-07T17:00:08.950 [INFO] Downloading:
2017-02-07T17:00:08.979 [INFO] Downloaded:
(46 KB at 192.3 KB/sec)
2017-02-07T17:00:09.033 [INFO] Downloaded:
(350 KB at 1187.2 KB/sec)
2017-02-07T17:00:09.041 [INFO] Downloaded:
(285 KB at 942.3 KB/sec)
2017-02-07T17:00:09.051 [INFO] Downloaded:
(246 KB at 793.2 KB/sec)
2017-02-07T17:00:09.176 [INFO] Downloaded:
(1467 KB at 3355.6 KB/sec)
2017-02-07T17:00:09.211 [ERROR] [ERROR] Some problems were encountered while processing the
[ERROR] Unresolveable build extension: Plugin kr.motd.maven:os-maven-plugin:1.4.0.Final or
one of its dependencies could not be resolved: Could not transfer artifact org.apache.maven:maven-model:jar:3.2.1
from/to central ( handshake alert:  unrecognized_name
2017-02-07T17:00:09.255 [ERROR] The build could not read 1 project -> [Help 1]
2017-02-07T17:00:09.256 [ERROR]   
2017-02-07T17:00:09.256 [ERROR]   The project org.apache.beam:beam-parent:0.6.0-SNAPSHOT (<>
has 1 error
2017-02-07T17:00:09.259 [ERROR]     Unresolveable build extension: Plugin kr.motd.maven:os-maven-plugin:1.4.0.Final
or one of its dependencies could not be resolved: Could not transfer artifact org.apache.maven:maven-model:jar:3.2.1
from/to central ( handshake alert:  unrecognized_name
-> [Help 2]
2017-02-07T17:00:09.259 [ERROR] 
2017-02-07T17:00:09.260 [ERROR] To see the full stack trace of the errors, re-run Maven with
the -e switch.
2017-02-07T17:00:09.260 [ERROR] Re-run Maven using the -X switch to enable full debug logging.
2017-02-07T17:00:09.260 [ERROR] 
2017-02-07T17:00:09.260 [ERROR] For more information about the errors and possible solutions,
please read the following articles:
2017-02-07T17:00:09.260 [ERROR] [Help 1]
2017-02-07T17:00:09.260 [ERROR] [Help 2]
channel stopped

View raw message