beam-commits mailing list archives

Site index · List index
Message view « Date » · « Thread »
Top « Date » · « Thread »
From Apache Jenkins Server <jenk...@builds.apache.org>
Subject Build failed in Jenkins: beam_PostCommit_Java_MavenInstall #2593
Date Fri, 10 Feb 2017 12:23:50 GMT
See <https://builds.apache.org/job/beam_PostCommit_Java_MavenInstall/2593/>

------------------------------------------
[...truncated 8429 lines...]
message: "Message"
log_location: "LoggerName"
thread: "12345"
>, <severity: WARN
timestamp {
  seconds: 1234567
  nanos: 890000000
}
message: "MessageWithException"
trace: "java.lang.RuntimeException: ExceptionMessage\n\tat org.apache.beam.fn.harness.logging.BeamFnLoggingClientTest.<clinit>(BeamFnLoggingClientTest.java:72)\n\tat
sun.reflect.NativeConstructorAccessorImpl.newInstance0(Native Method)\n\tat sun.reflect.NativeConstructorAccessorImpl.newInstance(NativeConstructorAccessorImpl.java:62)\n\tat
sun.reflect.DelegatingConstructorAccessorImpl.newInstance(DelegatingConstructorAccessorImpl.java:45)\n\tat
java.lang.reflect.Constructor.newInstance(Constructor.java:423)\n\tat org.junit.runners.BlockJUnit4ClassRunner.createTest(BlockJUnit4ClassRunner.java:217)\n\tat
org.junit.runners.BlockJUnit4ClassRunner$1.runReflectiveCall(BlockJUnit4ClassRunner.java:266)\n\tat
org.junit.internal.runners.model.ReflectiveCallable.run(ReflectiveCallable.java:12)\n\tat
org.junit.runners.BlockJUnit4ClassRunner.methodBlock(BlockJUnit4ClassRunner.java:263)\n\tat
org.junit.runners.BlockJUnit4ClassRunner.runChild(BlockJUnit4ClassRunner.java:78)\n\tat org.junit.runners.BlockJUnit4ClassRunner.runChild(BlockJUnit4ClassRunner.java:57)\n\tat
org.junit.runners.ParentRunner$3.run(ParentRunner.java:290)\n\tat org.junit.runners.ParentRunner$1.schedule(ParentRunner.java:71)\n\tat
org.junit.runners.ParentRunner.runChildren(ParentRunner.java:288)\n\tat org.junit.runners.ParentRunner.access$000(ParentRunner.java:58)\n\tat
org.junit.runners.ParentRunner$2.evaluate(ParentRunner.java:268)\n\tat org.junit.runners.ParentRunner.run(ParentRunner.java:363)\n\tat
org.junit.runners.Suite.runChild(Suite.java:128)\n\tat org.junit.runners.Suite.runChild(Suite.java:27)\n\tat
org.junit.runners.ParentRunner$3.run(ParentRunner.java:290)\n\tat org.junit.runners.ParentRunner$1.schedule(ParentRunner.java:71)\n\tat
org.junit.runners.ParentRunner.runChildren(ParentRunner.java:288)\n\tat org.junit.runners.ParentRunner.access$000(ParentRunner.java:58)\n\tat
org.junit.runners.ParentRunner$2.evaluate(ParentRunner.java:268)\n\tat org.junit.runners.ParentRunner.run(ParentRunner.java:363)\n\tat
org.apache.maven.surefire.junitcore.JUnitCore.run(JUnitCore.java:55)\n\tat org.apache.maven.surefire.junitcore.JUnitCoreWrapper.createRequestAndRun(JUnitCoreWrapper.java:137)\n\tat
org.apache.maven.surefire.junitcore.JUnitCoreWrapper.executeEager(JUnitCoreWrapper.java:107)\n\tat
org.apache.maven.surefire.junitcore.JUnitCoreWrapper.execute(JUnitCoreWrapper.java:83)\n\tat
org.apache.maven.surefire.junitcore.JUnitCoreWrapper.execute(JUnitCoreWrapper.java:75)\n\tat
org.apache.maven.surefire.junitcore.JUnitCoreProvider.invoke(JUnitCoreProvider.java:161)\n\tat
org.apache.maven.surefire.booter.ForkedBooter.invokeProviderInSameClassLoader(ForkedBooter.java:290)\n\tat
org.apache.maven.surefire.booter.ForkedBooter.runSuitesInProcess(ForkedBooter.java:242)\n\tat
org.apache.maven.surefire.booter.ForkedBooter.main(ForkedBooter.java:121)\n"
log_location: "LoggerName"
thread: "12345"
>]
     but: No item matched: <severity: DEBUG
timestamp {
  seconds: 1234567
  nanos: 890000000
}
message: "Message"
log_location: "LoggerName"
thread: "12345"
>
	at org.hamcrest.MatcherAssert.assertThat(MatcherAssert.java:20)
	at org.junit.Assert.assertThat(Assert.java:956)
	at org.junit.Assert.assertThat(Assert.java:923)
	at org.apache.beam.fn.harness.logging.BeamFnLoggingClientTest.testLogging(BeamFnLoggingClientTest.java:158)
	at sun.reflect.NativeMethodAccessorImpl.invoke0(Native Method)
	at sun.reflect.NativeMethodAccessorImpl.invoke(NativeMethodAccessorImpl.java:62)
	at sun.reflect.DelegatingMethodAccessorImpl.invoke(DelegatingMethodAccessorImpl.java:43)
	at java.lang.reflect.Method.invoke(Method.java:498)
	at org.junit.runners.model.FrameworkMethod$1.runReflectiveCall(FrameworkMethod.java:50)
	at org.junit.internal.runners.model.ReflectiveCallable.run(ReflectiveCallable.java:12)
	at org.junit.runners.model.FrameworkMethod.invokeExplosively(FrameworkMethod.java:47)
	at org.junit.internal.runners.statements.InvokeMethod.evaluate(InvokeMethod.java:17)
	at org.junit.runners.ParentRunner.runLeaf(ParentRunner.java:325)
	at org.junit.runners.BlockJUnit4ClassRunner.runChild(BlockJUnit4ClassRunner.java:78)
	at org.junit.runners.BlockJUnit4ClassRunner.runChild(BlockJUnit4ClassRunner.java:57)
	at org.junit.runners.ParentRunner$3.run(ParentRunner.java:290)
	at org.junit.runners.ParentRunner$1.schedule(ParentRunner.java:71)
	at org.junit.runners.ParentRunner.runChildren(ParentRunner.java:288)
	at org.junit.runners.ParentRunner.access$000(ParentRunner.java:58)
	at org.junit.runners.ParentRunner$2.evaluate(ParentRunner.java:268)
	at org.junit.runners.ParentRunner.run(ParentRunner.java:363)
	at org.junit.runners.Suite.runChild(Suite.java:128)
	at org.junit.runners.Suite.runChild(Suite.java:27)
	at org.junit.runners.ParentRunner$3.run(ParentRunner.java:290)
	at org.junit.runners.ParentRunner$1.schedule(ParentRunner.java:71)
	at org.junit.runners.ParentRunner.runChildren(ParentRunner.java:288)
	at org.junit.runners.ParentRunner.access$000(ParentRunner.java:58)
	at org.junit.runners.ParentRunner$2.evaluate(ParentRunner.java:268)
	at org.junit.runners.ParentRunner.run(ParentRunner.java:363)
	at org.apache.maven.surefire.junitcore.JUnitCore.run(JUnitCore.java:55)
	at org.apache.maven.surefire.junitcore.JUnitCoreWrapper.createRequestAndRun(JUnitCoreWrapper.java:137)
	at org.apache.maven.surefire.junitcore.JUnitCoreWrapper.executeEager(JUnitCoreWrapper.java:107)
	at org.apache.maven.surefire.junitcore.JUnitCoreWrapper.execute(JUnitCoreWrapper.java:83)
	at org.apache.maven.surefire.junitcore.JUnitCoreWrapper.execute(JUnitCoreWrapper.java:75)
	at org.apache.maven.surefire.junitcore.JUnitCoreProvider.invoke(JUnitCoreProvider.java:161)
	at org.apache.maven.surefire.booter.ForkedBooter.invokeProviderInSameClassLoader(ForkedBooter.java:290)
	at org.apache.maven.surefire.booter.ForkedBooter.runSuitesInProcess(ForkedBooter.java:242)
	at org.apache.maven.surefire.booter.ForkedBooter.main(ForkedBooter.java:121)


Results :

Failed tests: 
  BeamFnLoggingClientTest.testLogging:158 
Expected: iterable containing [<severity: DEBUG
timestamp {
  seconds: 1234567
  nanos: 890000000
}
message: "Message"
log_location: "LoggerName"
thread: "12345"
>, <severity: WARN
timestamp {
  seconds: 1234567
  nanos: 890000000
}
message: "MessageWithException"
trace: "java.lang.RuntimeException: ExceptionMessage\n\tat org.apache.beam.fn.harness.logging.BeamFnLoggingClientTest.<clinit>(BeamFnLoggingClientTest.java:72)\n\tat
sun.reflect.NativeConstructorAccessorImpl.newInstance0(Native Method)\n\tat sun.reflect.NativeConstructorAccessorImpl.newInstance(NativeConstructorAccessorImpl.java:62)\n\tat
sun.reflect.DelegatingConstructorAccessorImpl.newInstance(DelegatingConstructorAccessorImpl.java:45)\n\tat
java.lang.reflect.Constructor.newInstance(Constructor.java:423)\n\tat org.junit.runners.BlockJUnit4ClassRunner.createTest(BlockJUnit4ClassRunner.java:217)\n\tat
org.junit.runners.BlockJUnit4ClassRunner$1.runReflectiveCall(BlockJUnit4ClassRunner.java:266)\n\tat
org.junit.internal.runners.model.ReflectiveCallable.run(ReflectiveCallable.java:12)\n\tat
org.junit.runners.BlockJUnit4ClassRunner.methodBlock(BlockJUnit4ClassRunner.java:263)\n\tat
org.junit.runners.BlockJUnit4ClassRunner.runChild(BlockJUnit4ClassRunner.java:78)\n\tat org.junit.runners.BlockJUnit4ClassRunner.runChild(BlockJUnit4ClassRunner.java:57)\n\tat
org.junit.runners.ParentRunner$3.run(ParentRunner.java:290)\n\tat org.junit.runners.ParentRunner$1.schedule(ParentRunner.java:71)\n\tat
org.junit.runners.ParentRunner.runChildren(ParentRunner.java:288)\n\tat org.junit.runners.ParentRunner.access$000(ParentRunner.java:58)\n\tat
org.junit.runners.ParentRunner$2.evaluate(ParentRunner.java:268)\n\tat org.junit.runners.ParentRunner.run(ParentRunner.java:363)\n\tat
org.junit.runners.Suite.runChild(Suite.java:128)\n\tat org.junit.runners.Suite.runChild(Suite.java:27)\n\tat
org.junit.runners.ParentRunner$3.run(ParentRunner.java:290)\n\tat org.junit.runners.ParentRunner$1.schedule(ParentRunner.java:71)\n\tat
org.junit.runners.ParentRunner.runChildren(ParentRunner.java:288)\n\tat org.junit.runners.ParentRunner.access$000(ParentRunner.java:58)\n\tat
org.junit.runners.ParentRunner$2.evaluate(ParentRunner.java:268)\n\tat org.junit.runners.ParentRunner.run(ParentRunner.java:363)\n\tat
org.apache.maven.surefire.junitcore.JUnitCore.run(JUnitCore.java:55)\n\tat org.apache.maven.surefire.junitcore.JUnitCoreWrapper.createRequestAndRun(JUnitCoreWrapper.java:137)\n\tat
org.apache.maven.surefire.junitcore.JUnitCoreWrapper.executeEager(JUnitCoreWrapper.java:107)\n\tat
org.apache.maven.surefire.junitcore.JUnitCoreWrapper.execute(JUnitCoreWrapper.java:83)\n\tat
org.apache.maven.surefire.junitcore.JUnitCoreWrapper.execute(JUnitCoreWrapper.java:75)\n\tat
org.apache.maven.surefire.junitcore.JUnitCoreProvider.invoke(JUnitCoreProvider.java:161)\n\tat
org.apache.maven.surefire.booter.ForkedBooter.invokeProviderInSameClassLoader(ForkedBooter.java:290)\n\tat
org.apache.maven.surefire.booter.ForkedBooter.runSuitesInProcess(ForkedBooter.java:242)\n\tat
org.apache.maven.surefire.booter.ForkedBooter.main(ForkedBooter.java:121)\n"
log_location: "LoggerName"
thread: "12345"
>]
     but: No item matched: <severity: DEBUG
timestamp {
  seconds: 1234567
  nanos: 890000000
}
message: "Message"
log_location: "LoggerName"
thread: "12345"
>

Tests run: 49, Failures: 1, Errors: 0, Skipped: 0

2017-02-10T12:23:24.696 [INFO]                                                           
             
2017-02-10T12:23:24.696 [INFO] ------------------------------------------------------------------------
2017-02-10T12:23:24.696 [INFO] Skipping Apache Beam :: Parent
2017-02-10T12:23:24.696 [INFO] This project has been banned from the build due to previous
failures.
2017-02-10T12:23:24.696 [INFO] ------------------------------------------------------------------------
[JENKINS] Archiving disabled
[JENKINS] Archiving disabled
[JENKINS] Archiving disabled
[JENKINS] Archiving disabled
[JENKINS] Archiving disabled
[JENKINS] Archiving disabled
[JENKINS] Archiving disabled
[JENKINS] Archiving disabled
[JENKINS] Archiving disabled
[JENKINS] Archiving disabled
[JENKINS] Archiving disabled
[JENKINS] Archiving disabled
[JENKINS] Archiving disabled
[JENKINS] Archiving disabled
[JENKINS] Archiving disabled
[JENKINS] Archiving disabled
[JENKINS] Archiving disabled
[JENKINS] Archiving disabled
[JENKINS] Archiving disabled
[JENKINS] Archiving disabled
[JENKINS] Archiving disabled
[JENKINS] Archiving disabled
[JENKINS] Archiving disabled
[JENKINS] Archiving disabled
[JENKINS] Archiving disabled
[JENKINS] Archiving disabled
[JENKINS] Archiving disabled
[JENKINS] Archiving disabled
[JENKINS] Archiving disabled
[JENKINS] Archiving disabled
[JENKINS] Archiving disabled
[JENKINS] Archiving disabled
[JENKINS] Archiving disabled
[JENKINS] Archiving disabled
[JENKINS] Archiving disabled
[JENKINS] Archiving disabled
[JENKINS] Archiving disabled
2017-02-10T12:23:42.175 [INFO] ------------------------------------------------------------------------
2017-02-10T12:23:42.175 [INFO] Reactor Summary:
2017-02-10T12:23:42.175 [INFO] 
2017-02-10T12:23:42.175 [INFO] Apache Beam :: Parent .............................. SUCCESS
[ 23.413 s]
2017-02-10T12:23:42.175 [INFO] Apache Beam :: SDKs :: Java :: Build Tools ......... SUCCESS
[  3.764 s]
2017-02-10T12:23:42.175 [INFO] Apache Beam :: SDKs ................................ SUCCESS
[  6.214 s]
2017-02-10T12:23:42.175 [INFO] Apache Beam :: SDKs :: Common ...................... SUCCESS
[  1.472 s]
2017-02-10T12:23:42.175 [INFO] Apache Beam :: SDKs :: Common :: Fn API ............ SUCCESS
[ 19.589 s]
2017-02-10T12:23:42.175 [INFO] Apache Beam :: SDKs :: Common :: Runner API ........ SUCCESS
[ 12.749 s]
2017-02-10T12:23:42.175 [INFO] Apache Beam :: SDKs :: Java ........................ SUCCESS
[  1.876 s]
2017-02-10T12:23:42.175 [INFO] Apache Beam :: SDKs :: Java :: Core ................ SUCCESS
[03:26 min]
2017-02-10T12:23:42.175 [INFO] Apache Beam :: Runners ............................. SUCCESS
[  1.516 s]
2017-02-10T12:23:42.175 [INFO] Apache Beam :: Runners :: Core Java ................ SUCCESS
[ 53.316 s]
2017-02-10T12:23:42.175 [INFO] Apache Beam :: Runners :: Direct Java .............. SUCCESS
[03:44 min]
2017-02-10T12:23:42.175 [INFO] Apache Beam :: Runners :: Google Cloud Dataflow .... SUCCESS
[ 49.524 s]
2017-02-10T12:23:42.176 [INFO] Apache Beam :: SDKs :: Java :: IO .................. SUCCESS
[  1.354 s]
2017-02-10T12:23:42.176 [INFO] Apache Beam :: SDKs :: Java :: IO :: Google Cloud Platform
SUCCESS [04:07 min]
2017-02-10T12:23:42.176 [INFO] Apache Beam :: SDKs :: Java :: IO :: HDFS .......... SUCCESS
[ 36.129 s]
2017-02-10T12:23:42.176 [INFO] Apache Beam :: SDKs :: Java :: IO :: JMS ........... SUCCESS
[ 21.388 s]
2017-02-10T12:23:42.176 [INFO] Apache Beam :: SDKs :: Java :: IO :: Kafka ......... SUCCESS
[ 36.661 s]
2017-02-10T12:23:42.176 [INFO] Apache Beam :: SDKs :: Java :: IO :: Kinesis ....... SUCCESS
[ 23.998 s]
2017-02-10T12:23:42.176 [INFO] Apache Beam :: SDKs :: Java :: IO :: MongoDB ....... SUCCESS
[ 35.336 s]
2017-02-10T12:23:42.176 [INFO] Apache Beam :: SDKs :: Java :: IO :: JDBC .......... SUCCESS
[ 30.084 s]
2017-02-10T12:23:42.176 [INFO] Apache Beam :: SDKs :: Java :: IO :: Elasticsearch . SUCCESS
[ 46.401 s]
2017-02-10T12:23:42.176 [INFO] Apache Beam :: SDKs :: Java :: IO :: MQTT .......... SUCCESS
[ 20.252 s]
2017-02-10T12:23:42.176 [INFO] Apache Beam :: SDKs :: Java :: Maven Archetypes .... SUCCESS
[  1.517 s]
[JENKINS] Archiving disabled2017-02-10T12:23:42.176 [INFO] Apache Beam :: SDKs :: Java ::
Maven Archetypes :: Starter SUCCESS [ 24.435 s]
2017-02-10T12:23:42.176 [INFO] Apache Beam :: SDKs :: Java :: Maven Archetypes :: Examples
SUCCESS [ 22.984 s]
2017-02-10T12:23:42.177 [INFO] Apache Beam :: SDKs :: Java :: Maven Archetypes :: Examples
- Java 8 SUCCESS [ 31.569 s]

2017-02-10T12:23:42.177 [INFO] Apache Beam :: SDKs :: Java :: Extensions .......... SUCCESS
[  1.792 s]
2017-02-10T12:23:42.177 [INFO] Apache Beam :: SDKs :: Java :: Extensions :: Join library SUCCESS
[ 17.814 s]
2017-02-10T12:23:42.177 [INFO] Apache Beam :: SDKs :: Java :: Extensions :: Sorter  SUCCESS
[ 35.193 s]
2017-02-10T12:23:42.177 [INFO] Apache Beam :: SDKs :: Java :: Harness ............. FAILURE
[ 36.213 s]
2017-02-10T12:23:42.177 [INFO] Apache Beam :: SDKs :: Java :: Java 8 Tests ........ SKIPPED
2017-02-10T12:23:42.177 [INFO] Apache Beam :: SDKs :: Python ...................... SKIPPED
2017-02-10T12:23:42.177 [INFO] Apache Beam :: Runners :: Flink .................... SKIPPED
2017-02-10T12:23:42.177 [INFO] Apache Beam :: Runners :: Flink :: Core ............ SKIPPED
2017-02-10T12:23:42.177 [INFO] Apache Beam :: Runners :: Flink :: Examples ........ SKIPPED
2017-02-10T12:23:42.177 [INFO] Apache Beam :: Runners :: Spark .................... SKIPPED
2017-02-10T12:23:42.177 [INFO] Apache Beam :: Runners :: Apex ..................... SKIPPED
2017-02-10T12:23:42.177 [INFO] Apache Beam :: Examples ............................ SKIPPED
2017-02-10T12:23:42.177 [INFO] Apache Beam :: Examples :: Java .................... SKIPPED
2017-02-10T12:23:42.177 [INFO] Apache Beam :: Examples :: Java 8 .................. SKIPPED
2017-02-10T12:23:42.177 [INFO] Apache Beam :: SDKs :: Java :: Aggregated Javadoc .. SKIPPED
2017-02-10T12:23:42.177 [INFO] ------------------------------------------------------------------------
2017-02-10T12:23:42.177 [INFO] BUILD FAILURE
2017-02-10T12:23:42.177 [INFO] ------------------------------------------------------------------------
2017-02-10T12:23:42.177 [INFO] Total time: 22:11 min
2017-02-10T12:23:42.177 [INFO] Finished at: 2017-02-10T12:23:42+00:00
2017-02-10T12:23:44.276 [INFO] Final Memory: 186M/1486M
2017-02-10T12:23:44.276 [INFO] ------------------------------------------------------------------------
Waiting for Jenkins to finish collecting data
2017-02-10T12:23:45.698 [ERROR] Failed to execute goal org.apache.maven.plugins:maven-surefire-plugin:2.19.1:test
(default-test) on project beam-sdks-java-harness: There are test failures.
2017-02-10T12:23:45.698 [ERROR] 
2017-02-10T12:23:45.698 [ERROR] Please refer to <https://builds.apache.org/job/beam_PostCommit_Java_MavenInstall/ws/sdks/java/harness/target/surefire-reports>
for the individual test results.
2017-02-10T12:23:45.698 [ERROR] -> [Help 1]
org.apache.maven.lifecycle.LifecycleExecutionException: Failed to execute goal org.apache.maven.plugins:maven-surefire-plugin:2.19.1:test
(default-test) on project beam-sdks-java-harness: There are test failures.

Please refer to <https://builds.apache.org/job/beam_PostCommit_Java_MavenInstall/ws/sdks/java/harness/target/surefire-reports>
for the individual test results.
	at org.apache.maven.lifecycle.internal.MojoExecutor.execute(MojoExecutor.java:212)
	at org.apache.maven.lifecycle.internal.MojoExecutor.execute(MojoExecutor.java:153)
	at org.apache.maven.lifecycle.internal.MojoExecutor.execute(MojoExecutor.java:145)
	at org.apache.maven.lifecycle.internal.LifecycleModuleBuilder.buildProject(LifecycleModuleBuilder.java:116)
	at org.apache.maven.lifecycle.internal.LifecycleModuleBuilder.buildProject(LifecycleModuleBuilder.java:80)
	at org.apache.maven.lifecycle.internal.builder.singlethreaded.SingleThreadedBuilder.build(SingleThreadedBuilder.java:51)
	at org.apache.maven.lifecycle.internal.LifecycleStarter.execute(LifecycleStarter.java:128)
	at org.apache.maven.DefaultMaven.doExecute(DefaultMaven.java:307)
	at org.apache.maven.DefaultMaven.doExecute(DefaultMaven.java:193)
	at org.apache.maven.DefaultMaven.execute(DefaultMaven.java:106)
	at org.jvnet.hudson.maven3.launcher.Maven32Launcher.main(Maven32Launcher.java:132)
	at sun.reflect.NativeMethodAccessorImpl.invoke0(Native Method)
	at sun.reflect.NativeMethodAccessorImpl.invoke(NativeMethodAccessorImpl.java:62)
	at sun.reflect.DelegatingMethodAccessorImpl.invoke(DelegatingMethodAccessorImpl.java:43)
	at java.lang.reflect.Method.invoke(Method.java:498)
	at org.codehaus.plexus.classworlds.launcher.Launcher.launchStandard(Launcher.java:330)
	at org.codehaus.plexus.classworlds.launcher.Launcher.launch(Launcher.java:238)
	at jenkins.maven3.agent.Maven32Main.launch(Maven32Main.java:186)
	at sun.reflect.NativeMethodAccessorImpl.invoke0(Native Method)
	at sun.reflect.NativeMethodAccessorImpl.invoke(NativeMethodAccessorImpl.java:62)
	at sun.reflect.DelegatingMethodAccessorImpl.invoke(DelegatingMethodAccessorImpl.java:43)
	at java.lang.reflect.Method.invoke(Method.java:498)
	at hudson.maven.Maven3Builder.call(Maven3Builder.java:136)
	at hudson.maven.Maven3Builder.call(Maven3Builder.java:71)
	at hudson.remoting.UserRequest.perform(UserRequest.java:153)
	at hudson.remoting.UserRequest.perform(UserRequest.java:50)
	at hudson.remoting.Request$2.run(Request.java:332)
	at hudson.remoting.InterceptingExecutorService$1.call(InterceptingExecutorService.java:68)
	at java.util.concurrent.FutureTask.run(FutureTask.java:266)
	at java.util.concurrent.ThreadPoolExecutor.runWorker(ThreadPoolExecutor.java:1142)
	at java.util.concurrent.ThreadPoolExecutor$Worker.run(ThreadPoolExecutor.java:617)
	at java.lang.Thread.run(Thread.java:745)
Caused by: org.apache.maven.plugin.MojoFailureException: There are test failures.

Please refer to <https://builds.apache.org/job/beam_PostCommit_Java_MavenInstall/ws/sdks/java/harness/target/surefire-reports>
for the individual test results.
	at org.apache.maven.plugin.surefire.SurefireHelper.reportExecution(SurefireHelper.java:91)
	at org.apache.maven.plugin.surefire.SurefirePlugin.handleSummary(SurefirePlugin.java:320)
	at org.apache.maven.plugin.surefire.AbstractSurefireMojo.executeAfterPreconditionsChecked(AbstractSurefireMojo.java:892)
	at org.apache.maven.plugin.surefire.AbstractSurefireMojo.execute(AbstractSurefireMojo.java:755)
	at org.apache.maven.plugin.DefaultBuildPluginManager.executeMojo(DefaultBuildPluginManager.java:134)
	at org.apache.maven.lifecycle.internal.MojoExecutor.execute(MojoExecutor.java:208)
	... 31 more
2017-02-10T12:23:45.699 [ERROR] 
2017-02-10T12:23:45.699 [ERROR] Re-run Maven using the -X switch to enable full debug logging.
2017-02-10T12:23:45.699 [ERROR] 
2017-02-10T12:23:45.699 [ERROR] For more information about the errors and possible solutions,
please read the following articles:
2017-02-10T12:23:45.699 [ERROR] [Help 1] http://cwiki.apache.org/confluence/display/MAVEN/MojoFailureException
2017-02-10T12:23:45.699 [ERROR] 
2017-02-10T12:23:45.699 [ERROR] After correcting the problems, you can resume the build with
the command
2017-02-10T12:23:45.699 [ERROR]   mvn <goals> -rf :beam-sdks-java-harness
channel stopped

Mime
View raw message