beam-commits mailing list archives

Site index · List index
Message view « Date » · « Thread »
Top « Date » · « Thread »
From Apache Jenkins Server <jenk...@builds.apache.org>
Subject Build failed in Jenkins: beam_PostCommit_Java_MavenInstall #2564
Date Tue, 07 Feb 2017 18:37:54 GMT
See <https://builds.apache.org/job/beam_PostCommit_Java_MavenInstall/2564/changes>

Changes:

[altay] To add sdks/python/utils/profiler a MemoryReporter that tracks heap

------------------------------------------
[...truncated 26 lines...]
Modules changed, recalculating dependency graph
Established TCP socket on 36289
maven32-agent.jar already up to date
maven32-interceptor.jar already up to date
maven3-interceptor-commons.jar already up to date
[beam_PostCommit_Java_MavenInstall] $ /home/jenkins/tools/java/latest1.8/bin/java -Dorg.slf4j.simpleLogger.showDateTime=true
-Dorg.slf4j.simpleLogger.dateTimeFormat=yyyy-MM-dd'T'HH:mm:ss.SSS -cp /home/jenkins/jenkins-slave/maven32-agent.jar:/home/jenkins/tools/maven/apache-maven-3.3.3/boot/plexus-classworlds-2.5.2.jar:/home/jenkins/tools/maven/apache-maven-3.3.3/conf/logging
jenkins.maven3.agent.Maven32Main /home/jenkins/tools/maven/apache-maven-3.3.3 /home/jenkins/jenkins-slave/slave.jar
/home/jenkins/jenkins-slave/maven32-interceptor.jar /home/jenkins/jenkins-slave/maven3-interceptor-commons.jar
36289
<===[JENKINS REMOTING CAPACITY]===>   channel started
Executing Maven:  -B -f <https://builds.apache.org/job/beam_PostCommit_Java_MavenInstall/ws/pom.xml>
-Dmaven.repo.local=<https://builds.apache.org/job/beam_PostCommit_Java_MavenInstall/ws/.repository>
-B -e -P release,dataflow-runner clean install coveralls:report -DrepoToken=**** -DskipITs=false
-DintegrationTestPipelineOptions=[ "--project=apache-beam-testing", "--tempRoot=gs://temp-storage-for-end-to-end-tests",
"--runner=org.apache.beam.runners.dataflow.testing.TestDataflowRunner" ]
2017-02-07T18:37:37.913 [INFO] Error stacktraces are turned on.
2017-02-07T18:37:38.223 [INFO] Scanning for projects...
2017-02-07T18:37:39.467 [INFO] Downloading: https://repo.maven.apache.org/maven2/kr/motd/maven/os-maven-plugin/1.4.0.Final/os-maven-plugin-1.4.0.Final.pom
2017-02-07T18:37:39.789 [INFO] Downloaded: https://repo.maven.apache.org/maven2/kr/motd/maven/os-maven-plugin/1.4.0.Final/os-maven-plugin-1.4.0.Final.pom
(7 KB at 18.5 KB/sec)
2017-02-07T18:37:39.799 [INFO] Downloading: https://repo.maven.apache.org/maven2/org/sonatype/oss/oss-parent/9/oss-parent-9.pom
2017-02-07T18:37:39.838 [INFO] Downloaded: https://repo.maven.apache.org/maven2/org/sonatype/oss/oss-parent/9/oss-parent-9.pom
(7 KB at 164.5 KB/sec)
2017-02-07T18:37:39.850 [INFO] Downloading: https://repo.maven.apache.org/maven2/org/apache/maven/maven-plugin-api/3.2.1/maven-plugin-api-3.2.1.pom
2017-02-07T18:37:39.885 [INFO] Downloaded: https://repo.maven.apache.org/maven2/org/apache/maven/maven-plugin-api/3.2.1/maven-plugin-api-3.2.1.pom
(4 KB at 94.4 KB/sec)
2017-02-07T18:37:39.887 [INFO] Downloading: https://repo.maven.apache.org/maven2/org/apache/maven/maven/3.2.1/maven-3.2.1.pom
2017-02-07T18:37:39.939 [INFO] Downloaded: https://repo.maven.apache.org/maven2/org/apache/maven/maven/3.2.1/maven-3.2.1.pom
(23 KB at 424.2 KB/sec)
2017-02-07T18:37:39.944 [INFO] Downloading: https://repo.maven.apache.org/maven2/org/apache/maven/maven-parent/23/maven-parent-23.pom
2017-02-07T18:37:39.985 [INFO] Downloaded: https://repo.maven.apache.org/maven2/org/apache/maven/maven-parent/23/maven-parent-23.pom
(32 KB at 776.2 KB/sec)
2017-02-07T18:37:39.992 [INFO] Downloading: https://repo.maven.apache.org/maven2/org/apache/apache/13/apache-13.pom
2017-02-07T18:37:40.025 [INFO] Downloaded: https://repo.maven.apache.org/maven2/org/apache/apache/13/apache-13.pom
(14 KB at 413.5 KB/sec)
2017-02-07T18:37:40.035 [INFO] Downloading: https://repo.maven.apache.org/maven2/org/apache/maven/maven-model/3.2.1/maven-model-3.2.1.pom
2017-02-07T18:37:40.067 [INFO] Downloaded: https://repo.maven.apache.org/maven2/org/apache/maven/maven-model/3.2.1/maven-model-3.2.1.pom
(5 KB at 126.4 KB/sec)
2017-02-07T18:37:40.073 [INFO] Downloading: https://repo.maven.apache.org/maven2/org/codehaus/plexus/plexus-utils/3.0.17/plexus-utils-3.0.17.pom
2017-02-07T18:37:40.103 [INFO] Downloaded: https://repo.maven.apache.org/maven2/org/codehaus/plexus/plexus-utils/3.0.17/plexus-utils-3.0.17.pom
(4 KB at 110.5 KB/sec)
2017-02-07T18:37:40.106 [INFO] Downloading: https://repo.maven.apache.org/maven2/org/codehaus/plexus/plexus/3.3.1/plexus-3.3.1.pom
2017-02-07T18:37:40.141 [INFO] Downloaded: https://repo.maven.apache.org/maven2/org/codehaus/plexus/plexus/3.3.1/plexus-3.3.1.pom
(20 KB at 570.5 KB/sec)
2017-02-07T18:37:40.145 [INFO] Downloading: https://repo.maven.apache.org/maven2/org/sonatype/spice/spice-parent/17/spice-parent-17.pom
2017-02-07T18:37:40.177 [INFO] Downloaded: https://repo.maven.apache.org/maven2/org/sonatype/spice/spice-parent/17/spice-parent-17.pom
(7 KB at 206.3 KB/sec)
2017-02-07T18:37:40.179 [INFO] Downloading: https://repo.maven.apache.org/maven2/org/sonatype/forge/forge-parent/10/forge-parent-10.pom
2017-02-07T18:37:40.212 [INFO] Downloaded: https://repo.maven.apache.org/maven2/org/sonatype/forge/forge-parent/10/forge-parent-10.pom
(14 KB at 401.3 KB/sec)
2017-02-07T18:37:40.216 [INFO] Downloading: https://repo.maven.apache.org/maven2/org/apache/maven/maven-artifact/3.2.1/maven-artifact-3.2.1.pom
2017-02-07T18:37:40.247 [INFO] Downloaded: https://repo.maven.apache.org/maven2/org/apache/maven/maven-artifact/3.2.1/maven-artifact-3.2.1.pom
(2 KB at 62.1 KB/sec)
2017-02-07T18:37:40.254 [INFO] Downloading: https://repo.maven.apache.org/maven2/org/eclipse/sisu/org.eclipse.sisu.plexus/0.0.0.M5/org.eclipse.sisu.plexus-0.0.0.M5.pom
2017-02-07T18:37:40.284 [INFO] Downloaded: https://repo.maven.apache.org/maven2/org/eclipse/sisu/org.eclipse.sisu.plexus/0.0.0.M5/org.eclipse.sisu.plexus-0.0.0.M5.pom
(5 KB at 157.2 KB/sec)
2017-02-07T18:37:40.287 [INFO] Downloading: https://repo.maven.apache.org/maven2/org/eclipse/sisu/sisu-plexus/0.0.0.M5/sisu-plexus-0.0.0.M5.pom
2017-02-07T18:37:40.321 [INFO] Downloaded: https://repo.maven.apache.org/maven2/org/eclipse/sisu/sisu-plexus/0.0.0.M5/sisu-plexus-0.0.0.M5.pom
(13 KB at 379.2 KB/sec)
2017-02-07T18:37:40.324 [INFO] Downloading: https://repo.maven.apache.org/maven2/org/sonatype/oss/oss-parent/7/oss-parent-7.pom
2017-02-07T18:37:40.353 [INFO] Downloaded: https://repo.maven.apache.org/maven2/org/sonatype/oss/oss-parent/7/oss-parent-7.pom
(5 KB at 162.4 KB/sec)
2017-02-07T18:37:40.357 [INFO] Downloading: https://repo.maven.apache.org/maven2/javax/enterprise/cdi-api/1.0/cdi-api-1.0.pom
2017-02-07T18:37:40.386 [INFO] Downloaded: https://repo.maven.apache.org/maven2/javax/enterprise/cdi-api/1.0/cdi-api-1.0.pom
(2 KB at 50.0 KB/sec)
2017-02-07T18:37:40.388 [INFO] Downloading: https://repo.maven.apache.org/maven2/org/jboss/weld/weld-api-parent/1.0/weld-api-parent-1.0.pom
2017-02-07T18:37:40.417 [INFO] Downloaded: https://repo.maven.apache.org/maven2/org/jboss/weld/weld-api-parent/1.0/weld-api-parent-1.0.pom
(3 KB at 79.3 KB/sec)
2017-02-07T18:37:40.419 [INFO] Downloading: https://repo.maven.apache.org/maven2/org/jboss/weld/weld-api-bom/1.0/weld-api-bom-1.0.pom
2017-02-07T18:37:40.449 [INFO] Downloaded: https://repo.maven.apache.org/maven2/org/jboss/weld/weld-api-bom/1.0/weld-api-bom-1.0.pom
(8 KB at 257.4 KB/sec)
2017-02-07T18:37:40.451 [INFO] Downloading: https://repo.maven.apache.org/maven2/org/jboss/weld/weld-parent/6/weld-parent-6.pom
2017-02-07T18:37:40.485 [INFO] Downloaded: https://repo.maven.apache.org/maven2/org/jboss/weld/weld-parent/6/weld-parent-6.pom
(21 KB at 594.3 KB/sec)
2017-02-07T18:37:40.492 [INFO] Downloading: https://repo.maven.apache.org/maven2/javax/annotation/jsr250-api/1.0/jsr250-api-1.0.pom
2017-02-07T18:37:40.522 [INFO] Downloaded: https://repo.maven.apache.org/maven2/javax/annotation/jsr250-api/1.0/jsr250-api-1.0.pom
(1023 B at 33.3 KB/sec)
2017-02-07T18:37:40.525 [INFO] Downloading: https://repo.maven.apache.org/maven2/javax/inject/javax.inject/1/javax.inject-1.pom
2017-02-07T18:37:40.553 [INFO] Downloaded: https://repo.maven.apache.org/maven2/javax/inject/javax.inject/1/javax.inject-1.pom
(612 B at 21.3 KB/sec)
2017-02-07T18:37:40.556 [INFO] Downloading: https://repo.maven.apache.org/maven2/com/google/guava/guava/10.0.1/guava-10.0.1.pom
2017-02-07T18:37:40.587 [INFO] Downloaded: https://repo.maven.apache.org/maven2/com/google/guava/guava/10.0.1/guava-10.0.1.pom
(6 KB at 169.6 KB/sec)
2017-02-07T18:37:40.590 [INFO] Downloading: https://repo.maven.apache.org/maven2/com/google/guava/guava-parent/10.0.1/guava-parent-10.0.1.pom
2017-02-07T18:37:40.620 [INFO] Downloaded: https://repo.maven.apache.org/maven2/com/google/guava/guava-parent/10.0.1/guava-parent-10.0.1.pom
(2 KB at 63.8 KB/sec)
2017-02-07T18:37:40.623 [INFO] Downloading: https://repo.maven.apache.org/maven2/com/google/code/findbugs/jsr305/1.3.9/jsr305-1.3.9.pom
2017-02-07T18:37:40.652 [INFO] Downloaded: https://repo.maven.apache.org/maven2/com/google/code/findbugs/jsr305/1.3.9/jsr305-1.3.9.pom
(965 B at 32.5 KB/sec)
2017-02-07T18:37:40.655 [INFO] Downloading: https://repo.maven.apache.org/maven2/org/sonatype/sisu/sisu-guice/3.1.0/sisu-guice-3.1.0.pom
2017-02-07T18:37:40.688 [INFO] Downloaded: https://repo.maven.apache.org/maven2/org/sonatype/sisu/sisu-guice/3.1.0/sisu-guice-3.1.0.pom
(10 KB at 300.3 KB/sec)
2017-02-07T18:37:40.691 [INFO] Downloading: https://repo.maven.apache.org/maven2/org/sonatype/sisu/inject/guice-parent/3.1.0/guice-parent-3.1.0.pom
2017-02-07T18:37:40.724 [INFO] Downloaded: https://repo.maven.apache.org/maven2/org/sonatype/sisu/inject/guice-parent/3.1.0/guice-parent-3.1.0.pom
(11 KB at 323.3 KB/sec)
2017-02-07T18:37:40.728 [INFO] Downloading: https://repo.maven.apache.org/maven2/aopalliance/aopalliance/1.0/aopalliance-1.0.pom
2017-02-07T18:37:40.760 [INFO] Downloaded: https://repo.maven.apache.org/maven2/aopalliance/aopalliance/1.0/aopalliance-1.0.pom
(363 B at 11.1 KB/sec)
2017-02-07T18:37:40.763 [INFO] Downloading: https://repo.maven.apache.org/maven2/org/eclipse/sisu/org.eclipse.sisu.inject/0.0.0.M5/org.eclipse.sisu.inject-0.0.0.M5.pom
2017-02-07T18:37:40.792 [INFO] Downloaded: https://repo.maven.apache.org/maven2/org/eclipse/sisu/org.eclipse.sisu.inject/0.0.0.M5/org.eclipse.sisu.inject-0.0.0.M5.pom
(3 KB at 84.9 KB/sec)
2017-02-07T18:37:40.794 [INFO] Downloading: https://repo.maven.apache.org/maven2/org/eclipse/sisu/sisu-inject/0.0.0.M5/sisu-inject-0.0.0.M5.pom
2017-02-07T18:37:40.827 [INFO] Downloaded: https://repo.maven.apache.org/maven2/org/eclipse/sisu/sisu-inject/0.0.0.M5/sisu-inject-0.0.0.M5.pom
(14 KB at 414.2 KB/sec)
2017-02-07T18:37:40.832 [INFO] Downloading: https://repo.maven.apache.org/maven2/org/codehaus/plexus/plexus-component-annotations/1.5.5/plexus-component-annotations-1.5.5.pom
2017-02-07T18:37:40.860 [INFO] Downloaded: https://repo.maven.apache.org/maven2/org/codehaus/plexus/plexus-component-annotations/1.5.5/plexus-component-annotations-1.5.5.pom
(815 B at 28.4 KB/sec)
2017-02-07T18:37:40.863 [INFO] Downloading: https://repo.maven.apache.org/maven2/org/codehaus/plexus/plexus-containers/1.5.5/plexus-containers-1.5.5.pom
2017-02-07T18:37:40.893 [INFO] Downloaded: https://repo.maven.apache.org/maven2/org/codehaus/plexus/plexus-containers/1.5.5/plexus-containers-1.5.5.pom
(5 KB at 138.0 KB/sec)
2017-02-07T18:37:40.895 [INFO] Downloading: https://repo.maven.apache.org/maven2/org/codehaus/plexus/plexus/2.0.7/plexus-2.0.7.pom
2017-02-07T18:37:40.928 [INFO] Downloaded: https://repo.maven.apache.org/maven2/org/codehaus/plexus/plexus/2.0.7/plexus-2.0.7.pom
(17 KB at 511.8 KB/sec)
2017-02-07T18:37:40.933 [INFO] Downloading: https://repo.maven.apache.org/maven2/org/codehaus/plexus/plexus-classworlds/2.4/plexus-classworlds-2.4.pom
2017-02-07T18:37:40.961 [INFO] Downloaded: https://repo.maven.apache.org/maven2/org/codehaus/plexus/plexus-classworlds/2.4/plexus-classworlds-2.4.pom
(4 KB at 130.8 KB/sec)
2017-02-07T18:37:40.964 [INFO] Downloading: https://repo.maven.apache.org/maven2/org/codehaus/plexus/plexus-utils/2.1/plexus-utils-2.1.pom
2017-02-07T18:37:41.004 [INFO] Downloaded: https://repo.maven.apache.org/maven2/org/codehaus/plexus/plexus-utils/2.1/plexus-utils-2.1.pom
(4 KB at 101.0 KB/sec)
2017-02-07T18:37:41.007 [INFO] Downloading: https://repo.maven.apache.org/maven2/org/sonatype/spice/spice-parent/16/spice-parent-16.pom
2017-02-07T18:37:41.037 [INFO] Downloaded: https://repo.maven.apache.org/maven2/org/sonatype/spice/spice-parent/16/spice-parent-16.pom
(9 KB at 272.1 KB/sec)
2017-02-07T18:37:41.039 [INFO] Downloading: https://repo.maven.apache.org/maven2/org/sonatype/forge/forge-parent/5/forge-parent-5.pom
2017-02-07T18:37:41.070 [INFO] Downloaded: https://repo.maven.apache.org/maven2/org/sonatype/forge/forge-parent/5/forge-parent-5.pom
(9 KB at 263.5 KB/sec)
2017-02-07T18:37:41.087 [INFO] Downloading: https://repo.maven.apache.org/maven2/kr/motd/maven/os-maven-plugin/1.4.0.Final/os-maven-plugin-1.4.0.Final.jar
2017-02-07T18:37:41.089 [INFO] Downloading: https://repo.maven.apache.org/maven2/org/apache/maven/maven-model/3.2.1/maven-model-3.2.1.jar
2017-02-07T18:37:41.090 [INFO] Downloading: https://repo.maven.apache.org/maven2/org/apache/maven/maven-plugin-api/3.2.1/maven-plugin-api-3.2.1.jar
2017-02-07T18:37:41.090 [INFO] Downloading: https://repo.maven.apache.org/maven2/org/apache/maven/maven-artifact/3.2.1/maven-artifact-3.2.1.jar
2017-02-07T18:37:41.091 [INFO] Downloading: https://repo.maven.apache.org/maven2/org/eclipse/sisu/org.eclipse.sisu.plexus/0.0.0.M5/org.eclipse.sisu.plexus-0.0.0.M5.jar
2017-02-07T18:37:41.128 [INFO] Downloading: https://repo.maven.apache.org/maven2/javax/enterprise/cdi-api/1.0/cdi-api-1.0.jar
2017-02-07T18:37:41.173 [INFO] Downloaded: https://repo.maven.apache.org/maven2/org/apache/maven/maven-artifact/3.2.1/maven-artifact-3.2.1.jar
(53 KB at 616.4 KB/sec)
2017-02-07T18:37:41.173 [INFO] Downloading: https://repo.maven.apache.org/maven2/javax/annotation/jsr250-api/1.0/jsr250-api-1.0.jar
2017-02-07T18:37:41.175 [INFO] Downloaded: https://repo.maven.apache.org/maven2/kr/motd/maven/os-maven-plugin/1.4.0.Final/os-maven-plugin-1.4.0.Final.jar
(29 KB at 314.9 KB/sec)
2017-02-07T18:37:41.175 [INFO] Downloading: https://repo.maven.apache.org/maven2/javax/inject/javax.inject/1/javax.inject-1.jar
2017-02-07T18:37:41.177 [INFO] Downloaded: https://repo.maven.apache.org/maven2/org/apache/maven/maven-plugin-api/3.2.1/maven-plugin-api-3.2.1.jar
(45 KB at 497.3 KB/sec)
2017-02-07T18:37:41.177 [INFO] Downloading: https://repo.maven.apache.org/maven2/com/google/guava/guava/10.0.1/guava-10.0.1.jar
2017-02-07T18:37:41.182 [INFO] Downloaded: https://repo.maven.apache.org/maven2/org/apache/maven/maven-model/3.2.1/maven-model-3.2.1.jar
(157 KB at 1643.2 KB/sec)
2017-02-07T18:37:41.182 [INFO] Downloading: https://repo.maven.apache.org/maven2/com/google/code/findbugs/jsr305/1.3.9/jsr305-1.3.9.jar
2017-02-07T18:37:41.202 [INFO] Downloaded: https://repo.maven.apache.org/maven2/javax/enterprise/cdi-api/1.0/cdi-api-1.0.jar
(44 KB at 395.1 KB/sec)
2017-02-07T18:37:41.202 [INFO] Downloaded: https://repo.maven.apache.org/maven2/javax/annotation/jsr250-api/1.0/jsr250-api-1.0.jar
(6 KB at 51.4 KB/sec)
2017-02-07T18:37:41.202 [INFO] Downloading: https://repo.maven.apache.org/maven2/org/sonatype/sisu/sisu-guice/3.1.0/sisu-guice-3.1.0-no_aop.jar
2017-02-07T18:37:41.202 [INFO] Downloading: https://repo.maven.apache.org/maven2/aopalliance/aopalliance/1.0/aopalliance-1.0.jar
2017-02-07T18:37:41.213 [INFO] Downloaded: https://repo.maven.apache.org/maven2/javax/inject/javax.inject/1/javax.inject-1.jar
(3 KB at 20.3 KB/sec)
2017-02-07T18:37:41.213 [INFO] Downloading: https://repo.maven.apache.org/maven2/org/eclipse/sisu/org.eclipse.sisu.inject/0.0.0.M5/org.eclipse.sisu.inject-0.0.0.M5.jar
2017-02-07T18:37:41.217 [INFO] Downloaded: https://repo.maven.apache.org/maven2/com/google/code/findbugs/jsr305/1.3.9/jsr305-1.3.9.jar
(33 KB at 260.0 KB/sec)
2017-02-07T18:37:41.218 [INFO] Downloading: https://repo.maven.apache.org/maven2/org/codehaus/plexus/plexus-component-annotations/1.5.5/plexus-component-annotations-1.5.5.jar
2017-02-07T18:37:41.231 [INFO] Downloaded: https://repo.maven.apache.org/maven2/aopalliance/aopalliance/1.0/aopalliance-1.0.jar
(5 KB at 31.6 KB/sec)
2017-02-07T18:37:41.231 [INFO] Downloading: https://repo.maven.apache.org/maven2/org/codehaus/plexus/plexus-classworlds/2.4/plexus-classworlds-2.4.jar
2017-02-07T18:37:41.246 [INFO] Downloaded: https://repo.maven.apache.org/maven2/org/codehaus/plexus/plexus-component-annotations/1.5.5/plexus-component-annotations-1.5.5.jar
(5 KB at 27.1 KB/sec)
2017-02-07T18:37:41.246 [INFO] Downloading: https://repo.maven.apache.org/maven2/org/codehaus/plexus/plexus-utils/3.0.17/plexus-utils-3.0.17.jar
2017-02-07T18:37:41.271 [INFO] Downloaded: https://repo.maven.apache.org/maven2/org/codehaus/plexus/plexus-classworlds/2.4/plexus-classworlds-2.4.jar
(46 KB at 259.6 KB/sec)
2017-02-07T18:37:41.305 [INFO] Downloaded: https://repo.maven.apache.org/maven2/org/eclipse/sisu/org.eclipse.sisu.inject/0.0.0.M5/org.eclipse.sisu.inject-0.0.0.M5.jar
(285 KB at 1348.7 KB/sec)
2017-02-07T18:37:41.311 [INFO] Downloaded: https://repo.maven.apache.org/maven2/org/sonatype/sisu/sisu-guice/3.1.0/sisu-guice-3.1.0-no_aop.jar
(350 KB at 1601.1 KB/sec)
2017-02-07T18:37:41.329 [INFO] Downloaded: https://repo.maven.apache.org/maven2/org/codehaus/plexus/plexus-utils/3.0.17/plexus-utils-3.0.17.jar
(246 KB at 1050.8 KB/sec)
2017-02-07T18:37:41.420 [INFO] Downloaded: https://repo.maven.apache.org/maven2/com/google/guava/guava/10.0.1/guava-10.0.1.jar
(1467 KB at 4484.3 KB/sec)
2017-02-07T18:37:41.440 [ERROR] [ERROR] Some problems were encountered while processing the
POMs:
[ERROR] Unresolveable build extension: Plugin kr.motd.maven:os-maven-plugin:1.4.0.Final or
one of its dependencies could not be resolved: Could not transfer artifact org.eclipse.sisu:org.eclipse.sisu.plexus:jar:0.0.0.M5
from/to central (https://repo.maven.apache.org/maven2): handshake alert:  unrecognized_name
@ 
 @ 
2017-02-07T18:37:41.443 [ERROR] The build could not read 1 project -> [Help 1]
org.apache.maven.project.ProjectBuildingException: Some problems were encountered while processing
the POMs:
[ERROR] Unresolveable build extension: Plugin kr.motd.maven:os-maven-plugin:1.4.0.Final or
one of its dependencies could not be resolved: Could not transfer artifact org.eclipse.sisu:org.eclipse.sisu.plexus:jar:0.0.0.M5
from/to central (https://repo.maven.apache.org/maven2): handshake alert:  unrecognized_name
@ 

	at org.apache.maven.project.DefaultProjectBuilder.build(DefaultProjectBuilder.java:422)
	at org.apache.maven.graph.DefaultGraphBuilder.collectProjects(DefaultGraphBuilder.java:419)
	at org.apache.maven.graph.DefaultGraphBuilder.getProjectsForMavenReactor(DefaultGraphBuilder.java:410)
	at org.apache.maven.graph.DefaultGraphBuilder.build(DefaultGraphBuilder.java:83)
	at org.apache.maven.DefaultMaven.buildGraph(DefaultMaven.java:491)
	at org.apache.maven.DefaultMaven.doExecute(DefaultMaven.java:219)
	at org.apache.maven.DefaultMaven.doExecute(DefaultMaven.java:193)
	at org.apache.maven.DefaultMaven.execute(DefaultMaven.java:106)
	at org.jvnet.hudson.maven3.launcher.Maven32Launcher.main(Maven32Launcher.java:132)
	at sun.reflect.NativeMethodAccessorImpl.invoke0(Native Method)
	at sun.reflect.NativeMethodAccessorImpl.invoke(NativeMethodAccessorImpl.java:62)
	at sun.reflect.DelegatingMethodAccessorImpl.invoke(DelegatingMethodAccessorImpl.java:43)
	at java.lang.reflect.Method.invoke(Method.java:498)
	at org.codehaus.plexus.classworlds.launcher.Launcher.launchStandard(Launcher.java:330)
	at org.codehaus.plexus.classworlds.launcher.Launcher.launch(Launcher.java:238)
	at jenkins.maven3.agent.Maven32Main.launch(Maven32Main.java:186)
	at sun.reflect.NativeMethodAccessorImpl.invoke0(Native Method)
	at sun.reflect.NativeMethodAccessorImpl.invoke(NativeMethodAccessorImpl.java:62)
	at sun.reflect.DelegatingMethodAccessorImpl.invoke(DelegatingMethodAccessorImpl.java:43)
	at java.lang.reflect.Method.invoke(Method.java:498)
	at hudson.maven.Maven3Builder.call(Maven3Builder.java:136)
	at hudson.maven.Maven3Builder.call(Maven3Builder.java:71)
	at hudson.remoting.UserRequest.perform(UserRequest.java:153)
	at hudson.remoting.UserRequest.perform(UserRequest.java:50)
	at hudson.remoting.Request$2.run(Request.java:332)
	at hudson.remoting.InterceptingExecutorService$1.call(InterceptingExecutorService.java:68)
	at java.util.concurrent.FutureTask.run(FutureTask.java:266)
	at java.util.concurrent.ThreadPoolExecutor.runWorker(ThreadPoolExecutor.java:1142)
	at java.util.concurrent.ThreadPoolExecutor$Worker.run(ThreadPoolExecutor.java:617)
	at java.lang.Thread.run(Thread.java:745)
2017-02-07T18:37:41.445 [ERROR]   
2017-02-07T18:37:41.445 [ERROR]   The project org.apache.beam:beam-parent:0.6.0-SNAPSHOT (<https://builds.apache.org/job/beam_PostCommit_Java_MavenInstall/ws/pom.xml)>
has 1 error
2017-02-07T18:37:41.445 [ERROR]     Unresolveable build extension: Plugin kr.motd.maven:os-maven-plugin:1.4.0.Final
or one of its dependencies could not be resolved: Could not transfer artifact org.eclipse.sisu:org.eclipse.sisu.plexus:jar:0.0.0.M5
from/to central (https://repo.maven.apache.org/maven2): handshake alert:  unrecognized_name
-> [Help 2]
org.apache.maven.plugin.PluginManagerException: Plugin kr.motd.maven:os-maven-plugin:1.4.0.Final
or one of its dependencies could not be resolved: Could not transfer artifact org.eclipse.sisu:org.eclipse.sisu.plexus:jar:0.0.0.M5
from/to central (https://repo.maven.apache.org/maven2): handshake alert:  unrecognized_name
	at org.apache.maven.plugin.internal.DefaultMavenPluginManager.setupExtensionsRealm(DefaultMavenPluginManager.java:874)
	at org.apache.maven.project.DefaultProjectBuildingHelper.createProjectRealm(DefaultProjectBuildingHelper.java:196)
	at org.apache.maven.project.DefaultModelBuildingListener.buildExtensionsAssembled(DefaultModelBuildingListener.java:111)
	at org.apache.maven.model.building.ModelBuildingEventCatapult$1.fire(ModelBuildingEventCatapult.java:44)
	at org.apache.maven.model.building.DefaultModelBuilder.fireEvent(DefaultModelBuilder.java:1270)
	at org.apache.maven.model.building.DefaultModelBuilder.build(DefaultModelBuilder.java:437)
	at org.apache.maven.model.building.DefaultModelBuilder.build(DefaultModelBuilder.java:417)
	at org.apache.maven.project.DefaultProjectBuilder.build(DefaultProjectBuilder.java:620)
	at org.apache.maven.project.DefaultProjectBuilder.build(DefaultProjectBuilder.java:411)
	at org.apache.maven.graph.DefaultGraphBuilder.collectProjects(DefaultGraphBuilder.java:419)
	at org.apache.maven.graph.DefaultGraphBuilder.getProjectsForMavenReactor(DefaultGraphBuilder.java:410)
	at org.apache.maven.graph.DefaultGraphBuilder.build(DefaultGraphBuilder.java:83)
	at org.apache.maven.DefaultMaven.buildGraph(DefaultMaven.java:491)
	at org.apache.maven.DefaultMaven.doExecute(DefaultMaven.java:219)
	at org.apache.maven.DefaultMaven.doExecute(DefaultMaven.java:193)
	at org.apache.maven.DefaultMaven.execute(DefaultMaven.java:106)
	at org.jvnet.hudson.maven3.launcher.Maven32Launcher.main(Maven32Launcher.java:132)
	at sun.reflect.NativeMethodAccessorImpl.invoke0(Native Method)
	at sun.reflect.NativeMethodAccessorImpl.invoke(NativeMethodAccessorImpl.java:62)
	at sun.reflect.DelegatingMethodAccessorImpl.invoke(DelegatingMethodAccessorImpl.java:43)
	at java.lang.reflect.Method.invoke(Method.java:498)
	at org.codehaus.plexus.classworlds.launcher.Launcher.launchStandard(Launcher.java:330)
	at org.codehaus.plexus.classworlds.launcher.Launcher.launch(Launcher.java:238)
	at jenkins.maven3.agent.Maven32Main.launch(Maven32Main.java:186)
	at sun.reflect.NativeMethodAccessorImpl.invoke0(Native Method)
	at sun.reflect.NativeMethodAccessorImpl.invoke(NativeMethodAccessorImpl.java:62)
	at sun.reflect.DelegatingMethodAccessorImpl.invoke(DelegatingMethodAccessorImpl.java:43)
	at java.lang.reflect.Method.invoke(Method.java:498)
	at hudson.maven.Maven3Builder.call(Maven3Builder.java:136)
	at hudson.maven.Maven3Builder.call(Maven3Builder.java:71)
	at hudson.remoting.UserRequest.perform(UserRequest.java:153)
	at hudson.remoting.UserRequest.perform(UserRequest.java:50)
	at hudson.remoting.Request$2.run(Request.java:332)
	at hudson.remoting.InterceptingExecutorService$1.call(InterceptingExecutorService.java:68)
	at java.util.concurrent.FutureTask.run(FutureTask.java:266)
	at java.util.concurrent.ThreadPoolExecutor.runWorker(ThreadPoolExecutor.java:1142)
	at java.util.concurrent.ThreadPoolExecutor$Worker.run(ThreadPoolExecutor.java:617)
	at java.lang.Thread.run(Thread.java:745)
Caused by: org.apache.maven.plugin.PluginResolutionException: Plugin kr.motd.maven:os-maven-plugin:1.4.0.Final
or one of its dependencies could not be resolved: Could not transfer artifact org.eclipse.sisu:org.eclipse.sisu.plexus:jar:0.0.0.M5
from/to central (https://repo.maven.apache.org/maven2): handshake alert:  unrecognized_name
	at org.apache.maven.plugin.internal.DefaultPluginDependenciesResolver.resolveInternal(DefaultPluginDependenciesResolver.java:218)
	at org.apache.maven.plugin.internal.DefaultPluginDependenciesResolver.resolve(DefaultPluginDependenciesResolver.java:149)
	at org.apache.maven.plugin.internal.DefaultMavenPluginManager.resolveExtensionArtifacts(DefaultMavenPluginManager.java:940)
	at org.apache.maven.plugin.internal.DefaultMavenPluginManager.setupExtensionsRealm(DefaultMavenPluginManager.java:867)
	... 37 more
Caused by: org.eclipse.aether.resolution.ArtifactResolutionException: Could not transfer artifact
org.eclipse.sisu:org.eclipse.sisu.plexus:jar:0.0.0.M5 from/to central (https://repo.maven.apache.org/maven2):
handshake alert:  unrecognized_name
	at org.eclipse.aether.internal.impl.DefaultArtifactResolver.resolve(DefaultArtifactResolver.java:444)
	at org.eclipse.aether.internal.impl.DefaultArtifactResolver.resolveArtifacts(DefaultArtifactResolver.java:246)
	at org.eclipse.aether.internal.impl.DefaultRepositorySystem.resolveDependencies(DefaultRepositorySystem.java:367)
	at org.apache.maven.plugin.internal.DefaultPluginDependenciesResolver.resolveInternal(DefaultPluginDependenciesResolver.java:210)
	... 40 more
Caused by: org.eclipse.aether.transfer.ArtifactTransferException: Could not transfer artifact
org.eclipse.sisu:org.eclipse.sisu.plexus:jar:0.0.0.M5 from/to central (https://repo.maven.apache.org/maven2):
handshake alert:  unrecognized_name
	at org.eclipse.aether.connector.basic.ArtifactTransportListener.transferFailed(ArtifactTransportListener.java:43)
	at org.eclipse.aether.connector.basic.BasicRepositoryConnector$TaskRunner.run(BasicRepositoryConnector.java:355)
	at org.eclipse.aether.util.concurrency.RunnableErrorForwarder$1.run(RunnableErrorForwarder.java:67)
	... 3 more
Caused by: org.apache.maven.wagon.TransferFailedException: handshake alert:  unrecognized_name
	at org.apache.maven.wagon.providers.http.AbstractHttpClientWagon.fillInputData(AbstractHttpClientWagon.java:1066)
	at org.apache.maven.wagon.providers.http.AbstractHttpClientWagon.fillInputData(AbstractHttpClientWagon.java:960)
	at org.apache.maven.wagon.StreamWagon.getInputStream(StreamWagon.java:116)
	at org.apache.maven.wagon.StreamWagon.getIfNewer(StreamWagon.java:88)
	at org.apache.maven.wagon.StreamWagon.get(StreamWagon.java:61)
	at org.eclipse.aether.transport.wagon.WagonTransporter$GetTaskRunner.run(WagonTransporter.java:560)
	at org.eclipse.aether.transport.wagon.WagonTransporter.execute(WagonTransporter.java:427)
	at org.eclipse.aether.transport.wagon.WagonTransporter.get(WagonTransporter.java:404)
	at org.eclipse.aether.connector.basic.BasicRepositoryConnector$GetTaskRunner.runTask(BasicRepositoryConnector.java:447)
	at org.eclipse.aether.connector.basic.BasicRepositoryConnector$TaskRunner.run(BasicRepositoryConnector.java:350)
	... 4 more
Caused by: javax.net.ssl.SSLProtocolException: handshake alert:  unrecognized_name
	at sun.security.ssl.ClientHandshaker.handshakeAlert(ClientHandshaker.java:1441)
	at sun.security.ssl.SSLSocketImpl.recvAlert(SSLSocketImpl.java:2016)
	at sun.security.ssl.SSLSocketImpl.readRecord(SSLSocketImpl.java:1125)
	at sun.security.ssl.SSLSocketImpl.performInitialHandshake(SSLSocketImpl.java:1375)
	at sun.security.ssl.SSLSocketImpl.startHandshake(SSLSocketImpl.java:1403)
	at sun.security.ssl.SSLSocketImpl.startHandshake(SSLSocketImpl.java:1387)
	at org.apache.maven.wagon.providers.http.httpclient.conn.ssl.SSLConnectionSocketFactory.createLayeredSocket(SSLConnectionSocketFactory.java:275)
	at org.apache.maven.wagon.providers.http.httpclient.conn.ssl.SSLConnectionSocketFactory.connectSocket(SSLConnectionSocketFactory.java:254)
	at org.apache.maven.wagon.providers.http.httpclient.impl.conn.HttpClientConnectionOperator.connect(HttpClientConnectionOperator.java:123)
	at org.apache.maven.wagon.providers.http.httpclient.impl.conn.PoolingHttpClientConnectionManager.connect(PoolingHttpClientConnectionManager.java:318)
	at org.apache.maven.wagon.providers.http.httpclient.impl.execchain.MainClientExec.establishRoute(MainClientExec.java:363)
	at org.apache.maven.wagon.providers.http.httpclient.impl.execchain.MainClientExec.execute(MainClientExec.java:219)
	at org.apache.maven.wagon.providers.http.httpclient.impl.execchain.ProtocolExec.execute(ProtocolExec.java:195)
	at org.apache.maven.wagon.providers.http.httpclient.impl.execchain.RetryExec.execute(RetryExec.java:86)
	at org.apache.maven.wagon.providers.http.httpclient.impl.execchain.RedirectExec.execute(RedirectExec.java:108)
	at org.apache.maven.wagon.providers.http.httpclient.impl.client.InternalHttpClient.doExecute(InternalHttpClient.java:184)
	at org.apache.maven.wagon.providers.http.httpclient.impl.client.CloseableHttpClient.execute(CloseableHttpClient.java:82)
	at org.apache.maven.wagon.providers.http.AbstractHttpClientWagon.execute(AbstractHttpClientWagon.java:832)
	at org.apache.maven.wagon.providers.http.AbstractHttpClientWagon.fillInputData(AbstractHttpClientWagon.java:983)
	... 13 more
2017-02-07T18:37:41.448 [ERROR] 
2017-02-07T18:37:41.449 [ERROR] Re-run Maven using the -X switch to enable full debug logging.
2017-02-07T18:37:41.449 [ERROR] 
2017-02-07T18:37:41.449 [ERROR] For more information about the errors and possible solutions,
please read the following articles:
2017-02-07T18:37:41.449 [ERROR] [Help 1] http://cwiki.apache.org/confluence/display/MAVEN/ProjectBuildingException
2017-02-07T18:37:41.449 [ERROR] [Help 2] http://cwiki.apache.org/confluence/display/MAVEN/PluginManagerException
channel stopped

Mime
View raw message