beam-commits mailing list archives

Site index · List index
Message view « Date » · « Thread »
Top « Date » · « Thread »
From Apache Jenkins Server <jenk...@builds.apache.org>
Subject Build failed in Jenkins: beam_PostCommit_Java_RunnableOnService_Spark #1037
Date Thu, 23 Feb 2017 18:08:31 GMT
See <https://builds.apache.org/job/beam_PostCommit_Java_RunnableOnService_Spark/1037/display/redirect>

------------------------------------------
[...truncated 239.98 KB...]
2017-02-23T18:08:22.180 [INFO] Downloading: https://repo.maven.apache.org/maven2/io/grpc/grpc-protobuf/1.0.1/grpc-protobuf-1.0.1.pom
2017-02-23T18:08:22.207 [INFO] Downloaded: https://repo.maven.apache.org/maven2/io/grpc/grpc-protobuf/1.0.1/grpc-protobuf-1.0.1.pom
(3 KB at 96.0 KB/sec)
2017-02-23T18:08:22.210 [INFO] Downloading: https://repo.maven.apache.org/maven2/com/google/protobuf/protobuf-java-util/3.0.0/protobuf-java-util-3.0.0.pom
2017-02-23T18:08:22.242 [INFO] Downloaded: https://repo.maven.apache.org/maven2/com/google/protobuf/protobuf-java-util/3.0.0/protobuf-java-util-3.0.0.pom
(4 KB at 119.6 KB/sec)
2017-02-23T18:08:22.244 [INFO] Downloading: https://repo.maven.apache.org/maven2/com/google/protobuf/protobuf-parent/3.0.0/protobuf-parent-3.0.0.pom
2017-02-23T18:08:22.271 [INFO] Downloaded: https://repo.maven.apache.org/maven2/com/google/protobuf/protobuf-parent/3.0.0/protobuf-parent-3.0.0.pom
(7 KB at 247.5 KB/sec)
2017-02-23T18:08:22.278 [INFO] Downloading: https://repo.maven.apache.org/maven2/com/google/code/gson/gson/2.3/gson-2.3.pom
2017-02-23T18:08:22.306 [INFO] Downloaded: https://repo.maven.apache.org/maven2/com/google/code/gson/gson/2.3/gson-2.3.pom
(9 KB at 313.0 KB/sec)
2017-02-23T18:08:22.310 [INFO] Downloading: https://repo.maven.apache.org/maven2/io/grpc/grpc-protobuf-lite/1.0.1/grpc-protobuf-lite-1.0.1.pom
2017-02-23T18:08:22.338 [INFO] Downloaded: https://repo.maven.apache.org/maven2/io/grpc/grpc-protobuf-lite/1.0.1/grpc-protobuf-lite-1.0.1.pom
(3 KB at 74.1 KB/sec)
2017-02-23T18:08:22.342 [INFO] Downloading: https://repo.maven.apache.org/maven2/io/grpc/grpc-stub/1.0.1/grpc-stub-1.0.1.pom
2017-02-23T18:08:22.370 [INFO] Downloaded: https://repo.maven.apache.org/maven2/io/grpc/grpc-stub/1.0.1/grpc-stub-1.0.1.pom
(2 KB at 60.7 KB/sec)
2017-02-23T18:08:22.380 [INFO] Downloading: https://repo.maven.apache.org/maven2/com/google/guava/guava/20.0/guava-20.0.jar
2017-02-23T18:08:22.381 [INFO] Downloading: https://repo.maven.apache.org/maven2/com/google/protobuf/protobuf-java/3.1.0/protobuf-java-3.1.0.jar
2017-02-23T18:08:22.384 [INFO] Downloading: https://repo.maven.apache.org/maven2/io/grpc/grpc-core/1.0.1/grpc-core-1.0.1.jar
2017-02-23T18:08:22.385 [INFO] Downloading: https://repo.maven.apache.org/maven2/io/grpc/grpc-context/1.0.1/grpc-context-1.0.1.jar
2017-02-23T18:08:22.388 [INFO] Downloading: https://repo.maven.apache.org/maven2/com/google/code/findbugs/jsr305/3.0.1/jsr305-3.0.1.jar
2017-02-23T18:08:22.420 [INFO] Downloaded: https://repo.maven.apache.org/maven2/io/grpc/grpc-context/1.0.1/grpc-context-1.0.1.jar
(20 KB at 532.3 KB/sec)
2017-02-23T18:08:22.420 [INFO] Downloading: https://repo.maven.apache.org/maven2/io/grpc/grpc-protobuf/1.0.1/grpc-protobuf-1.0.1.jar
2017-02-23T18:08:22.436 [INFO] Downloaded: https://repo.maven.apache.org/maven2/com/google/code/findbugs/jsr305/3.0.1/jsr305-3.0.1.jar
(20 KB at 381.9 KB/sec)
2017-02-23T18:08:22.437 [INFO] Downloading: https://repo.maven.apache.org/maven2/com/google/protobuf/protobuf-java-util/3.0.0/protobuf-java-util-3.0.0.jar
2017-02-23T18:08:22.448 [INFO] Downloaded: https://repo.maven.apache.org/maven2/io/grpc/grpc-protobuf/1.0.1/grpc-protobuf-1.0.1.jar
(4 KB at 55.9 KB/sec)
2017-02-23T18:08:22.448 [INFO] Downloading: https://repo.maven.apache.org/maven2/com/google/code/gson/gson/2.3/gson-2.3.jar
2017-02-23T18:08:22.468 [INFO] Downloaded: https://repo.maven.apache.org/maven2/com/google/protobuf/protobuf-java-util/3.0.0/protobuf-java-util-3.0.0.jar
(64 KB at 759.2 KB/sec)
2017-02-23T18:08:22.468 [INFO] Downloading: https://repo.maven.apache.org/maven2/io/grpc/grpc-protobuf-lite/1.0.1/grpc-protobuf-lite-1.0.1.jar
2017-02-23T18:08:22.483 [INFO] Downloaded: https://repo.maven.apache.org/maven2/io/grpc/grpc-core/1.0.1/grpc-core-1.0.1.jar
(344 KB at 3366.4 KB/sec)
2017-02-23T18:08:22.483 [INFO] Downloading: https://repo.maven.apache.org/maven2/io/grpc/grpc-stub/1.0.1/grpc-stub-1.0.1.jar
2017-02-23T18:08:22.495 [INFO] Downloaded: https://repo.maven.apache.org/maven2/com/google/code/gson/gson/2.3/gson-2.3.jar
(203 KB at 1836.4 KB/sec)
2017-02-23T18:08:22.495 [INFO] Downloaded: https://repo.maven.apache.org/maven2/io/grpc/grpc-protobuf-lite/1.0.1/grpc-protobuf-lite-1.0.1.jar
(6 KB at 54.1 KB/sec)
2017-02-23T18:08:22.514 [INFO] Downloaded: https://repo.maven.apache.org/maven2/io/grpc/grpc-stub/1.0.1/grpc-stub-1.0.1.jar
(36 KB at 275.4 KB/sec)
2017-02-23T18:08:22.536 [INFO] Downloaded: https://repo.maven.apache.org/maven2/com/google/protobuf/protobuf-java/3.1.0/protobuf-java-3.1.0.jar
(1297 KB at 8309.8 KB/sec)
2017-02-23T18:08:22.658 [INFO] Downloaded: https://repo.maven.apache.org/maven2/com/google/guava/guava/20.0/guava-20.0.jar
(2386 KB at 8549.7 KB/sec)
2017-02-23T18:08:22.665 [INFO] 
2017-02-23T18:08:22.665 [INFO] --- maven-clean-plugin:3.0.0:clean (default-clean) @ beam-sdks-common-fn-api
---
2017-02-23T18:08:22.667 [INFO] Deleting <https://builds.apache.org/job/beam_PostCommit_Java_RunnableOnService_Spark/ws/sdks/common/fn-api>
(includes = [**/*.pyc, **/*.egg-info/], excludes = [])
2017-02-23T18:08:22.719 [INFO] 
2017-02-23T18:08:22.719 [INFO] --- maven-enforcer-plugin:1.4.1:enforce (enforce) @ beam-sdks-common-fn-api
---
2017-02-23T18:08:22.969 [INFO] 
2017-02-23T18:08:22.969 [INFO] --- protobuf-maven-plugin:0.5.0:compile (default) @ beam-sdks-common-fn-api
---
2017-02-23T18:08:22.975 [INFO] Downloading: https://repo.maven.apache.org/maven2/com/google/guava/guava/18.0/guava-18.0.pom
2017-02-23T18:08:23.002 [INFO] Downloaded: https://repo.maven.apache.org/maven2/com/google/guava/guava/18.0/guava-18.0.pom
(6 KB at 204.9 KB/sec)
2017-02-23T18:08:23.005 [INFO] Downloading: https://repo.maven.apache.org/maven2/com/google/guava/guava-parent/18.0/guava-parent-18.0.pom
2017-02-23T18:08:23.032 [INFO] Downloaded: https://repo.maven.apache.org/maven2/com/google/guava/guava-parent/18.0/guava-parent-18.0.pom
(8 KB at 288.7 KB/sec)
2017-02-23T18:08:23.035 [INFO] Downloading: https://repo.maven.apache.org/maven2/org/apache/maven/plugin-tools/maven-plugin-annotations/3.4/maven-plugin-annotations-3.4.pom
2017-02-23T18:08:23.061 [INFO] Downloaded: https://repo.maven.apache.org/maven2/org/apache/maven/plugin-tools/maven-plugin-annotations/3.4/maven-plugin-annotations-3.4.pom
(2 KB at 61.2 KB/sec)
2017-02-23T18:08:23.063 [INFO] Downloading: https://repo.maven.apache.org/maven2/org/apache/maven/plugin-tools/maven-plugin-tools/3.4/maven-plugin-tools-3.4.pom
2017-02-23T18:08:23.090 [INFO] Downloaded: https://repo.maven.apache.org/maven2/org/apache/maven/plugin-tools/maven-plugin-tools/3.4/maven-plugin-tools-3.4.pom
(14 KB at 491.6 KB/sec)
2017-02-23T18:08:23.094 [INFO] Downloading: https://repo.maven.apache.org/maven2/org/sonatype/plexus/plexus-build-api/0.0.7/plexus-build-api-0.0.7.pom
2017-02-23T18:08:23.121 [INFO] Downloaded: https://repo.maven.apache.org/maven2/org/sonatype/plexus/plexus-build-api/0.0.7/plexus-build-api-0.0.7.pom
(4 KB at 115.9 KB/sec)
2017-02-23T18:08:23.124 [INFO] Downloading: https://repo.maven.apache.org/maven2/org/sonatype/spice/spice-parent/15/spice-parent-15.pom
2017-02-23T18:08:23.151 [INFO] Downloaded: https://repo.maven.apache.org/maven2/org/sonatype/spice/spice-parent/15/spice-parent-15.pom
(9 KB at 302.3 KB/sec)
2017-02-23T18:08:23.159 [INFO] Downloading: https://repo.maven.apache.org/maven2/org/apache/maven/maven-compat/3.0/maven-compat-3.0.pom
2017-02-23T18:08:23.189 [INFO] Downloaded: https://repo.maven.apache.org/maven2/org/apache/maven/maven-compat/3.0/maven-compat-3.0.pom
(4 KB at 130.9 KB/sec)
2017-02-23T18:08:23.200 [INFO] Downloading: https://repo.maven.apache.org/maven2/org/apache/maven/wagon/wagon-provider-api/1.0-beta-6/wagon-provider-api-1.0-beta-6.pom
2017-02-23T18:08:23.228 [INFO] Downloaded: https://repo.maven.apache.org/maven2/org/apache/maven/wagon/wagon-provider-api/1.0-beta-6/wagon-provider-api-1.0-beta-6.pom
(2 KB at 61.4 KB/sec)
2017-02-23T18:08:23.230 [INFO] Downloading: https://repo.maven.apache.org/maven2/org/apache/maven/wagon/wagon/1.0-beta-6/wagon-1.0-beta-6.pom
2017-02-23T18:08:23.261 [INFO] Downloaded: https://repo.maven.apache.org/maven2/org/apache/maven/wagon/wagon/1.0-beta-6/wagon-1.0-beta-6.pom
(13 KB at 390.2 KB/sec)
2017-02-23T18:08:23.275 [INFO] Downloading: https://repo.maven.apache.org/maven2/com/google/guava/guava/18.0/guava-18.0.jar
2017-02-23T18:08:23.288 [INFO] Downloading: https://repo.maven.apache.org/maven2/org/apache/maven/plugin-tools/maven-plugin-annotations/3.4/maven-plugin-annotations-3.4.jar
2017-02-23T18:08:23.297 [INFO] Downloading: https://repo.maven.apache.org/maven2/org/apache/maven/maven-compat/3.0/maven-compat-3.0.jar
2017-02-23T18:08:23.304 [INFO] Downloading: https://repo.maven.apache.org/maven2/org/sonatype/plexus/plexus-build-api/0.0.7/plexus-build-api-0.0.7.jar
2017-02-23T18:08:23.312 [INFO] Downloading: https://repo.maven.apache.org/maven2/org/apache/maven/wagon/wagon-provider-api/1.0-beta-6/wagon-provider-api-1.0-beta-6.jar
2017-02-23T18:08:23.316 [INFO] Downloaded: https://repo.maven.apache.org/maven2/org/apache/maven/plugin-tools/maven-plugin-annotations/3.4/maven-plugin-annotations-3.4.jar
(14 KB at 339.3 KB/sec)
2017-02-23T18:08:23.331 [INFO] Downloaded: https://repo.maven.apache.org/maven2/org/sonatype/plexus/plexus-build-api/0.0.7/plexus-build-api-0.0.7.jar
(9 KB at 197.2 KB/sec)
2017-02-23T18:08:23.350 [INFO] Downloaded: https://repo.maven.apache.org/maven2/org/apache/maven/wagon/wagon-provider-api/1.0-beta-6/wagon-provider-api-1.0-beta-6.jar
(52 KB at 980.0 KB/sec)
2017-02-23T18:08:23.367 [INFO] Downloaded: https://repo.maven.apache.org/maven2/org/apache/maven/maven-compat/3.0/maven-compat-3.0.jar
(279 KB at 3709.5 KB/sec)
2017-02-23T18:08:23.443 [INFO] Downloaded: https://repo.maven.apache.org/maven2/com/google/guava/guava/18.0/guava-18.0.jar
(2204 KB at 12662.8 KB/sec)
2017-02-23T18:08:23.622 [INFO] Downloading: https://repo.maven.apache.org/maven2/com/google/protobuf/protoc/3.1.0/protoc-3.1.0.pom
2017-02-23T18:08:23.651 [INFO] Downloaded: https://repo.maven.apache.org/maven2/com/google/protobuf/protoc/3.1.0/protoc-3.1.0.pom
(5 KB at 152.9 KB/sec)
2017-02-23T18:08:23.673 [INFO] Downloading: https://repo.maven.apache.org/maven2/com/google/protobuf/protoc/3.1.0/protoc-3.1.0-linux-x86_64.exe
[JENKINS] Archiving disabled
[JENKINS] Archiving disabled
[JENKINS] Archiving disabled
[JENKINS] Archiving disabled
[JENKINS] Archiving disabled
[JENKINS] Archiving disabled
[JENKINS] Archiving disabled
[JENKINS] Archiving disabled
[JENKINS] Archiving disabled
[JENKINS] Archiving disabled
[JENKINS] Archiving disabled
[JENKINS] Archiving disabled
[JENKINS] Archiving disabled
[JENKINS] Archiving disabled
[JENKINS] Archiving disabled
[JENKINS] Archiving disabled
2017-02-23T18:08:27.516 [INFO] ------------------------------------------------------------------------
2017-02-23T18:08:27.516 [INFO] Reactor Summary:
2017-02-23T18:08:27.516 [INFO] 
2017-02-23T18:08:27.516 [INFO] Apache Beam :: Parent .............................. SUCCESS
[ 20.656 s]
2017-02-23T18:08:27.516 [INFO] Apache Beam :: SDKs :: Java :: Build Tools ......... SUCCESS
[  4.262 s]
2017-02-23T18:08:27.516 [INFO] Apache Beam :: SDKs ................................ SUCCESS
[  3.368 s]
2017-02-23T18:08:27.516 [INFO] Apache Beam :: SDKs :: Common ...................... SUCCESS
[  1.171 s]
2017-02-23T18:08:27.516 [INFO] Apache Beam :: SDKs :: Common :: Fn API ............ FAILURE
[  2.433 s]
2017-02-23T18:08:27.516 [INFO] Apache Beam :: SDKs :: Common :: Runner API ........ SKIPPED
2017-02-23T18:08:27.516 [INFO] Apache Beam :: SDKs :: Java ........................ SKIPPED
2017-02-23T18:08:27.516 [INFO] Apache Beam :: SDKs :: Java :: Core ................ SKIPPED
2017-02-23T18:08:27.517 [INFO] Apache Beam :: Runners ............................. SKIPPED
2017-02-23T18:08:27.517 [INFO] Apache Beam :: Runners :: Core Java Construction ... SKIPPED
2017-02-23T18:08:27.517 [INFO] Apache Beam :: Runners :: Core Java ................ SKIPPED
2017-02-23T18:08:27.517 [INFO] Apache Beam :: Runners :: Direct Java .............. SKIPPED
2017-02-23T18:08:27.517 [INFO] Apache Beam :: SDKs :: Java :: IO .................. SKIPPED
2017-02-23T18:08:27.517 [INFO] Apache Beam :: SDKs :: Java :: IO :: Kafka ......... SKIPPED
2017-02-23T18:08:27.517 [INFO] Apache Beam :: Runners :: Spark .................... SKIPPED
2017-02-23T18:08:27.517 [INFO] ------------------------------------------------------------------------
2017-02-23T18:08:27.517 [INFO] BUILD FAILURE
2017-02-23T18:08:27.517 [INFO] ------------------------------------------------------------------------
2017-02-23T18:08:27.517 [INFO] Total time: 58.332 s
2017-02-23T18:08:27.517 [INFO] Finished at: 2017-02-23T18:08:27+00:00
2017-02-23T18:08:27.903 [INFO] Final Memory: 58M/507M
2017-02-23T18:08:27.903 [INFO] ------------------------------------------------------------------------
2017-02-23T18:08:27.917 [ERROR] Failed to execute goal org.xolstice.maven.plugins:protobuf-maven-plugin:0.5.0:compile
(default) on project beam-sdks-common-fn-api: Could not transfer artifact com.google.protobuf:protoc:exe:linux-x86_64:3.1.0
from/to central (https://repo.maven.apache.org/maven2): GET request of: com/google/protobuf/protoc/3.1.0/protoc-3.1.0-linux-x86_64.exe
from central failed
2017-02-23T18:08:27.917 [ERROR] com.google.protobuf:protoc:exe:3.1.0
2017-02-23T18:08:27.917 [ERROR] 
2017-02-23T18:08:27.917 [ERROR] from the specified remote repositories:
2017-02-23T18:08:27.918 [ERROR] Nexus (http://repository.apache.org/snapshots, releases=false,
snapshots=true),
2017-02-23T18:08:27.920 [ERROR] central (https://repo.maven.apache.org/maven2, releases=true,
snapshots=false)
2017-02-23T18:08:27.920 [ERROR] Path to dependency:
2017-02-23T18:08:27.920 [ERROR] 1) org.apache.beam:beam-sdks-common-fn-api:jar:0.6.0-SNAPSHOT
2017-02-23T18:08:27.921 [ERROR] 2) com.google.protobuf:protoc:exe:linux-x86_64:3.1.0: Connection
reset
2017-02-23T18:08:27.921 [ERROR] -> [Help 1]
org.apache.maven.lifecycle.LifecycleExecutionException: Failed to execute goal org.xolstice.maven.plugins:protobuf-maven-plugin:0.5.0:compile
(default) on project beam-sdks-common-fn-api: Could not transfer artifact com.google.protobuf:protoc:exe:linux-x86_64:3.1.0
from/to central (https://repo.maven.apache.org/maven2): GET request of: com/google/protobuf/protoc/3.1.0/protoc-3.1.0-linux-x86_64.exe
from central failed
  com.google.protobuf:protoc:exe:3.1.0

from the specified remote repositories:
  Nexus (http://repository.apache.org/snapshots, releases=false, snapshots=true),
  central (https://repo.maven.apache.org/maven2, releases=true, snapshots=false)
Path to dependency: 
	1) org.apache.beam:beam-sdks-common-fn-api:jar:0.6.0-SNAPSHOT
	2) com.google.protobuf:protoc:exe:linux-x86_64:3.1.0


	at org.apache.maven.lifecycle.internal.MojoExecutor.execute(MojoExecutor.java:216)
	at org.apache.maven.lifecycle.internal.MojoExecutor.execute(MojoExecutor.java:153)
	at org.apache.maven.lifecycle.internal.MojoExecutor.execute(MojoExecutor.java:145)
	at org.apache.maven.lifecycle.internal.LifecycleModuleBuilder.buildProject(LifecycleModuleBuilder.java:116)
	at org.apache.maven.lifecycle.internal.LifecycleModuleBuilder.buildProject(LifecycleModuleBuilder.java:80)
	at org.apache.maven.lifecycle.internal.builder.singlethreaded.SingleThreadedBuilder.build(SingleThreadedBuilder.java:51)
	at org.apache.maven.lifecycle.internal.LifecycleStarter.execute(LifecycleStarter.java:128)
	at org.apache.maven.DefaultMaven.doExecute(DefaultMaven.java:307)
	at org.apache.maven.DefaultMaven.doExecute(DefaultMaven.java:193)
	at org.apache.maven.DefaultMaven.execute(DefaultMaven.java:106)
	at org.jvnet.hudson.maven3.launcher.Maven33Launcher.main(Maven33Launcher.java:129)
	at sun.reflect.NativeMethodAccessorImpl.invoke0(Native Method)
	at sun.reflect.NativeMethodAccessorImpl.invoke(NativeMethodAccessorImpl.java:62)
	at sun.reflect.DelegatingMethodAccessorImpl.invoke(DelegatingMethodAccessorImpl.java:43)
	at java.lang.reflect.Method.invoke(Method.java:498)
	at org.codehaus.plexus.classworlds.launcher.Launcher.launchStandard(Launcher.java:330)
	at org.codehaus.plexus.classworlds.launcher.Launcher.launch(Launcher.java:238)
	at jenkins.maven3.agent.Maven33Main.launch(Maven33Main.java:176)
	at sun.reflect.NativeMethodAccessorImpl.invoke0(Native Method)
	at sun.reflect.NativeMethodAccessorImpl.invoke(NativeMethodAccessorImpl.java:62)
	at sun.reflect.DelegatingMethodAccessorImpl.invoke(DelegatingMethodAccessorImpl.java:43)
	at java.lang.reflect.Method.invoke(Method.java:498)
	at hudson.maven.Maven3Builder.call(Maven3Builder.java:139)
	at hudson.maven.Maven3Builder.call(Maven3Builder.java:70)
	at hudson.remoting.UserRequest.perform(UserRequest.java:153)
	at hudson.remoting.UserRequest.perform(UserRequest.java:50)
	at hudson.remoting.Request$2.run(Request.java:336)
	at hudson.remoting.InterceptingExecutorService$1.call(InterceptingExecutorService.java:68)
	at java.util.concurrent.FutureTask.run(FutureTask.java:266)
	at java.util.concurrent.ThreadPoolExecutor.runWorker(ThreadPoolExecutor.java:1142)
	at java.util.concurrent.ThreadPoolExecutor$Worker.run(ThreadPoolExecutor.java:617)
	at java.lang.Thread.run(Thread.java:745)
Caused by: org.apache.maven.plugin.MojoExecutionException: Could not transfer artifact com.google.protobuf:protoc:exe:linux-x86_64:3.1.0
from/to central (https://repo.maven.apache.org/maven2): GET request of: com/google/protobuf/protoc/3.1.0/protoc-3.1.0-linux-x86_64.exe
from central failed
  com.google.protobuf:protoc:exe:3.1.0

from the specified remote repositories:
  Nexus (http://repository.apache.org/snapshots, releases=false, snapshots=true),
  central (https://repo.maven.apache.org/maven2, releases=true, snapshots=false)
Path to dependency: 
	1) org.apache.beam:beam-sdks-common-fn-api:jar:0.6.0-SNAPSHOT
	2) com.google.protobuf:protoc:exe:linux-x86_64:3.1.0


	at org.xolstice.maven.plugin.protobuf.AbstractProtocMojo.resolveBinaryArtifact(AbstractProtocMojo.java:962)
	at org.xolstice.maven.plugin.protobuf.AbstractProtocMojo.execute(AbstractProtocMojo.java:489)
	at org.xolstice.maven.plugin.protobuf.AbstractProtocCompileMojo.execute(AbstractProtocCompileMojo.java:31)
	at org.apache.maven.plugin.DefaultBuildPluginManager.executeMojo(DefaultBuildPluginManager.java:134)
	at org.apache.maven.lifecycle.internal.MojoExecutor.execute(MojoExecutor.java:208)
	... 31 more
Caused by: org.apache.maven.artifact.resolver.ArtifactResolutionException: Could not transfer
artifact com.google.protobuf:protoc:exe:linux-x86_64:3.1.0 from/to central (https://repo.maven.apache.org/maven2):
GET request of: com/google/protobuf/protoc/3.1.0/protoc-3.1.0-linux-x86_64.exe from central
failed
  com.google.protobuf:protoc:exe:3.1.0

from the specified remote repositories:
  Nexus (http://repository.apache.org/snapshots, releases=false, snapshots=true),
  central (https://repo.maven.apache.org/maven2, releases=true, snapshots=false)
Path to dependency: 
	1) org.apache.beam:beam-sdks-common-fn-api:jar:0.6.0-SNAPSHOT
	2) com.google.protobuf:protoc:exe:linux-x86_64:3.1.0


	at org.apache.maven.artifact.resolver.DefaultArtifactResolver.resolve(DefaultArtifactResolver.java:222)
	at org.apache.maven.artifact.resolver.DefaultArtifactResolver.access$000(DefaultArtifactResolver.java:74)
	at org.apache.maven.artifact.resolver.DefaultArtifactResolver$ResolveTask.run(DefaultArtifactResolver.java:602)
	... 3 more
Caused by: org.eclipse.aether.resolution.ArtifactResolutionException: Could not transfer artifact
com.google.protobuf:protoc:exe:linux-x86_64:3.1.0 from/to central (https://repo.maven.apache.org/maven2):
GET request of: com/google/protobuf/protoc/3.1.0/protoc-3.1.0-linux-x86_64.exe from central
failed
	at org.eclipse.aether.internal.impl.DefaultArtifactResolver.resolve(DefaultArtifactResolver.java:444)
	at org.eclipse.aether.internal.impl.DefaultArtifactResolver.resolveArtifacts(DefaultArtifactResolver.java:246)
	at org.eclipse.aether.internal.impl.DefaultArtifactResolver.resolveArtifact(DefaultArtifactResolver.java:223)
	at org.eclipse.aether.internal.impl.DefaultRepositorySystem.resolveArtifact(DefaultRepositorySystem.java:294)
	at org.apache.maven.artifact.resolver.DefaultArtifactResolver.resolve(DefaultArtifactResolver.java:212)
	... 5 more
Caused by: org.eclipse.aether.transfer.ArtifactTransferException: Could not transfer artifact
com.google.protobuf:protoc:exe:linux-x86_64:3.1.0 from/to central (https://repo.maven.apache.org/maven2):
GET request of: com/google/protobuf/protoc/3.1.0/protoc-3.1.0-linux-x86_64.exe from central
failed
	at org.eclipse.aether.connector.basic.ArtifactTransportListener.transferFailed(ArtifactTransportListener.java:43)
	at org.eclipse.aether.connector.basic.BasicRepositoryConnector$TaskRunner.run(BasicRepositoryConnector.java:355)
	at org.eclipse.aether.util.concurrency.RunnableErrorForwarder$1.run(RunnableErrorForwarder.java:67)
	at org.eclipse.aether.connector.basic.BasicRepositoryConnector$DirectExecutor.execute(BasicRepositoryConnector.java:581)
	at org.eclipse.aether.connector.basic.BasicRepositoryConnector.get(BasicRepositoryConnector.java:249)
	at org.eclipse.aether.internal.impl.DefaultArtifactResolver.performDownloads(DefaultArtifactResolver.java:520)
	at org.eclipse.aether.internal.impl.DefaultArtifactResolver.resolve(DefaultArtifactResolver.java:421)
	... 9 more
Caused by: org.apache.maven.wagon.TransferFailedException: GET request of: com/google/protobuf/protoc/3.1.0/protoc-3.1.0-linux-x86_64.exe
from central failed
	at org.apache.maven.wagon.AbstractWagon.getTransfer(AbstractWagon.java:363)
	at org.apache.maven.wagon.AbstractWagon.getTransfer(AbstractWagon.java:316)
	at org.apache.maven.wagon.AbstractWagon.getTransfer(AbstractWagon.java:285)
	at org.apache.maven.wagon.StreamWagon.getIfNewer(StreamWagon.java:97)
	at org.apache.maven.wagon.StreamWagon.get(StreamWagon.java:61)
	at org.eclipse.aether.transport.wagon.WagonTransporter$GetTaskRunner.run(WagonTransporter.java:560)
	at org.eclipse.aether.transport.wagon.WagonTransporter.execute(WagonTransporter.java:427)
	at org.eclipse.aether.transport.wagon.WagonTransporter.get(WagonTransporter.java:404)
	at org.eclipse.aether.connector.basic.BasicRepositoryConnector$GetTaskRunner.runTask(BasicRepositoryConnector.java:447)
	at org.eclipse.aether.connector.basic.BasicRepositoryConnector$TaskRunner.run(BasicRepositoryConnector.java:350)
	... 14 more
Caused by: java.net.SocketException: Connection reset
	at java.net.SocketInputStream.read(SocketInputStream.java:210)
	at java.net.SocketInputStream.read(SocketInputStream.java:141)
	at sun.security.ssl.InputRecord.readFully(InputRecord.java:465)
	at sun.security.ssl.InputRecord.readV3Record(InputRecord.java:593)
	at sun.security.ssl.InputRecord.read(InputRecord.java:532)
	at sun.security.ssl.SSLSocketImpl.readRecord(SSLSocketImpl.java:973)
	at sun.security.ssl.SSLSocketImpl.readDataRecord(SSLSocketImpl.java:930)
	at sun.security.ssl.AppInputStream.read(AppInputStream.java:105)
	at org.apache.maven.wagon.providers.http.httpclient.impl.io.SessionInputBufferImpl.streamRead(SessionInputBufferImpl.java:136)
	at org.apache.maven.wagon.providers.http.httpclient.impl.io.SessionInputBufferImpl.read(SessionInputBufferImpl.java:195)
	at org.apache.maven.wagon.providers.http.httpclient.impl.io.ContentLengthInputStream.read(ContentLengthInputStream.java:178)
	at org.apache.maven.wagon.providers.http.httpclient.conn.EofSensorInputStream.read(EofSensorInputStream.java:137)
	at org.apache.maven.wagon.AbstractWagon.transfer(AbstractWagon.java:531)
	at org.apache.maven.wagon.AbstractWagon.getTransfer(AbstractWagon.java:353)
	... 23 more
2017-02-23T18:08:27.938 [ERROR] 
2017-02-23T18:08:27.938 [ERROR] Re-run Maven using the -X switch to enable full debug logging.
2017-02-23T18:08:27.938 [ERROR] 
2017-02-23T18:08:27.938 [ERROR] For more information about the errors and possible solutions,
please read the following articles:
2017-02-23T18:08:27.938 [ERROR] [Help 1] http://cwiki.apache.org/confluence/display/MAVEN/MojoExecutionException
2017-02-23T18:08:27.938 [ERROR] 
2017-02-23T18:08:27.938 [ERROR] After correcting the problems, you can resume the build with
the command
2017-02-23T18:08:27.939 [ERROR]   mvn <goals> -rf :beam-sdks-common-fn-api
channel stopped

Mime
View raw message