beam-commits mailing list archives

Site index · List index
Message view « Date » · « Thread »
Top « Date » · « Thread »
From Apache Jenkins Server <jenk...@builds.apache.org>
Subject Build failed in Jenkins: beam_PostCommit_Java_RunnableOnService_Dataflow #2219
Date Tue, 07 Feb 2017 07:29:27 GMT
See <https://builds.apache.org/job/beam_PostCommit_Java_RunnableOnService_Dataflow/2219/changes>

Changes:

[younghee.kwon] Improve DirectRunner performance by tuning BoundedReadEvaluator.

[altay] Removes deprecated fileio.TextFileSink.

------------------------------------------
[...truncated 27 lines...]
Modules changed, recalculating dependency graph
Established TCP socket on 57813
maven32-agent.jar already up to date
maven32-interceptor.jar already up to date
maven3-interceptor-commons.jar already up to date
[beam_PostCommit_Java_RunnableOnService_Dataflow] $ /home/jenkins/tools/java/latest1.8/bin/java
-Dorg.slf4j.simpleLogger.showDateTime=true -Dorg.slf4j.simpleLogger.dateTimeFormat=yyyy-MM-dd'T'HH:mm:ss.SSS
-cp /home/jenkins/jenkins-slave/maven32-agent.jar:/home/jenkins/tools/maven/apache-maven-3.3.3/boot/plexus-classworlds-2.5.2.jar:/home/jenkins/tools/maven/apache-maven-3.3.3/conf/logging
jenkins.maven3.agent.Maven32Main /home/jenkins/tools/maven/apache-maven-3.3.3 /home/jenkins/jenkins-slave/slave.jar
/home/jenkins/jenkins-slave/maven32-interceptor.jar /home/jenkins/jenkins-slave/maven3-interceptor-commons.jar
57813
<===[JENKINS REMOTING CAPACITY]===>   channel started
Executing Maven:  -B -f <https://builds.apache.org/job/beam_PostCommit_Java_RunnableOnService_Dataflow/ws/pom.xml>
-Dmaven.repo.local=<https://builds.apache.org/job/beam_PostCommit_Java_RunnableOnService_Dataflow/ws/.repository>
-B -e clean verify -am -pl runners/google-cloud-dataflow-java -DforkCount=0 -DrunnableOnServicePipelineOptions=[
"--runner=org.apache.beam.runners.dataflow.testing.TestDataflowRunner", "--project=apache-beam-testing",
"--tempRoot=gs://temp-storage-for-runnable-on-service-tests/" ]
2017-02-07T07:29:11.313 [INFO] Error stacktraces are turned on.
2017-02-07T07:29:11.415 [INFO] Scanning for projects...
2017-02-07T07:29:12.564 [INFO] Downloading: https://repo.maven.apache.org/maven2/kr/motd/maven/os-maven-plugin/1.4.0.Final/os-maven-plugin-1.4.0.Final.pom
2017-02-07T07:29:12.966 [INFO] Downloaded: https://repo.maven.apache.org/maven2/kr/motd/maven/os-maven-plugin/1.4.0.Final/os-maven-plugin-1.4.0.Final.pom
(7 KB at 14.8 KB/sec)
2017-02-07T07:29:12.981 [INFO] Downloading: https://repo.maven.apache.org/maven2/org/sonatype/oss/oss-parent/9/oss-parent-9.pom
2017-02-07T07:29:13.018 [INFO] Downloaded: https://repo.maven.apache.org/maven2/org/sonatype/oss/oss-parent/9/oss-parent-9.pom
(7 KB at 168.8 KB/sec)
2017-02-07T07:29:13.034 [INFO] Downloading: https://repo.maven.apache.org/maven2/org/apache/maven/maven-plugin-api/3.2.1/maven-plugin-api-3.2.1.pom
2017-02-07T07:29:13.068 [INFO] Downloaded: https://repo.maven.apache.org/maven2/org/apache/maven/maven-plugin-api/3.2.1/maven-plugin-api-3.2.1.pom
(4 KB at 97.1 KB/sec)
2017-02-07T07:29:13.071 [INFO] Downloading: https://repo.maven.apache.org/maven2/org/apache/maven/maven/3.2.1/maven-3.2.1.pom
2017-02-07T07:29:13.121 [INFO] Downloaded: https://repo.maven.apache.org/maven2/org/apache/maven/maven/3.2.1/maven-3.2.1.pom
(23 KB at 450.2 KB/sec)
2017-02-07T07:29:13.124 [INFO] Downloading: https://repo.maven.apache.org/maven2/org/apache/maven/maven-parent/23/maven-parent-23.pom
2017-02-07T07:29:13.163 [INFO] Downloaded: https://repo.maven.apache.org/maven2/org/apache/maven/maven-parent/23/maven-parent-23.pom
(32 KB at 816.0 KB/sec)
2017-02-07T07:29:13.168 [INFO] Downloading: https://repo.maven.apache.org/maven2/org/apache/apache/13/apache-13.pom
2017-02-07T07:29:13.202 [INFO] Downloaded: https://repo.maven.apache.org/maven2/org/apache/apache/13/apache-13.pom
(14 KB at 401.4 KB/sec)
2017-02-07T07:29:13.215 [INFO] Downloading: https://repo.maven.apache.org/maven2/org/apache/maven/maven-model/3.2.1/maven-model-3.2.1.pom
2017-02-07T07:29:13.246 [INFO] Downloaded: https://repo.maven.apache.org/maven2/org/apache/maven/maven-model/3.2.1/maven-model-3.2.1.pom
(5 KB at 126.4 KB/sec)
2017-02-07T07:29:13.255 [INFO] Downloading: https://repo.maven.apache.org/maven2/org/codehaus/plexus/plexus-utils/3.0.17/plexus-utils-3.0.17.pom
2017-02-07T07:29:13.288 [INFO] Downloaded: https://repo.maven.apache.org/maven2/org/codehaus/plexus/plexus-utils/3.0.17/plexus-utils-3.0.17.pom
(4 KB at 100.5 KB/sec)
2017-02-07T07:29:13.292 [INFO] Downloading: https://repo.maven.apache.org/maven2/org/codehaus/plexus/plexus/3.3.1/plexus-3.3.1.pom
2017-02-07T07:29:13.329 [INFO] Downloaded: https://repo.maven.apache.org/maven2/org/codehaus/plexus/plexus/3.3.1/plexus-3.3.1.pom
(20 KB at 539.6 KB/sec)
2017-02-07T07:29:13.334 [INFO] Downloading: https://repo.maven.apache.org/maven2/org/sonatype/spice/spice-parent/17/spice-parent-17.pom
2017-02-07T07:29:13.365 [INFO] Downloaded: https://repo.maven.apache.org/maven2/org/sonatype/spice/spice-parent/17/spice-parent-17.pom
(7 KB at 212.9 KB/sec)
2017-02-07T07:29:13.369 [INFO] Downloading: https://repo.maven.apache.org/maven2/org/sonatype/forge/forge-parent/10/forge-parent-10.pom
2017-02-07T07:29:13.404 [INFO] Downloaded: https://repo.maven.apache.org/maven2/org/sonatype/forge/forge-parent/10/forge-parent-10.pom
(14 KB at 378.3 KB/sec)
2017-02-07T07:29:13.411 [INFO] Downloading: https://repo.maven.apache.org/maven2/org/apache/maven/maven-artifact/3.2.1/maven-artifact-3.2.1.pom
2017-02-07T07:29:13.442 [INFO] Downloaded: https://repo.maven.apache.org/maven2/org/apache/maven/maven-artifact/3.2.1/maven-artifact-3.2.1.pom
(2 KB at 62.1 KB/sec)
2017-02-07T07:29:13.453 [INFO] Downloading: https://repo.maven.apache.org/maven2/org/eclipse/sisu/org.eclipse.sisu.plexus/0.0.0.M5/org.eclipse.sisu.plexus-0.0.0.M5.pom
2017-02-07T07:29:13.485 [INFO] Downloaded: https://repo.maven.apache.org/maven2/org/eclipse/sisu/org.eclipse.sisu.plexus/0.0.0.M5/org.eclipse.sisu.plexus-0.0.0.M5.pom
(5 KB at 147.4 KB/sec)
2017-02-07T07:29:13.489 [INFO] Downloading: https://repo.maven.apache.org/maven2/org/eclipse/sisu/sisu-plexus/0.0.0.M5/sisu-plexus-0.0.0.M5.pom
2017-02-07T07:29:13.524 [INFO] Downloaded: https://repo.maven.apache.org/maven2/org/eclipse/sisu/sisu-plexus/0.0.0.M5/sisu-plexus-0.0.0.M5.pom
(13 KB at 368.4 KB/sec)
2017-02-07T07:29:13.528 [INFO] Downloading: https://repo.maven.apache.org/maven2/org/sonatype/oss/oss-parent/7/oss-parent-7.pom
2017-02-07T07:29:13.556 [INFO] Downloaded: https://repo.maven.apache.org/maven2/org/sonatype/oss/oss-parent/7/oss-parent-7.pom
(5 KB at 162.4 KB/sec)
2017-02-07T07:29:13.563 [INFO] Downloading: https://repo.maven.apache.org/maven2/javax/enterprise/cdi-api/1.0/cdi-api-1.0.pom
2017-02-07T07:29:13.596 [INFO] Downloaded: https://repo.maven.apache.org/maven2/javax/enterprise/cdi-api/1.0/cdi-api-1.0.pom
(2 KB at 42.4 KB/sec)
2017-02-07T07:29:13.600 [INFO] Downloading: https://repo.maven.apache.org/maven2/org/jboss/weld/weld-api-parent/1.0/weld-api-parent-1.0.pom
2017-02-07T07:29:13.630 [INFO] Downloaded: https://repo.maven.apache.org/maven2/org/jboss/weld/weld-api-parent/1.0/weld-api-parent-1.0.pom
(3 KB at 76.7 KB/sec)
2017-02-07T07:29:13.634 [INFO] Downloading: https://repo.maven.apache.org/maven2/org/jboss/weld/weld-api-bom/1.0/weld-api-bom-1.0.pom
2017-02-07T07:29:13.666 [INFO] Downloaded: https://repo.maven.apache.org/maven2/org/jboss/weld/weld-api-bom/1.0/weld-api-bom-1.0.pom
(8 KB at 249.1 KB/sec)
2017-02-07T07:29:13.669 [INFO] Downloading: https://repo.maven.apache.org/maven2/org/jboss/weld/weld-parent/6/weld-parent-6.pom
2017-02-07T07:29:13.705 [INFO] Downloaded: https://repo.maven.apache.org/maven2/org/jboss/weld/weld-parent/6/weld-parent-6.pom
(21 KB at 561.3 KB/sec)
2017-02-07T07:29:13.713 [INFO] Downloading: https://repo.maven.apache.org/maven2/javax/annotation/jsr250-api/1.0/jsr250-api-1.0.pom
2017-02-07T07:29:13.745 [INFO] Downloaded: https://repo.maven.apache.org/maven2/javax/annotation/jsr250-api/1.0/jsr250-api-1.0.pom
(1023 B at 32.2 KB/sec)
2017-02-07T07:29:13.749 [INFO] Downloading: https://repo.maven.apache.org/maven2/javax/inject/javax.inject/1/javax.inject-1.pom
2017-02-07T07:29:13.778 [INFO] Downloaded: https://repo.maven.apache.org/maven2/javax/inject/javax.inject/1/javax.inject-1.pom
(612 B at 20.6 KB/sec)
2017-02-07T07:29:13.782 [INFO] Downloading: https://repo.maven.apache.org/maven2/com/google/guava/guava/10.0.1/guava-10.0.1.pom
2017-02-07T07:29:13.813 [INFO] Downloaded: https://repo.maven.apache.org/maven2/com/google/guava/guava/10.0.1/guava-10.0.1.pom
(6 KB at 175.3 KB/sec)
2017-02-07T07:29:13.816 [INFO] Downloading: https://repo.maven.apache.org/maven2/com/google/guava/guava-parent/10.0.1/guava-parent-10.0.1.pom
2017-02-07T07:29:13.845 [INFO] Downloaded: https://repo.maven.apache.org/maven2/com/google/guava/guava-parent/10.0.1/guava-parent-10.0.1.pom
(2 KB at 63.8 KB/sec)
2017-02-07T07:29:13.850 [INFO] Downloading: https://repo.maven.apache.org/maven2/com/google/code/findbugs/jsr305/1.3.9/jsr305-1.3.9.pom
2017-02-07T07:29:13.879 [INFO] Downloaded: https://repo.maven.apache.org/maven2/com/google/code/findbugs/jsr305/1.3.9/jsr305-1.3.9.pom
(965 B at 32.5 KB/sec)
2017-02-07T07:29:13.884 [INFO] Downloading: https://repo.maven.apache.org/maven2/org/sonatype/sisu/sisu-guice/3.1.0/sisu-guice-3.1.0.pom
2017-02-07T07:29:13.915 [INFO] Downloaded: https://repo.maven.apache.org/maven2/org/sonatype/sisu/sisu-guice/3.1.0/sisu-guice-3.1.0.pom
(10 KB at 319.7 KB/sec)
2017-02-07T07:29:13.919 [INFO] Downloading: https://repo.maven.apache.org/maven2/org/sonatype/sisu/inject/guice-parent/3.1.0/guice-parent-3.1.0.pom
2017-02-07T07:29:13.952 [INFO] Downloaded: https://repo.maven.apache.org/maven2/org/sonatype/sisu/inject/guice-parent/3.1.0/guice-parent-3.1.0.pom
(11 KB at 323.3 KB/sec)
2017-02-07T07:29:13.960 [INFO] Downloading: https://repo.maven.apache.org/maven2/aopalliance/aopalliance/1.0/aopalliance-1.0.pom
2017-02-07T07:29:13.990 [INFO] Downloaded: https://repo.maven.apache.org/maven2/aopalliance/aopalliance/1.0/aopalliance-1.0.pom
(363 B at 11.4 KB/sec)
2017-02-07T07:29:13.995 [INFO] Downloading: https://repo.maven.apache.org/maven2/org/eclipse/sisu/org.eclipse.sisu.inject/0.0.0.M5/org.eclipse.sisu.inject-0.0.0.M5.pom
2017-02-07T07:29:14.025 [INFO] Downloaded: https://repo.maven.apache.org/maven2/org/eclipse/sisu/org.eclipse.sisu.inject/0.0.0.M5/org.eclipse.sisu.inject-0.0.0.M5.pom
(3 KB at 82.0 KB/sec)
2017-02-07T07:29:14.028 [INFO] Downloading: https://repo.maven.apache.org/maven2/org/eclipse/sisu/sisu-inject/0.0.0.M5/sisu-inject-0.0.0.M5.pom
2017-02-07T07:29:14.061 [INFO] Downloaded: https://repo.maven.apache.org/maven2/org/eclipse/sisu/sisu-inject/0.0.0.M5/sisu-inject-0.0.0.M5.pom
(14 KB at 414.2 KB/sec)
2017-02-07T07:29:14.068 [INFO] Downloading: https://repo.maven.apache.org/maven2/org/codehaus/plexus/plexus-component-annotations/1.5.5/plexus-component-annotations-1.5.5.pom
2017-02-07T07:29:14.098 [INFO] Downloaded: https://repo.maven.apache.org/maven2/org/codehaus/plexus/plexus-component-annotations/1.5.5/plexus-component-annotations-1.5.5.pom
(815 B at 26.5 KB/sec)
2017-02-07T07:29:14.101 [INFO] Downloading: https://repo.maven.apache.org/maven2/org/codehaus/plexus/plexus-containers/1.5.5/plexus-containers-1.5.5.pom
2017-02-07T07:29:14.130 [INFO] Downloaded: https://repo.maven.apache.org/maven2/org/codehaus/plexus/plexus-containers/1.5.5/plexus-containers-1.5.5.pom
(5 KB at 142.8 KB/sec)
2017-02-07T07:29:14.134 [INFO] Downloading: https://repo.maven.apache.org/maven2/org/codehaus/plexus/plexus/2.0.7/plexus-2.0.7.pom
2017-02-07T07:29:14.168 [INFO] Downloaded: https://repo.maven.apache.org/maven2/org/codehaus/plexus/plexus/2.0.7/plexus-2.0.7.pom
(17 KB at 496.8 KB/sec)
2017-02-07T07:29:14.173 [INFO] Downloading: https://repo.maven.apache.org/maven2/org/codehaus/plexus/plexus-classworlds/2.4/plexus-classworlds-2.4.pom
2017-02-07T07:29:14.203 [INFO] Downloaded: https://repo.maven.apache.org/maven2/org/codehaus/plexus/plexus-classworlds/2.4/plexus-classworlds-2.4.pom
(4 KB at 126.4 KB/sec)
2017-02-07T07:29:14.208 [INFO] Downloading: https://repo.maven.apache.org/maven2/org/codehaus/plexus/plexus-utils/2.1/plexus-utils-2.1.pom
2017-02-07T07:29:14.237 [INFO] Downloaded: https://repo.maven.apache.org/maven2/org/codehaus/plexus/plexus-utils/2.1/plexus-utils-2.1.pom
(4 KB at 135.8 KB/sec)
2017-02-07T07:29:14.241 [INFO] Downloading: https://repo.maven.apache.org/maven2/org/sonatype/spice/spice-parent/16/spice-parent-16.pom
2017-02-07T07:29:14.271 [INFO] Downloaded: https://repo.maven.apache.org/maven2/org/sonatype/spice/spice-parent/16/spice-parent-16.pom
(9 KB at 272.1 KB/sec)
2017-02-07T07:29:14.275 [INFO] Downloading: https://repo.maven.apache.org/maven2/org/sonatype/forge/forge-parent/5/forge-parent-5.pom
2017-02-07T07:29:14.305 [INFO] Downloaded: https://repo.maven.apache.org/maven2/org/sonatype/forge/forge-parent/5/forge-parent-5.pom
(9 KB at 272.2 KB/sec)
2017-02-07T07:29:14.336 [INFO] Downloading: https://repo.maven.apache.org/maven2/kr/motd/maven/os-maven-plugin/1.4.0.Final/os-maven-plugin-1.4.0.Final.jar
2017-02-07T07:29:14.338 [INFO] Downloading: https://repo.maven.apache.org/maven2/org/apache/maven/maven-plugin-api/3.2.1/maven-plugin-api-3.2.1.jar
2017-02-07T07:29:14.339 [INFO] Downloading: https://repo.maven.apache.org/maven2/org/apache/maven/maven-model/3.2.1/maven-model-3.2.1.jar
2017-02-07T07:29:14.340 [INFO] Downloading: https://repo.maven.apache.org/maven2/org/apache/maven/maven-artifact/3.2.1/maven-artifact-3.2.1.jar
2017-02-07T07:29:14.341 [INFO] Downloading: https://repo.maven.apache.org/maven2/org/eclipse/sisu/org.eclipse.sisu.plexus/0.0.0.M5/org.eclipse.sisu.plexus-0.0.0.M5.jar
2017-02-07T07:29:14.385 [INFO] Downloading: https://repo.maven.apache.org/maven2/javax/enterprise/cdi-api/1.0/cdi-api-1.0.jar
2017-02-07T07:29:14.388 [INFO] Downloaded: https://repo.maven.apache.org/maven2/kr/motd/maven/os-maven-plugin/1.4.0.Final/os-maven-plugin-1.4.0.Final.jar
(29 KB at 528.8 KB/sec)
2017-02-07T07:29:14.389 [INFO] Downloading: https://repo.maven.apache.org/maven2/javax/annotation/jsr250-api/1.0/jsr250-api-1.0.jar
2017-02-07T07:29:14.419 [INFO] Downloaded: https://repo.maven.apache.org/maven2/javax/annotation/jsr250-api/1.0/jsr250-api-1.0.jar
(6 KB at 73.2 KB/sec)
2017-02-07T07:29:14.419 [INFO] Downloading: https://repo.maven.apache.org/maven2/javax/inject/javax.inject/1/javax.inject-1.jar
2017-02-07T07:29:14.431 [INFO] Downloaded: https://repo.maven.apache.org/maven2/org/apache/maven/maven-plugin-api/3.2.1/maven-plugin-api-3.2.1.jar
(45 KB at 466.2 KB/sec)
2017-02-07T07:29:14.432 [INFO] Downloading: https://repo.maven.apache.org/maven2/com/google/guava/guava/10.0.1/guava-10.0.1.jar
2017-02-07T07:29:14.445 [INFO] Downloaded: https://repo.maven.apache.org/maven2/org/apache/maven/maven-artifact/3.2.1/maven-artifact-3.2.1.jar
(53 KB at 494.3 KB/sec)
2017-02-07T07:29:14.445 [INFO] Downloading: https://repo.maven.apache.org/maven2/com/google/code/findbugs/jsr305/1.3.9/jsr305-1.3.9.jar
2017-02-07T07:29:14.447 [INFO] Downloaded: https://repo.maven.apache.org/maven2/javax/inject/javax.inject/1/javax.inject-1.jar
(3 KB at 23.0 KB/sec)
2017-02-07T07:29:14.447 [INFO] Downloading: https://repo.maven.apache.org/maven2/org/sonatype/sisu/sisu-guice/3.1.0/sisu-guice-3.1.0-no_aop.jar
2017-02-07T07:29:14.465 [INFO] Downloaded: https://repo.maven.apache.org/maven2/javax/enterprise/cdi-api/1.0/cdi-api-1.0.jar
(44 KB at 353.7 KB/sec)
2017-02-07T07:29:14.465 [INFO] Downloading: https://repo.maven.apache.org/maven2/aopalliance/aopalliance/1.0/aopalliance-1.0.jar
2017-02-07T07:29:14.470 [INFO] Downloaded: https://repo.maven.apache.org/maven2/org/apache/maven/maven-model/3.2.1/maven-model-3.2.1.jar
(157 KB at 1165.0 KB/sec)
2017-02-07T07:29:14.470 [INFO] Downloading: https://repo.maven.apache.org/maven2/org/eclipse/sisu/org.eclipse.sisu.inject/0.0.0.M5/org.eclipse.sisu.inject-0.0.0.M5.jar
2017-02-07T07:29:14.501 [INFO] Downloaded: https://repo.maven.apache.org/maven2/com/google/code/findbugs/jsr305/1.3.9/jsr305-1.3.9.jar
(33 KB at 201.5 KB/sec)
2017-02-07T07:29:14.502 [INFO] Downloading: https://repo.maven.apache.org/maven2/org/codehaus/plexus/plexus-component-annotations/1.5.5/plexus-component-annotations-1.5.5.jar
2017-02-07T07:29:14.506 [INFO] Downloaded: https://repo.maven.apache.org/maven2/aopalliance/aopalliance/1.0/aopalliance-1.0.jar
(5 KB at 26.4 KB/sec)
2017-02-07T07:29:14.507 [INFO] Downloading: https://repo.maven.apache.org/maven2/org/codehaus/plexus/plexus-classworlds/2.4/plexus-classworlds-2.4.jar
2017-02-07T07:29:14.533 [INFO] Downloaded: https://repo.maven.apache.org/maven2/org/codehaus/plexus/plexus-component-annotations/1.5.5/plexus-component-annotations-1.5.5.jar
(5 KB at 21.4 KB/sec)
2017-02-07T07:29:14.533 [INFO] Downloading: https://repo.maven.apache.org/maven2/org/codehaus/plexus/plexus-utils/3.0.17/plexus-utils-3.0.17.jar
2017-02-07T07:29:14.551 [INFO] Downloaded: https://repo.maven.apache.org/maven2/org/codehaus/plexus/plexus-classworlds/2.4/plexus-classworlds-2.4.jar
(46 KB at 219.9 KB/sec)
2017-02-07T07:29:14.598 [INFO] Downloaded: https://repo.maven.apache.org/maven2/org/sonatype/sisu/sisu-guice/3.1.0/sisu-guice-3.1.0-no_aop.jar
(350 KB at 1358.2 KB/sec)
2017-02-07T07:29:14.606 [INFO] Downloaded: https://repo.maven.apache.org/maven2/org/eclipse/sisu/org.eclipse.sisu.inject/0.0.0.M5/org.eclipse.sisu.inject-0.0.0.M5.jar
(285 KB at 1073.8 KB/sec)
2017-02-07T07:29:14.626 [INFO] Downloaded: https://repo.maven.apache.org/maven2/org/codehaus/plexus/plexus-utils/3.0.17/plexus-utils-3.0.17.jar
(246 KB at 865.8 KB/sec)
2017-02-07T07:29:14.712 [INFO] Downloaded: https://repo.maven.apache.org/maven2/com/google/guava/guava/10.0.1/guava-10.0.1.jar
(1467 KB at 3952.5 KB/sec)
2017-02-07T07:29:14.733 [ERROR] [ERROR] Some problems were encountered while processing the
POMs:
[ERROR] Unresolveable build extension: Plugin kr.motd.maven:os-maven-plugin:1.4.0.Final or
one of its dependencies could not be resolved: Could not transfer artifact org.eclipse.sisu:org.eclipse.sisu.plexus:jar:0.0.0.M5
from/to central (https://repo.maven.apache.org/maven2): handshake alert:  unrecognized_name
@ 
 @ 
2017-02-07T07:29:14.736 [ERROR] The build could not read 1 project -> [Help 1]
org.apache.maven.project.ProjectBuildingException: Some problems were encountered while processing
the POMs:
[ERROR] Unresolveable build extension: Plugin kr.motd.maven:os-maven-plugin:1.4.0.Final or
one of its dependencies could not be resolved: Could not transfer artifact org.eclipse.sisu:org.eclipse.sisu.plexus:jar:0.0.0.M5
from/to central (https://repo.maven.apache.org/maven2): handshake alert:  unrecognized_name
@ 

	at org.apache.maven.project.DefaultProjectBuilder.build(DefaultProjectBuilder.java:422)
	at org.apache.maven.graph.DefaultGraphBuilder.collectProjects(DefaultGraphBuilder.java:419)
	at org.apache.maven.graph.DefaultGraphBuilder.getProjectsForMavenReactor(DefaultGraphBuilder.java:410)
	at org.apache.maven.graph.DefaultGraphBuilder.build(DefaultGraphBuilder.java:83)
	at org.apache.maven.DefaultMaven.buildGraph(DefaultMaven.java:491)
	at org.apache.maven.DefaultMaven.doExecute(DefaultMaven.java:219)
	at org.apache.maven.DefaultMaven.doExecute(DefaultMaven.java:193)
	at org.apache.maven.DefaultMaven.execute(DefaultMaven.java:106)
	at org.jvnet.hudson.maven3.launcher.Maven32Launcher.main(Maven32Launcher.java:132)
	at sun.reflect.NativeMethodAccessorImpl.invoke0(Native Method)
	at sun.reflect.NativeMethodAccessorImpl.invoke(NativeMethodAccessorImpl.java:62)
	at sun.reflect.DelegatingMethodAccessorImpl.invoke(DelegatingMethodAccessorImpl.java:43)
	at java.lang.reflect.Method.invoke(Method.java:498)
	at org.codehaus.plexus.classworlds.launcher.Launcher.launchStandard(Launcher.java:330)
	at org.codehaus.plexus.classworlds.launcher.Launcher.launch(Launcher.java:238)
	at jenkins.maven3.agent.Maven32Main.launch(Maven32Main.java:186)
	at sun.reflect.NativeMethodAccessorImpl.invoke0(Native Method)
	at sun.reflect.NativeMethodAccessorImpl.invoke(NativeMethodAccessorImpl.java:62)
	at sun.reflect.DelegatingMethodAccessorImpl.invoke(DelegatingMethodAccessorImpl.java:43)
	at java.lang.reflect.Method.invoke(Method.java:498)
	at hudson.maven.Maven3Builder.call(Maven3Builder.java:136)
	at hudson.maven.Maven3Builder.call(Maven3Builder.java:71)
	at hudson.remoting.UserRequest.perform(UserRequest.java:153)
	at hudson.remoting.UserRequest.perform(UserRequest.java:50)
	at hudson.remoting.Request$2.run(Request.java:332)
	at hudson.remoting.InterceptingExecutorService$1.call(InterceptingExecutorService.java:68)
	at java.util.concurrent.FutureTask.run(FutureTask.java:266)
	at java.util.concurrent.ThreadPoolExecutor.runWorker(ThreadPoolExecutor.java:1142)
	at java.util.concurrent.ThreadPoolExecutor$Worker.run(ThreadPoolExecutor.java:617)
	at java.lang.Thread.run(Thread.java:745)
2017-02-07T07:29:14.737 [ERROR]   
2017-02-07T07:29:14.737 [ERROR]   The project org.apache.beam:beam-parent:0.6.0-SNAPSHOT (<https://builds.apache.org/job/beam_PostCommit_Java_RunnableOnService_Dataflow/ws/pom.xml)>
has 1 error
2017-02-07T07:29:14.738 [ERROR]     Unresolveable build extension: Plugin kr.motd.maven:os-maven-plugin:1.4.0.Final
or one of its dependencies could not be resolved: Could not transfer artifact org.eclipse.sisu:org.eclipse.sisu.plexus:jar:0.0.0.M5
from/to central (https://repo.maven.apache.org/maven2): handshake alert:  unrecognized_name
-> [Help 2]
org.apache.maven.plugin.PluginManagerException: Plugin kr.motd.maven:os-maven-plugin:1.4.0.Final
or one of its dependencies could not be resolved: Could not transfer artifact org.eclipse.sisu:org.eclipse.sisu.plexus:jar:0.0.0.M5
from/to central (https://repo.maven.apache.org/maven2): handshake alert:  unrecognized_name
	at org.apache.maven.plugin.internal.DefaultMavenPluginManager.setupExtensionsRealm(DefaultMavenPluginManager.java:874)
	at org.apache.maven.project.DefaultProjectBuildingHelper.createProjectRealm(DefaultProjectBuildingHelper.java:196)
	at org.apache.maven.project.DefaultModelBuildingListener.buildExtensionsAssembled(DefaultModelBuildingListener.java:111)
	at org.apache.maven.model.building.ModelBuildingEventCatapult$1.fire(ModelBuildingEventCatapult.java:44)
	at org.apache.maven.model.building.DefaultModelBuilder.fireEvent(DefaultModelBuilder.java:1270)
	at org.apache.maven.model.building.DefaultModelBuilder.build(DefaultModelBuilder.java:437)
	at org.apache.maven.model.building.DefaultModelBuilder.build(DefaultModelBuilder.java:417)
	at org.apache.maven.project.DefaultProjectBuilder.build(DefaultProjectBuilder.java:620)
	at org.apache.maven.project.DefaultProjectBuilder.build(DefaultProjectBuilder.java:411)
	at org.apache.maven.graph.DefaultGraphBuilder.collectProjects(DefaultGraphBuilder.java:419)
	at org.apache.maven.graph.DefaultGraphBuilder.getProjectsForMavenReactor(DefaultGraphBuilder.java:410)
	at org.apache.maven.graph.DefaultGraphBuilder.build(DefaultGraphBuilder.java:83)
	at org.apache.maven.DefaultMaven.buildGraph(DefaultMaven.java:491)
	at org.apache.maven.DefaultMaven.doExecute(DefaultMaven.java:219)
	at org.apache.maven.DefaultMaven.doExecute(DefaultMaven.java:193)
	at org.apache.maven.DefaultMaven.execute(DefaultMaven.java:106)
	at org.jvnet.hudson.maven3.launcher.Maven32Launcher.main(Maven32Launcher.java:132)
	at sun.reflect.NativeMethodAccessorImpl.invoke0(Native Method)
	at sun.reflect.NativeMethodAccessorImpl.invoke(NativeMethodAccessorImpl.java:62)
	at sun.reflect.DelegatingMethodAccessorImpl.invoke(DelegatingMethodAccessorImpl.java:43)
	at java.lang.reflect.Method.invoke(Method.java:498)
	at org.codehaus.plexus.classworlds.launcher.Launcher.launchStandard(Launcher.java:330)
	at org.codehaus.plexus.classworlds.launcher.Launcher.launch(Launcher.java:238)
	at jenkins.maven3.agent.Maven32Main.launch(Maven32Main.java:186)
	at sun.reflect.NativeMethodAccessorImpl.invoke0(Native Method)
	at sun.reflect.NativeMethodAccessorImpl.invoke(NativeMethodAccessorImpl.java:62)
	at sun.reflect.DelegatingMethodAccessorImpl.invoke(DelegatingMethodAccessorImpl.java:43)
	at java.lang.reflect.Method.invoke(Method.java:498)
	at hudson.maven.Maven3Builder.call(Maven3Builder.java:136)
	at hudson.maven.Maven3Builder.call(Maven3Builder.java:71)
	at hudson.remoting.UserRequest.perform(UserRequest.java:153)
	at hudson.remoting.UserRequest.perform(UserRequest.java:50)
	at hudson.remoting.Request$2.run(Request.java:332)
	at hudson.remoting.InterceptingExecutorService$1.call(InterceptingExecutorService.java:68)
	at java.util.concurrent.FutureTask.run(FutureTask.java:266)
	at java.util.concurrent.ThreadPoolExecutor.runWorker(ThreadPoolExecutor.java:1142)
	at java.util.concurrent.ThreadPoolExecutor$Worker.run(ThreadPoolExecutor.java:617)
	at java.lang.Thread.run(Thread.java:745)
Caused by: org.apache.maven.plugin.PluginResolutionException: Plugin kr.motd.maven:os-maven-plugin:1.4.0.Final
or one of its dependencies could not be resolved: Could not transfer artifact org.eclipse.sisu:org.eclipse.sisu.plexus:jar:0.0.0.M5
from/to central (https://repo.maven.apache.org/maven2): handshake alert:  unrecognized_name
	at org.apache.maven.plugin.internal.DefaultPluginDependenciesResolver.resolveInternal(DefaultPluginDependenciesResolver.java:218)
	at org.apache.maven.plugin.internal.DefaultPluginDependenciesResolver.resolve(DefaultPluginDependenciesResolver.java:149)
	at org.apache.maven.plugin.internal.DefaultMavenPluginManager.resolveExtensionArtifacts(DefaultMavenPluginManager.java:940)
	at org.apache.maven.plugin.internal.DefaultMavenPluginManager.setupExtensionsRealm(DefaultMavenPluginManager.java:867)
	... 37 more
Caused by: org.eclipse.aether.resolution.ArtifactResolutionException: Could not transfer artifact
org.eclipse.sisu:org.eclipse.sisu.plexus:jar:0.0.0.M5 from/to central (https://repo.maven.apache.org/maven2):
handshake alert:  unrecognized_name
	at org.eclipse.aether.internal.impl.DefaultArtifactResolver.resolve(DefaultArtifactResolver.java:444)
	at org.eclipse.aether.internal.impl.DefaultArtifactResolver.resolveArtifacts(DefaultArtifactResolver.java:246)
	at org.eclipse.aether.internal.impl.DefaultRepositorySystem.resolveDependencies(DefaultRepositorySystem.java:367)
	at org.apache.maven.plugin.internal.DefaultPluginDependenciesResolver.resolveInternal(DefaultPluginDependenciesResolver.java:210)
	... 40 more
Caused by: org.eclipse.aether.transfer.ArtifactTransferException: Could not transfer artifact
org.eclipse.sisu:org.eclipse.sisu.plexus:jar:0.0.0.M5 from/to central (https://repo.maven.apache.org/maven2):
handshake alert:  unrecognized_name
	at org.eclipse.aether.connector.basic.ArtifactTransportListener.transferFailed(ArtifactTransportListener.java:43)
	at org.eclipse.aether.connector.basic.BasicRepositoryConnector$TaskRunner.run(BasicRepositoryConnector.java:355)
	at org.eclipse.aether.util.concurrency.RunnableErrorForwarder$1.run(RunnableErrorForwarder.java:67)
	... 3 more
Caused by: org.apache.maven.wagon.TransferFailedException: handshake alert:  unrecognized_name
	at org.apache.maven.wagon.providers.http.AbstractHttpClientWagon.fillInputData(AbstractHttpClientWagon.java:1066)
	at org.apache.maven.wagon.providers.http.AbstractHttpClientWagon.fillInputData(AbstractHttpClientWagon.java:960)
	at org.apache.maven.wagon.StreamWagon.getInputStream(StreamWagon.java:116)
	at org.apache.maven.wagon.StreamWagon.getIfNewer(StreamWagon.java:88)
	at org.apache.maven.wagon.StreamWagon.get(StreamWagon.java:61)
	at org.eclipse.aether.transport.wagon.WagonTransporter$GetTaskRunner.run(WagonTransporter.java:560)
	at org.eclipse.aether.transport.wagon.WagonTransporter.execute(WagonTransporter.java:427)
	at org.eclipse.aether.transport.wagon.WagonTransporter.get(WagonTransporter.java:404)
	at org.eclipse.aether.connector.basic.BasicRepositoryConnector$GetTaskRunner.runTask(BasicRepositoryConnector.java:447)
	at org.eclipse.aether.connector.basic.BasicRepositoryConnector$TaskRunner.run(BasicRepositoryConnector.java:350)
	... 4 more
Caused by: javax.net.ssl.SSLProtocolException: handshake alert:  unrecognized_name
	at sun.security.ssl.ClientHandshaker.handshakeAlert(ClientHandshaker.java:1441)
	at sun.security.ssl.SSLSocketImpl.recvAlert(SSLSocketImpl.java:2016)
	at sun.security.ssl.SSLSocketImpl.readRecord(SSLSocketImpl.java:1125)
	at sun.security.ssl.SSLSocketImpl.performInitialHandshake(SSLSocketImpl.java:1375)
	at sun.security.ssl.SSLSocketImpl.startHandshake(SSLSocketImpl.java:1403)
	at sun.security.ssl.SSLSocketImpl.startHandshake(SSLSocketImpl.java:1387)
	at org.apache.maven.wagon.providers.http.httpclient.conn.ssl.SSLConnectionSocketFactory.createLayeredSocket(SSLConnectionSocketFactory.java:275)
	at org.apache.maven.wagon.providers.http.httpclient.conn.ssl.SSLConnectionSocketFactory.connectSocket(SSLConnectionSocketFactory.java:254)
	at org.apache.maven.wagon.providers.http.httpclient.impl.conn.HttpClientConnectionOperator.connect(HttpClientConnectionOperator.java:123)
	at org.apache.maven.wagon.providers.http.httpclient.impl.conn.PoolingHttpClientConnectionManager.connect(PoolingHttpClientConnectionManager.java:318)
	at org.apache.maven.wagon.providers.http.httpclient.impl.execchain.MainClientExec.establishRoute(MainClientExec.java:363)
	at org.apache.maven.wagon.providers.http.httpclient.impl.execchain.MainClientExec.execute(MainClientExec.java:219)
	at org.apache.maven.wagon.providers.http.httpclient.impl.execchain.ProtocolExec.execute(ProtocolExec.java:195)
	at org.apache.maven.wagon.providers.http.httpclient.impl.execchain.RetryExec.execute(RetryExec.java:86)
	at org.apache.maven.wagon.providers.http.httpclient.impl.execchain.RedirectExec.execute(RedirectExec.java:108)
	at org.apache.maven.wagon.providers.http.httpclient.impl.client.InternalHttpClient.doExecute(InternalHttpClient.java:184)
	at org.apache.maven.wagon.providers.http.httpclient.impl.client.CloseableHttpClient.execute(CloseableHttpClient.java:82)
	at org.apache.maven.wagon.providers.http.AbstractHttpClientWagon.execute(AbstractHttpClientWagon.java:832)
	at org.apache.maven.wagon.providers.http.AbstractHttpClientWagon.fillInputData(AbstractHttpClientWagon.java:983)
	... 13 more
2017-02-07T07:29:14.742 [ERROR] 
2017-02-07T07:29:14.742 [ERROR] Re-run Maven using the -X switch to enable full debug logging.
2017-02-07T07:29:14.742 [ERROR] 
2017-02-07T07:29:14.742 [ERROR] For more information about the errors and possible solutions,
please read the following articles:
2017-02-07T07:29:14.742 [ERROR] [Help 1] http://cwiki.apache.org/confluence/display/MAVEN/ProjectBuildingException
2017-02-07T07:29:14.742 [ERROR] [Help 2] http://cwiki.apache.org/confluence/display/MAVEN/PluginManagerException
channel stopped

Mime
View raw message