beam-commits mailing list archives

Site index · List index
Message view « Date » · « Thread »
Top « Date » · « Thread »
From Apache Jenkins Server <jenk...@builds.apache.org>
Subject Build failed in Jenkins: beam_PostCommit_Java_RunnableOnService_Dataflow #2361
Date Wed, 22 Feb 2017 00:32:30 GMT
See <https://builds.apache.org/job/beam_PostCommit_Java_RunnableOnService_Dataflow/2361/display/redirect?page=changes>

Changes:

[tgroh] Remove PValue.getProducingTransformInternal

[altay] Remove dependency on apitools

[altay] Remove dependency on datastore

------------------------------------------
[...truncated 1.10 MB...]
2017-02-22T00:32:13.471 [INFO] 
2017-02-22T00:32:13.471 [INFO] --- maven-source-plugin:3.0.1:jar-no-fork (attach-sources)
@ beam-sdks-java-core ---
2017-02-22T00:32:13.476 [INFO] Building jar: <https://builds.apache.org/job/beam_PostCommit_Java_RunnableOnService_Dataflow/ws/sdks/java/core/target/beam-sdks-java-core-0.6.0-SNAPSHOT-sources.jar>
2017-02-22T00:32:13.818 [INFO] 
2017-02-22T00:32:13.818 [INFO] --- maven-source-plugin:3.0.1:test-jar-no-fork (attach-test-sources)
@ beam-sdks-java-core ---
2017-02-22T00:32:13.823 [INFO] Building jar: <https://builds.apache.org/job/beam_PostCommit_Java_RunnableOnService_Dataflow/ws/sdks/java/core/target/beam-sdks-java-core-0.6.0-SNAPSHOT-test-sources.jar>
2017-02-22T00:32:14.109 [INFO] 
2017-02-22T00:32:14.109 [INFO] --- maven-jar-plugin:3.0.2:test-jar (default-test-jar) @ beam-sdks-java-core
---
2017-02-22T00:32:14.273 [INFO] Building jar: <https://builds.apache.org/job/beam_PostCommit_Java_RunnableOnService_Dataflow/ws/sdks/java/core/target/beam-sdks-java-core-0.6.0-SNAPSHOT-tests.jar>
2017-02-22T00:32:14.524 [INFO] 
2017-02-22T00:32:14.524 [INFO] --- maven-shade-plugin:2.4.3:shade (bundle-and-repackage) @
beam-sdks-java-core ---
2017-02-22T00:32:14.546 [INFO] Downloading: https://repo.maven.apache.org/maven2/org/jdom/jdom/1.1/jdom-1.1.pom
2017-02-22T00:32:14.578 [INFO] Downloaded: https://repo.maven.apache.org/maven2/org/jdom/jdom/1.1/jdom-1.1.pom
(3 KB at 66.8 KB/sec)
2017-02-22T00:32:14.582 [INFO] Downloading: https://repo.maven.apache.org/maven2/org/vafer/jdependency/1.1/jdependency-1.1.pom
2017-02-22T00:32:14.610 [INFO] Downloaded: https://repo.maven.apache.org/maven2/org/vafer/jdependency/1.1/jdependency-1.1.pom
(11 KB at 377.3 KB/sec)
2017-02-22T00:32:14.613 [INFO] Downloading: https://repo.maven.apache.org/maven2/org/ow2/asm/asm/5.0.4/asm-5.0.4.pom
2017-02-22T00:32:14.643 [INFO] Downloaded: https://repo.maven.apache.org/maven2/org/ow2/asm/asm/5.0.4/asm-5.0.4.pom
(2 KB at 63.0 KB/sec)
2017-02-22T00:32:14.645 [INFO] Downloading: https://repo.maven.apache.org/maven2/org/ow2/asm/asm-parent/5.0.4/asm-parent-5.0.4.pom
2017-02-22T00:32:14.672 [INFO] Downloaded: https://repo.maven.apache.org/maven2/org/ow2/asm/asm-parent/5.0.4/asm-parent-5.0.4.pom
(6 KB at 198.7 KB/sec)
2017-02-22T00:32:14.675 [INFO] Downloading: https://repo.maven.apache.org/maven2/org/ow2/asm/asm-analysis/5.0.4/asm-analysis-5.0.4.pom
2017-02-22T00:32:14.702 [INFO] Downloaded: https://repo.maven.apache.org/maven2/org/ow2/asm/asm-analysis/5.0.4/asm-analysis-5.0.4.pom
(3 KB at 75.8 KB/sec)
2017-02-22T00:32:14.704 [INFO] Downloading: https://repo.maven.apache.org/maven2/org/ow2/asm/asm-tree/5.0.4/asm-tree-5.0.4.pom
2017-02-22T00:32:14.732 [INFO] Downloaded: https://repo.maven.apache.org/maven2/org/ow2/asm/asm-tree/5.0.4/asm-tree-5.0.4.pom
(3 KB at 72.6 KB/sec)
2017-02-22T00:32:14.734 [INFO] Downloading: https://repo.maven.apache.org/maven2/org/ow2/asm/asm-commons/5.0.4/asm-commons-5.0.4.pom
2017-02-22T00:32:14.762 [INFO] Downloaded: https://repo.maven.apache.org/maven2/org/ow2/asm/asm-commons/5.0.4/asm-commons-5.0.4.pom
(3 KB at 73.0 KB/sec)
2017-02-22T00:32:14.765 [INFO] Downloading: https://repo.maven.apache.org/maven2/org/ow2/asm/asm-util/5.0.4/asm-util-5.0.4.pom
2017-02-22T00:32:14.793 [INFO] Downloaded: https://repo.maven.apache.org/maven2/org/ow2/asm/asm-util/5.0.4/asm-util-5.0.4.pom
(3 KB at 72.8 KB/sec)
2017-02-22T00:32:14.795 [INFO] Downloading: https://repo.maven.apache.org/maven2/com/google/guava/guava/11.0.2/guava-11.0.2.pom
2017-02-22T00:32:14.824 [INFO] Downloaded: https://repo.maven.apache.org/maven2/com/google/guava/guava/11.0.2/guava-11.0.2.pom
(6 KB at 184.2 KB/sec)
2017-02-22T00:32:14.826 [INFO] Downloading: https://repo.maven.apache.org/maven2/com/google/guava/guava-parent/11.0.2/guava-parent-11.0.2.pom
2017-02-22T00:32:14.853 [INFO] Downloaded: https://repo.maven.apache.org/maven2/com/google/guava/guava-parent/11.0.2/guava-parent-11.0.2.pom
(2 KB at 70.9 KB/sec)
2017-02-22T00:32:14.868 [INFO] Downloading: https://repo.maven.apache.org/maven2/org/jdom/jdom/1.1/jdom-1.1.jar
2017-02-22T00:32:14.880 [INFO] Downloading: https://repo.maven.apache.org/maven2/org/vafer/jdependency/1.1/jdependency-1.1.jar
2017-02-22T00:32:14.884 [INFO] Downloading: https://repo.maven.apache.org/maven2/org/ow2/asm/asm-analysis/5.0.4/asm-analysis-5.0.4.jar
2017-02-22T00:32:14.892 [INFO] Downloading: https://repo.maven.apache.org/maven2/org/ow2/asm/asm-util/5.0.4/asm-util-5.0.4.jar
2017-02-22T00:32:14.905 [INFO] Downloading: https://repo.maven.apache.org/maven2/com/google/guava/guava/11.0.2/guava-11.0.2.jar
2017-02-22T00:32:14.939 [INFO] Downloaded: https://repo.maven.apache.org/maven2/org/ow2/asm/asm-util/5.0.4/asm-util-5.0.4.jar
(43 KB at 768.8 KB/sec)
2017-02-22T00:32:14.940 [INFO] Downloaded: https://repo.maven.apache.org/maven2/org/ow2/asm/asm-analysis/5.0.4/asm-analysis-5.0.4.jar
(20 KB at 316.9 KB/sec)
2017-02-22T00:32:14.950 [INFO] Downloaded: https://repo.maven.apache.org/maven2/org/vafer/jdependency/1.1/jdependency-1.1.jar
(22 KB at 262.2 KB/sec)
2017-02-22T00:32:14.950 [INFO] Downloaded: https://repo.maven.apache.org/maven2/org/jdom/jdom/1.1/jdom-1.1.jar
(150 KB at 1661.4 KB/sec)
2017-02-22T00:32:15.088 [INFO] Downloaded: https://repo.maven.apache.org/maven2/com/google/guava/guava/11.0.2/guava-11.0.2.jar
(1610 KB at 8212.1 KB/sec)
2017-02-22T00:32:15.237 [INFO] Excluding org.apache.beam:beam-sdks-common-runner-api:jar:0.6.0-SNAPSHOT
from the shaded jar.
2017-02-22T00:32:15.248 [INFO] Excluding io.grpc:grpc-auth:jar:1.0.1 from the shaded jar.
2017-02-22T00:32:15.248 [INFO] Excluding io.grpc:grpc-core:jar:1.0.1 from the shaded jar.
2017-02-22T00:32:15.249 [INFO] Excluding io.grpc:grpc-context:jar:1.0.1 from the shaded jar.
2017-02-22T00:32:15.249 [INFO] Excluding io.grpc:grpc-netty:jar:1.0.1 from the shaded jar.
2017-02-22T00:32:15.249 [INFO] Excluding io.netty:netty-codec-http2:jar:4.1.3.Final from the
shaded jar.
2017-02-22T00:32:15.249 [INFO] Excluding io.netty:netty-codec-http:jar:4.1.3.Final from the
shaded jar.
2017-02-22T00:32:15.249 [INFO] Excluding io.grpc:grpc-stub:jar:1.0.1 from the shaded jar.
2017-02-22T00:32:15.249 [INFO] Excluding io.grpc:grpc-all:jar:1.0.1 from the shaded jar.
2017-02-22T00:32:15.249 [INFO] Excluding io.grpc:grpc-protobuf:jar:1.0.1 from the shaded jar.
2017-02-22T00:32:15.250 [INFO] Excluding com.google.protobuf:protobuf-java-util:jar:3.0.0
from the shaded jar.
2017-02-22T00:32:15.250 [INFO] Excluding com.google.code.gson:gson:jar:2.3 from the shaded
jar.
2017-02-22T00:32:15.250 [INFO] Excluding io.grpc:grpc-protobuf-nano:jar:1.0.1 from the shaded
jar.
2017-02-22T00:32:15.250 [INFO] Excluding com.google.protobuf.nano:protobuf-javanano:jar:3.0.0-alpha-5
from the shaded jar.
2017-02-22T00:32:15.250 [INFO] Excluding io.grpc:grpc-okhttp:jar:1.0.1 from the shaded jar.
2017-02-22T00:32:15.250 [INFO] Excluding com.squareup.okio:okio:jar:1.6.0 from the shaded
jar.
2017-02-22T00:32:15.250 [INFO] Excluding com.squareup.okhttp:okhttp:jar:2.5.0 from the shaded
jar.
2017-02-22T00:32:15.250 [INFO] Excluding io.grpc:grpc-protobuf-lite:jar:1.0.1 from the shaded
jar.
2017-02-22T00:32:15.250 [INFO] Excluding com.google.protobuf:protobuf-lite:jar:3.0.1 from
the shaded jar.
2017-02-22T00:32:15.251 [INFO] Excluding com.google.auth:google-auth-library-credentials:jar:0.6.0
from the shaded jar.
2017-02-22T00:32:15.251 [INFO] Excluding com.google.auth:google-auth-library-oauth2-http:jar:0.6.0
from the shaded jar.
2017-02-22T00:32:15.251 [INFO] Excluding io.netty:netty-handler:jar:4.1.3.Final from the shaded
jar.
2017-02-22T00:32:15.252 [INFO] Excluding io.netty:netty-buffer:jar:4.1.3.Final from the shaded
jar.
2017-02-22T00:32:15.252 [INFO] Excluding io.netty:netty-common:jar:4.1.3.Final from the shaded
jar.
2017-02-22T00:32:15.252 [INFO] Excluding io.netty:netty-transport:jar:4.1.3.Final from the
shaded jar.
2017-02-22T00:32:15.252 [INFO] Excluding io.netty:netty-resolver:jar:4.1.3.Final from the
shaded jar.
2017-02-22T00:32:15.252 [INFO] Excluding io.netty:netty-codec:jar:4.1.3.Final from the shaded
jar.
2017-02-22T00:32:15.252 [INFO] Excluding com.google.api.grpc:grpc-google-pubsub-v1:jar:0.1.0
from the shaded jar.
2017-02-22T00:32:15.253 [INFO] Excluding com.google.api.grpc:grpc-google-common-protos:jar:0.1.0
from the shaded jar.
2017-02-22T00:32:15.253 [INFO] Excluding com.google.api.grpc:grpc-google-iam-v1:jar:0.1.0
from the shaded jar.
2017-02-22T00:32:15.253 [INFO] Excluding com.google.api-client:google-api-client:jar:1.22.0
from the shaded jar.
2017-02-22T00:32:15.253 [INFO] Excluding com.google.apis:google-api-services-bigquery:jar:v2-rev295-1.22.0
from the shaded jar.
2017-02-22T00:32:15.253 [INFO] Excluding com.google.apis:google-api-services-cloudresourcemanager:jar:v1-rev6-1.22.0
from the shaded jar.
2017-02-22T00:32:15.253 [INFO] Excluding com.google.apis:google-api-services-pubsub:jar:v1-rev10-1.22.0
from the shaded jar.
2017-02-22T00:32:15.253 [INFO] Excluding com.google.apis:google-api-services-storage:jar:v1-rev71-1.22.0
from the shaded jar.
2017-02-22T00:32:15.254 [INFO] Excluding com.google.http-client:google-http-client:jar:1.22.0
from the shaded jar.
2017-02-22T00:32:15.254 [INFO] Excluding org.apache.httpcomponents:httpclient:jar:4.0.1 from
the shaded jar.
2017-02-22T00:32:15.254 [INFO] Excluding org.apache.httpcomponents:httpcore:jar:4.0.1 from
the shaded jar.
2017-02-22T00:32:15.254 [INFO] Excluding commons-logging:commons-logging:jar:1.1.1 from the
shaded jar.
2017-02-22T00:32:15.254 [INFO] Excluding commons-codec:commons-codec:jar:1.3 from the shaded
jar.
2017-02-22T00:32:15.254 [INFO] Excluding com.google.http-client:google-http-client-jackson:jar:1.22.0
from the shaded jar.
2017-02-22T00:32:15.254 [INFO] Excluding com.google.http-client:google-http-client-jackson2:jar:1.22.0
from the shaded jar.
2017-02-22T00:32:15.254 [INFO] Excluding com.google.http-client:google-http-client-protobuf:jar:1.22.0
from the shaded jar.
2017-02-22T00:32:15.254 [INFO] Excluding com.google.oauth-client:google-oauth-client:jar:1.22.0
from the shaded jar.
2017-02-22T00:32:15.254 [INFO] Excluding com.google.cloud.bigdataoss:gcsio:jar:1.4.5 from
the shaded jar.
2017-02-22T00:32:15.255 [INFO] Excluding com.google.api-client:google-api-client-java6:jar:1.22.0
from the shaded jar.
2017-02-22T00:32:15.255 [INFO] Excluding com.google.api-client:google-api-client-jackson2:jar:1.22.0
from the shaded jar.
2017-02-22T00:32:15.255 [INFO] Excluding com.google.oauth-client:google-oauth-client-java6:jar:1.22.0
from the shaded jar.
2017-02-22T00:32:15.255 [INFO] Excluding com.google.cloud.bigdataoss:util:jar:1.4.5 from the
shaded jar.
2017-02-22T00:32:15.255 [INFO] Including com.google.guava:guava:jar:20.0 in the shaded jar.
2017-02-22T00:32:15.255 [INFO] Excluding com.google.protobuf:protobuf-java:jar:3.1.0 from
the shaded jar.
2017-02-22T00:32:15.255 [INFO] Excluding com.google.code.findbugs:jsr305:jar:3.0.1 from the
shaded jar.
2017-02-22T00:32:15.255 [INFO] Excluding com.fasterxml.jackson.core:jackson-core:jar:2.7.2
from the shaded jar.
2017-02-22T00:32:15.255 [INFO] Excluding com.fasterxml.jackson.core:jackson-annotations:jar:2.7.2
from the shaded jar.
2017-02-22T00:32:15.256 [INFO] Excluding com.fasterxml.jackson.core:jackson-databind:jar:2.7.2
from the shaded jar.
2017-02-22T00:32:15.256 [INFO] Excluding org.slf4j:slf4j-api:jar:1.7.14 from the shaded jar.
2017-02-22T00:32:15.256 [INFO] Excluding net.bytebuddy:byte-buddy:jar:1.6.8 from the shaded
jar.
2017-02-22T00:32:15.256 [INFO] Excluding org.apache.avro:avro:jar:1.8.1 from the shaded jar.
2017-02-22T00:32:15.256 [INFO] Excluding org.codehaus.jackson:jackson-core-asl:jar:1.9.13
from the shaded jar.
2017-02-22T00:32:15.258 [INFO] Excluding org.codehaus.jackson:jackson-mapper-asl:jar:1.9.13
from the shaded jar.
2017-02-22T00:32:15.258 [INFO] Excluding com.thoughtworks.paranamer:paranamer:jar:2.7 from
the shaded jar.
2017-02-22T00:32:15.259 [INFO] Excluding org.xerial.snappy:snappy-java:jar:1.1.2.1 from the
shaded jar.
2017-02-22T00:32:15.259 [INFO] Excluding org.apache.commons:commons-compress:jar:1.9 from
the shaded jar.
2017-02-22T00:32:15.259 [INFO] Excluding org.apache.commons:commons-lang3:jar:3.5 from the
shaded jar.
2017-02-22T00:32:15.259 [INFO] Excluding joda-time:joda-time:jar:2.4 from the shaded jar.
2017-02-22T00:32:15.259 [INFO] Excluding org.codehaus.woodstox:stax2-api:jar:3.1.4 from the
shaded jar.
2017-02-22T00:32:15.259 [INFO] Excluding org.codehaus.woodstox:woodstox-core-asl:jar:4.4.1
from the shaded jar.
2017-02-22T00:32:15.259 [INFO] Excluding org.tukaani:xz:jar:1.5 from the shaded jar.
2017-02-22T00:32:15.259 [INFO] Excluding com.google.auto.service:auto-service:jar:1.0-rc2
from the shaded jar.
2017-02-22T00:32:15.259 [INFO] Excluding com.google.auto:auto-common:jar:0.3 from the shaded
jar.
2017-02-22T00:32:21.081 [INFO] Replacing original artifact with shaded artifact.
2017-02-22T00:32:21.081 [INFO] Replacing <https://builds.apache.org/job/beam_PostCommit_Java_RunnableOnService_Dataflow/ws/sdks/java/core/target/beam-sdks-java-core-0.6.0-SNAPSHOT.jar>
with <https://builds.apache.org/job/beam_PostCommit_Java_RunnableOnService_Dataflow/ws/sdks/java/core/target/beam-sdks-java-core-0.6.0-SNAPSHOT-shaded.jar>
2017-02-22T00:32:21.081 [INFO] Replacing original test artifact with shaded test artifact.
2017-02-22T00:32:21.081 [INFO] Replacing <https://builds.apache.org/job/beam_PostCommit_Java_RunnableOnService_Dataflow/ws/sdks/java/core/target/beam-sdks-java-core-0.6.0-SNAPSHOT-tests.jar>
with <https://builds.apache.org/job/beam_PostCommit_Java_RunnableOnService_Dataflow/ws/sdks/java/core/target/beam-sdks-java-core-0.6.0-SNAPSHOT-shaded-tests.jar>
2017-02-22T00:32:21.082 [INFO] Dependency-reduced POM written at: <https://builds.apache.org/job/beam_PostCommit_Java_RunnableOnService_Dataflow/ws/sdks/java/core/dependency-reduced-pom.xml>
2017-02-22T00:32:21.244 [INFO] Dependency-reduced POM written at: <https://builds.apache.org/job/beam_PostCommit_Java_RunnableOnService_Dataflow/ws/sdks/java/core/dependency-reduced-pom.xml>
2017-02-22T00:32:21.390 [INFO] 
2017-02-22T00:32:21.390 [INFO] --- maven-dependency-plugin:3.0.0:analyze-only (default) @
beam-sdks-java-core ---
2017-02-22T00:32:21.854 [INFO] No dependency problems found
2017-02-22T00:32:21.948 [INFO] 
2017-02-22T00:32:21.948 [INFO] --- apache-rat-plugin:0.12:check (default) @ beam-sdks-java-core
---
2017-02-22T00:32:21.954 [INFO] Enabled default license matchers.
2017-02-22T00:32:21.954 [INFO] Will parse SCM ignores for exclusions...
2017-02-22T00:32:21.954 [INFO] Finished adding exclusions from SCM ignore files.
2017-02-22T00:32:21.954 [INFO] 61 implicit excludes (use -debug for more details).
2017-02-22T00:32:21.955 [INFO] Exclude: **/target/**/*
2017-02-22T00:32:21.955 [INFO] Exclude: **/dependency-reduced-pom.xml
2017-02-22T00:32:21.955 [INFO] Exclude: **/hs_err_pid*.log
2017-02-22T00:32:21.955 [INFO] Exclude: .github/**/*
2017-02-22T00:32:21.955 [INFO] Exclude: **/*.iml
2017-02-22T00:32:21.955 [INFO] Exclude: **/.idea/**/*
2017-02-22T00:32:21.955 [INFO] Exclude: **/*.egg-info/**/*
2017-02-22T00:32:21.955 [INFO] Exclude: **/package-list
2017-02-22T00:32:21.955 [INFO] Exclude: **/user.avsc
2017-02-22T00:32:21.955 [INFO] Exclude: **/test/resources/**/*.txt
2017-02-22T00:32:21.956 [INFO] Exclude: **/test/**/.placeholder
2017-02-22T00:32:21.956 [INFO] Exclude: .repository/**/*
2017-02-22T00:32:21.956 [INFO] Exclude: **/nose-*.egg/**/*
2017-02-22T00:32:21.956 [INFO] Exclude: **/.eggs/**/*
2017-02-22T00:32:21.956 [INFO] Exclude: **/.tox/**/*
2017-02-22T00:32:21.956 [INFO] Exclude: **/.checkstyle
2017-02-22T00:32:21.956 [INFO] Exclude: **/.classpath
2017-02-22T00:32:21.956 [INFO] Exclude: **/.factorypath
2017-02-22T00:32:21.956 [INFO] Exclude: **/.project
2017-02-22T00:32:21.956 [INFO] Exclude: **/.settings/**/*
2017-02-22T00:32:22.036 [INFO] 687 resources included (use -debug for more details)
[JENKINS] Archiving disabled
[JENKINS] Archiving disabled
[JENKINS] Archiving disabled
[JENKINS] Archiving disabled
[JENKINS] Archiving disabled
[JENKINS] Archiving disabled
[JENKINS] Archiving disabled
[JENKINS] Archiving disabled
[JENKINS] Archiving disabled
[JENKINS] Archiving disabled
[JENKINS] Archiving disabled
2017-02-22T00:32:26.322 [INFO] ------------------------------------------------------------------------
2017-02-22T00:32:26.322 [INFO] Reactor Summary:
2017-02-22T00:32:26.322 [INFO] 
2017-02-22T00:32:26.322 [INFO] Apache Beam :: Parent .............................. SUCCESS
[ 23.958 s]
2017-02-22T00:32:26.322 [INFO] Apache Beam :: SDKs :: Java :: Build Tools ......... SUCCESS
[  4.047 s]
2017-02-22T00:32:26.322 [INFO] Apache Beam :: SDKs ................................ SUCCESS
[  6.183 s]
2017-02-22T00:32:26.322 [INFO] Apache Beam :: SDKs :: Common ...................... SUCCESS
[  1.598 s]
2017-02-22T00:32:26.322 [INFO] Apache Beam :: SDKs :: Common :: Fn API ............ SUCCESS
[ 19.838 s]
2017-02-22T00:32:26.322 [INFO] Apache Beam :: SDKs :: Common :: Runner API ........ SUCCESS
[ 18.721 s]
2017-02-22T00:32:26.322 [INFO] Apache Beam :: SDKs :: Java ........................ SUCCESS
[  2.107 s]
2017-02-22T00:32:26.322 [INFO] Apache Beam :: SDKs :: Java :: Core ................ FAILURE
[03:08 min]
2017-02-22T00:32:26.322 [INFO] Apache Beam :: Runners ............................. SKIPPED
2017-02-22T00:32:26.322 [INFO] Apache Beam :: Runners :: Google Cloud Dataflow .... SKIPPED
2017-02-22T00:32:26.322 [INFO] ------------------------------------------------------------------------
2017-02-22T00:32:26.322 [INFO] BUILD FAILURE
2017-02-22T00:32:26.322 [INFO] ------------------------------------------------------------------------
2017-02-22T00:32:26.322 [INFO] Total time: 04:51 min
2017-02-22T00:32:26.323 [INFO] Finished at: 2017-02-22T00:32:26+00:00
2017-02-22T00:32:27.106 [INFO] Final Memory: 145M/1575M
2017-02-22T00:32:27.106 [INFO] ------------------------------------------------------------------------
Waiting for Jenkins to finish collecting data
2017-02-22T00:32:27.268 [ERROR] Failed to execute goal org.apache.rat:apache-rat-plugin:0.12:check
(default) on project beam-sdks-java-core: Cannot read header: src/test/java/org/apache/beam/sdk/TestUtils.java
(No such file or directory) -> [Help 1]
org.apache.maven.lifecycle.LifecycleExecutionException: Failed to execute goal org.apache.rat:apache-rat-plugin:0.12:check
(default) on project beam-sdks-java-core: Cannot read header
	at org.apache.maven.lifecycle.internal.MojoExecutor.execute(MojoExecutor.java:216)
	at org.apache.maven.lifecycle.internal.MojoExecutor.execute(MojoExecutor.java:153)
	at org.apache.maven.lifecycle.internal.MojoExecutor.execute(MojoExecutor.java:145)
	at org.apache.maven.lifecycle.internal.LifecycleModuleBuilder.buildProject(LifecycleModuleBuilder.java:116)
	at org.apache.maven.lifecycle.internal.LifecycleModuleBuilder.buildProject(LifecycleModuleBuilder.java:80)
	at org.apache.maven.lifecycle.internal.builder.singlethreaded.SingleThreadedBuilder.build(SingleThreadedBuilder.java:51)
	at org.apache.maven.lifecycle.internal.LifecycleStarter.execute(LifecycleStarter.java:128)
	at org.apache.maven.DefaultMaven.doExecute(DefaultMaven.java:307)
	at org.apache.maven.DefaultMaven.doExecute(DefaultMaven.java:193)
	at org.apache.maven.DefaultMaven.execute(DefaultMaven.java:106)
	at org.jvnet.hudson.maven3.launcher.Maven33Launcher.main(Maven33Launcher.java:129)
	at sun.reflect.NativeMethodAccessorImpl.invoke0(Native Method)
	at sun.reflect.NativeMethodAccessorImpl.invoke(NativeMethodAccessorImpl.java:62)
	at sun.reflect.DelegatingMethodAccessorImpl.invoke(DelegatingMethodAccessorImpl.java:43)
	at java.lang.reflect.Method.invoke(Method.java:498)
	at org.codehaus.plexus.classworlds.launcher.Launcher.launchStandard(Launcher.java:330)
	at org.codehaus.plexus.classworlds.launcher.Launcher.launch(Launcher.java:238)
	at jenkins.maven3.agent.Maven33Main.launch(Maven33Main.java:176)
	at sun.reflect.NativeMethodAccessorImpl.invoke0(Native Method)
	at sun.reflect.NativeMethodAccessorImpl.invoke(NativeMethodAccessorImpl.java:62)
	at sun.reflect.DelegatingMethodAccessorImpl.invoke(DelegatingMethodAccessorImpl.java:43)
	at java.lang.reflect.Method.invoke(Method.java:498)
	at hudson.maven.Maven3Builder.call(Maven3Builder.java:139)
	at hudson.maven.Maven3Builder.call(Maven3Builder.java:70)
	at hudson.remoting.UserRequest.perform(UserRequest.java:153)
	at hudson.remoting.UserRequest.perform(UserRequest.java:50)
	at hudson.remoting.Request$2.run(Request.java:336)
	at hudson.remoting.InterceptingExecutorService$1.call(InterceptingExecutorService.java:68)
	at java.util.concurrent.FutureTask.run(FutureTask.java:266)
	at java.util.concurrent.ThreadPoolExecutor.runWorker(ThreadPoolExecutor.java:1142)
	at java.util.concurrent.ThreadPoolExecutor$Worker.run(ThreadPoolExecutor.java:617)
	at java.lang.Thread.run(Thread.java:745)
Caused by: org.apache.maven.plugin.MojoExecutionException: Cannot read header
	at org.apache.rat.mp.AbstractRatMojo.createReport(AbstractRatMojo.java:523)
	at org.apache.rat.mp.RatCheckMojo.getRawReport(RatCheckMojo.java:105)
	at org.apache.rat.mp.RatCheckMojo.execute(RatCheckMojo.java:155)
	at org.apache.maven.plugin.DefaultBuildPluginManager.executeMojo(DefaultBuildPluginManager.java:134)
	at org.apache.maven.lifecycle.internal.MojoExecutor.execute(MojoExecutor.java:208)
	... 31 more
Caused by: org.apache.rat.api.RatException: Cannot read header
	at org.apache.rat.report.claim.util.ClaimReporterMultiplexer.report(ClaimReporterMultiplexer.java:44)
	at org.apache.rat.mp.FilesReportable.run(FilesReportable.java:68)
	at org.apache.rat.Report.report(Report.java:423)
	at org.apache.rat.Report.report(Report.java:402)
	at org.apache.rat.mp.AbstractRatMojo.createReport(AbstractRatMojo.java:512)
	... 35 more
Caused by: org.apache.rat.document.RatDocumentAnalysisException: Cannot read header
	at org.apache.rat.analysis.DocumentHeaderAnalyser.analyse(DocumentHeaderAnalyser.java:46)
	at org.apache.rat.analysis.DefaultAnalyserFactory$DefaultAnalyser.analyse(DefaultAnalyserFactory.java:60)
	at org.apache.rat.document.impl.util.DocumentAnalyserMultiplexer.analyse(DocumentAnalyserMultiplexer.java:36)
	at org.apache.rat.report.claim.util.ClaimReporterMultiplexer.report(ClaimReporterMultiplexer.java:42)
	... 39 more
Caused by: java.io.FileNotFoundException: src/test/java/org/apache/beam/sdk/TestUtils.java
(No such file or directory)
	at java.io.FileInputStream.open0(Native Method)
	at java.io.FileInputStream.open(FileInputStream.java:195)
	at java.io.FileInputStream.<init>(FileInputStream.java:138)
	at org.apache.rat.mp.FilesReportable$FileDocument.reader(FilesReportable.java:88)
	at org.apache.rat.analysis.DocumentHeaderAnalyser.analyse(DocumentHeaderAnalyser.java:41)
	... 42 more
2017-02-22T00:32:27.270 [ERROR] 
2017-02-22T00:32:27.270 [ERROR] Re-run Maven using the -X switch to enable full debug logging.
2017-02-22T00:32:27.270 [ERROR] 
2017-02-22T00:32:27.270 [ERROR] For more information about the errors and possible solutions,
please read the following articles:
2017-02-22T00:32:27.270 [ERROR] [Help 1] http://cwiki.apache.org/confluence/display/MAVEN/MojoExecutionException
2017-02-22T00:32:27.270 [ERROR] 
2017-02-22T00:32:27.270 [ERROR] After correcting the problems, you can resume the build with
the command
2017-02-22T00:32:27.270 [ERROR]   mvn <goals> -rf :beam-sdks-java-core
channel stopped

Mime
View raw message