beam-commits mailing list archives

Site index · List index
Message view « Date » · « Thread »
Top « Date » · « Thread »
From Apache Jenkins Server <jenk...@builds.apache.org>
Subject Build failed in Jenkins: beam_PostCommit_Python_Verify #1366
Date Sat, 25 Feb 2017 22:13:43 GMT
See <https://builds.apache.org/job/beam_PostCommit_Python_Verify/1366/display/redirect>

------------------------------------------
[...truncated 267.94 KB...]
  File was already downloaded /tmp/dataflow-requirements-cache/setuptools-34.3.0.zip
Collecting six (from pyhamcrest->-r postcommit_requirements.txt (line 1))
  File was already downloaded /tmp/dataflow-requirements-cache/six-1.10.0.tar.gz
Collecting funcsigs>=1 (from mock->-r postcommit_requirements.txt (line 2))
  File was already downloaded /tmp/dataflow-requirements-cache/funcsigs-1.0.2.tar.gz
Collecting pbr>=0.11 (from mock->-r postcommit_requirements.txt (line 2))
  File was already downloaded /tmp/dataflow-requirements-cache/pbr-1.10.0.tar.gz
Collecting packaging>=16.8 (from setuptools->pyhamcrest->-r postcommit_requirements.txt
(line 1))
  File was already downloaded /tmp/dataflow-requirements-cache/packaging-16.8.tar.gz
Collecting appdirs>=1.4.0 (from setuptools->pyhamcrest->-r postcommit_requirements.txt
(line 1))
  File was already downloaded /tmp/dataflow-requirements-cache/appdirs-1.4.2.tar.gz
Collecting pyparsing (from packaging>=16.8->setuptools->pyhamcrest->-r postcommit_requirements.txt
(line 1))
  File was already downloaded /tmp/dataflow-requirements-cache/pyparsing-2.1.10.zip
Successfully downloaded pyhamcrest mock setuptools six funcsigs pbr packaging appdirs pyparsing
ok
test_as_list_and_as_dict_side_inputs (apache_beam.transforms.sideinputs_test.SideInputsTest)
... DEPRECATION: pip install --download has been deprecated and will be removed in the future.
Pip now has a download command that should be used instead.
Collecting pyhamcrest (from -r postcommit_requirements.txt (line 1))
  File was already downloaded /tmp/dataflow-requirements-cache/PyHamcrest-1.9.0.tar.gz
Collecting mock (from -r postcommit_requirements.txt (line 2))
  File was already downloaded /tmp/dataflow-requirements-cache/mock-2.0.0.tar.gz
Collecting setuptools (from pyhamcrest->-r postcommit_requirements.txt (line 1))
  File was already downloaded /tmp/dataflow-requirements-cache/setuptools-34.3.0.zip
Collecting six (from pyhamcrest->-r postcommit_requirements.txt (line 1))
  File was already downloaded /tmp/dataflow-requirements-cache/six-1.10.0.tar.gz
Collecting funcsigs>=1 (from mock->-r postcommit_requirements.txt (line 2))
  File was already downloaded /tmp/dataflow-requirements-cache/funcsigs-1.0.2.tar.gz
Collecting pbr>=0.11 (from mock->-r postcommit_requirements.txt (line 2))
  File was already downloaded /tmp/dataflow-requirements-cache/pbr-1.10.0.tar.gz
Collecting packaging>=16.8 (from setuptools->pyhamcrest->-r postcommit_requirements.txt
(line 1))
  File was already downloaded /tmp/dataflow-requirements-cache/packaging-16.8.tar.gz
Collecting appdirs>=1.4.0 (from setuptools->pyhamcrest->-r postcommit_requirements.txt
(line 1))
  File was already downloaded /tmp/dataflow-requirements-cache/appdirs-1.4.2.tar.gz
Collecting pyparsing (from packaging>=16.8->setuptools->pyhamcrest->-r postcommit_requirements.txt
(line 1))
  File was already downloaded /tmp/dataflow-requirements-cache/pyparsing-2.1.10.zip
Successfully downloaded pyhamcrest mock setuptools six funcsigs pbr packaging appdirs pyparsing
ok
test_as_list_with_unique_labels (apache_beam.transforms.sideinputs_test.SideInputsTest) ...
DEPRECATION: pip install --download has been deprecated and will be removed in the future.
Pip now has a download command that should be used instead.
Collecting pyhamcrest (from -r postcommit_requirements.txt (line 1))
<https://builds.apache.org/job/beam_PostCommit_Python_Verify/ws/sdks/python/local/lib/python2.7/site-packages/pip/_vendor/requests/packages/urllib3/util/ssl_.py>:318:
SNIMissingWarning: An HTTPS request has been made, but the SNI (Subject Name Indication) extension
to TLS is not available on this platform. This may cause the server to present an incorrect
TLS certificate, which can cause validation failures. You can upgrade to a newer version of
Python to solve this. For more information, see https://urllib3.readthedocs.io/en/latest/security.html#snimissingwarning.
  SNIMissingWarning
<https://builds.apache.org/job/beam_PostCommit_Python_Verify/ws/sdks/python/local/lib/python2.7/site-packages/pip/_vendor/requests/packages/urllib3/util/ssl_.py>:122:
InsecurePlatformWarning: A true SSLContext object is not available. This prevents urllib3
from configuring SSL appropriately and may cause certain SSL connections to fail. You can
upgrade to a newer version of Python to solve this. For more information, see https://urllib3.readthedocs.io/en/latest/security.html#insecureplatformwarning.
  InsecurePlatformWarning
  File was already downloaded /tmp/dataflow-requirements-cache/PyHamcrest-1.9.0.tar.gz
Collecting mock (from -r postcommit_requirements.txt (line 2))
  File was already downloaded /tmp/dataflow-requirements-cache/mock-2.0.0.tar.gz
Collecting setuptools (from pyhamcrest->-r postcommit_requirements.txt (line 1))
  File was already downloaded /tmp/dataflow-requirements-cache/setuptools-34.3.0.zip
Collecting six (from pyhamcrest->-r postcommit_requirements.txt (line 1))
  File was already downloaded /tmp/dataflow-requirements-cache/six-1.10.0.tar.gz
Collecting funcsigs>=1 (from mock->-r postcommit_requirements.txt (line 2))
  File was already downloaded /tmp/dataflow-requirements-cache/funcsigs-1.0.2.tar.gz
Collecting pbr>=0.11 (from mock->-r postcommit_requirements.txt (line 2))
  File was already downloaded /tmp/dataflow-requirements-cache/pbr-1.10.0.tar.gz
Collecting packaging>=16.8 (from setuptools->pyhamcrest->-r postcommit_requirements.txt
(line 1))
  File was already downloaded /tmp/dataflow-requirements-cache/packaging-16.8.tar.gz
Collecting appdirs>=1.4.0 (from setuptools->pyhamcrest->-r postcommit_requirements.txt
(line 1))
  File was already downloaded /tmp/dataflow-requirements-cache/appdirs-1.4.2.tar.gz
Collecting pyparsing (from packaging>=16.8->setuptools->pyhamcrest->-r postcommit_requirements.txt
(line 1))
  File was already downloaded /tmp/dataflow-requirements-cache/pyparsing-2.1.10.zip
Successfully downloaded pyhamcrest mock setuptools six funcsigs pbr packaging appdirs pyparsing
ok
test_as_list_without_unique_labels (apache_beam.transforms.sideinputs_test.SideInputsTest)
... DEPRECATION: pip install --download has been deprecated and will be removed in the future.
Pip now has a download command that should be used instead.
Collecting pyhamcrest (from -r postcommit_requirements.txt (line 1))
  File was already downloaded /tmp/dataflow-requirements-cache/PyHamcrest-1.9.0.tar.gz
Collecting mock (from -r postcommit_requirements.txt (line 2))
  File was already downloaded /tmp/dataflow-requirements-cache/mock-2.0.0.tar.gz
Collecting setuptools (from pyhamcrest->-r postcommit_requirements.txt (line 1))
  File was already downloaded /tmp/dataflow-requirements-cache/setuptools-34.3.0.zip
Collecting six (from pyhamcrest->-r postcommit_requirements.txt (line 1))
  File was already downloaded /tmp/dataflow-requirements-cache/six-1.10.0.tar.gz
Collecting funcsigs>=1 (from mock->-r postcommit_requirements.txt (line 2))
  File was already downloaded /tmp/dataflow-requirements-cache/funcsigs-1.0.2.tar.gz
Collecting pbr>=0.11 (from mock->-r postcommit_requirements.txt (line 2))
  File was already downloaded /tmp/dataflow-requirements-cache/pbr-1.10.0.tar.gz
Collecting packaging>=16.8 (from setuptools->pyhamcrest->-r postcommit_requirements.txt
(line 1))
  File was already downloaded /tmp/dataflow-requirements-cache/packaging-16.8.tar.gz
Collecting appdirs>=1.4.0 (from setuptools->pyhamcrest->-r postcommit_requirements.txt
(line 1))
  File was already downloaded /tmp/dataflow-requirements-cache/appdirs-1.4.2.tar.gz
Collecting pyparsing (from packaging>=16.8->setuptools->pyhamcrest->-r postcommit_requirements.txt
(line 1))
  File was already downloaded /tmp/dataflow-requirements-cache/pyparsing-2.1.10.zip
Successfully downloaded pyhamcrest mock setuptools six funcsigs pbr packaging appdirs pyparsing
ok
test_as_singleton_with_different_defaults_with_unique_labels (apache_beam.transforms.sideinputs_test.SideInputsTest)
... DEPRECATION: pip install --download has been deprecated and will be removed in the future.
Pip now has a download command that should be used instead.
Collecting pyhamcrest (from -r postcommit_requirements.txt (line 1))
<https://builds.apache.org/job/beam_PostCommit_Python_Verify/ws/sdks/python/local/lib/python2.7/site-packages/pip/_vendor/requests/packages/urllib3/util/ssl_.py>:318:
SNIMissingWarning: An HTTPS request has been made, but the SNI (Subject Name Indication) extension
to TLS is not available on this platform. This may cause the server to present an incorrect
TLS certificate, which can cause validation failures. You can upgrade to a newer version of
Python to solve this. For more information, see https://urllib3.readthedocs.io/en/latest/security.html#snimissingwarning.
  SNIMissingWarning
<https://builds.apache.org/job/beam_PostCommit_Python_Verify/ws/sdks/python/local/lib/python2.7/site-packages/pip/_vendor/requests/packages/urllib3/util/ssl_.py>:122:
InsecurePlatformWarning: A true SSLContext object is not available. This prevents urllib3
from configuring SSL appropriately and may cause certain SSL connections to fail. You can
upgrade to a newer version of Python to solve this. For more information, see https://urllib3.readthedocs.io/en/latest/security.html#insecureplatformwarning.
  InsecurePlatformWarning
  File was already downloaded /tmp/dataflow-requirements-cache/PyHamcrest-1.9.0.tar.gz
Collecting mock (from -r postcommit_requirements.txt (line 2))
  File was already downloaded /tmp/dataflow-requirements-cache/mock-2.0.0.tar.gz
Collecting setuptools (from pyhamcrest->-r postcommit_requirements.txt (line 1))
  File was already downloaded /tmp/dataflow-requirements-cache/setuptools-34.3.0.zip
Collecting six (from pyhamcrest->-r postcommit_requirements.txt (line 1))
  File was already downloaded /tmp/dataflow-requirements-cache/six-1.10.0.tar.gz
Collecting funcsigs>=1 (from mock->-r postcommit_requirements.txt (line 2))
  File was already downloaded /tmp/dataflow-requirements-cache/funcsigs-1.0.2.tar.gz
Collecting pbr>=0.11 (from mock->-r postcommit_requirements.txt (line 2))
  File was already downloaded /tmp/dataflow-requirements-cache/pbr-1.10.0.tar.gz
Collecting packaging>=16.8 (from setuptools->pyhamcrest->-r postcommit_requirements.txt
(line 1))
  File was already downloaded /tmp/dataflow-requirements-cache/packaging-16.8.tar.gz
Collecting appdirs>=1.4.0 (from setuptools->pyhamcrest->-r postcommit_requirements.txt
(line 1))
  File was already downloaded /tmp/dataflow-requirements-cache/appdirs-1.4.2.tar.gz
Collecting pyparsing (from packaging>=16.8->setuptools->pyhamcrest->-r postcommit_requirements.txt
(line 1))
  File was already downloaded /tmp/dataflow-requirements-cache/pyparsing-2.1.10.zip
Successfully downloaded pyhamcrest mock setuptools six funcsigs pbr packaging appdirs pyparsing
ok
test_as_singleton_with_different_defaults_without_unique_labels (apache_beam.transforms.sideinputs_test.SideInputsTest)
... <https://builds.apache.org/job/beam_PostCommit_Python_Verify/ws/sdks/python/apache_beam/transforms/sideinputs_test.py>:241:
DeprecationWarning: BaseException.message has been deprecated as of Python 2.6
  e.exception.message.startswith(
ok
test_as_singleton_without_unique_labels (apache_beam.transforms.sideinputs_test.SideInputsTest)
... DEPRECATION: pip install --download has been deprecated and will be removed in the future.
Pip now has a download command that should be used instead.
Collecting pyhamcrest (from -r postcommit_requirements.txt (line 1))
  File was already downloaded /tmp/dataflow-requirements-cache/PyHamcrest-1.9.0.tar.gz
Collecting mock (from -r postcommit_requirements.txt (line 2))
  File was already downloaded /tmp/dataflow-requirements-cache/mock-2.0.0.tar.gz
Collecting setuptools (from pyhamcrest->-r postcommit_requirements.txt (line 1))
  File was already downloaded /tmp/dataflow-requirements-cache/setuptools-34.3.0.zip
Collecting six (from pyhamcrest->-r postcommit_requirements.txt (line 1))
  File was already downloaded /tmp/dataflow-requirements-cache/six-1.10.0.tar.gz
Collecting funcsigs>=1 (from mock->-r postcommit_requirements.txt (line 2))
  File was already downloaded /tmp/dataflow-requirements-cache/funcsigs-1.0.2.tar.gz
Collecting pbr>=0.11 (from mock->-r postcommit_requirements.txt (line 2))
  File was already downloaded /tmp/dataflow-requirements-cache/pbr-1.10.0.tar.gz
Collecting packaging>=16.8 (from setuptools->pyhamcrest->-r postcommit_requirements.txt
(line 1))
  File was already downloaded /tmp/dataflow-requirements-cache/packaging-16.8.tar.gz
Collecting appdirs>=1.4.0 (from setuptools->pyhamcrest->-r postcommit_requirements.txt
(line 1))
  File was already downloaded /tmp/dataflow-requirements-cache/appdirs-1.4.2.tar.gz
Collecting pyparsing (from packaging>=16.8->setuptools->pyhamcrest->-r postcommit_requirements.txt
(line 1))
  File was already downloaded /tmp/dataflow-requirements-cache/pyparsing-2.1.10.zip
Successfully downloaded pyhamcrest mock setuptools six funcsigs pbr packaging appdirs pyparsing
ok
test_default_value_singleton_side_input (apache_beam.transforms.sideinputs_test.SideInputsTest)
... DEPRECATION: pip install --download has been deprecated and will be removed in the future.
Pip now has a download command that should be used instead.
Collecting pyhamcrest (from -r postcommit_requirements.txt (line 1))
<https://builds.apache.org/job/beam_PostCommit_Python_Verify/ws/sdks/python/local/lib/python2.7/site-packages/pip/_vendor/requests/packages/urllib3/util/ssl_.py>:318:
SNIMissingWarning: An HTTPS request has been made, but the SNI (Subject Name Indication) extension
to TLS is not available on this platform. This may cause the server to present an incorrect
TLS certificate, which can cause validation failures. You can upgrade to a newer version of
Python to solve this. For more information, see https://urllib3.readthedocs.io/en/latest/security.html#snimissingwarning.
  SNIMissingWarning
<https://builds.apache.org/job/beam_PostCommit_Python_Verify/ws/sdks/python/local/lib/python2.7/site-packages/pip/_vendor/requests/packages/urllib3/util/ssl_.py>:122:
InsecurePlatformWarning: A true SSLContext object is not available. This prevents urllib3
from configuring SSL appropriately and may cause certain SSL connections to fail. You can
upgrade to a newer version of Python to solve this. For more information, see https://urllib3.readthedocs.io/en/latest/security.html#insecureplatformwarning.
  InsecurePlatformWarning
  File was already downloaded /tmp/dataflow-requirements-cache/PyHamcrest-1.9.0.tar.gz
Collecting mock (from -r postcommit_requirements.txt (line 2))
  File was already downloaded /tmp/dataflow-requirements-cache/mock-2.0.0.tar.gz
Collecting setuptools (from pyhamcrest->-r postcommit_requirements.txt (line 1))
  File was already downloaded /tmp/dataflow-requirements-cache/setuptools-34.3.0.zip
Collecting six (from pyhamcrest->-r postcommit_requirements.txt (line 1))
  File was already downloaded /tmp/dataflow-requirements-cache/six-1.10.0.tar.gz
Collecting funcsigs>=1 (from mock->-r postcommit_requirements.txt (line 2))
  File was already downloaded /tmp/dataflow-requirements-cache/funcsigs-1.0.2.tar.gz
Collecting pbr>=0.11 (from mock->-r postcommit_requirements.txt (line 2))
  File was already downloaded /tmp/dataflow-requirements-cache/pbr-1.10.0.tar.gz
Collecting packaging>=16.8 (from setuptools->pyhamcrest->-r postcommit_requirements.txt
(line 1))
  File was already downloaded /tmp/dataflow-requirements-cache/packaging-16.8.tar.gz
Collecting appdirs>=1.4.0 (from setuptools->pyhamcrest->-r postcommit_requirements.txt
(line 1))
  File was already downloaded /tmp/dataflow-requirements-cache/appdirs-1.4.2.tar.gz
Collecting pyparsing (from packaging>=16.8->setuptools->pyhamcrest->-r postcommit_requirements.txt
(line 1))
  File was already downloaded /tmp/dataflow-requirements-cache/pyparsing-2.1.10.zip
Successfully downloaded pyhamcrest mock setuptools six funcsigs pbr packaging appdirs pyparsing
ok
test_empty_singleton_side_input (apache_beam.transforms.sideinputs_test.SideInputsTest) ...
DEPRECATION: pip install --download has been deprecated and will be removed in the future.
Pip now has a download command that should be used instead.
Collecting pyhamcrest (from -r postcommit_requirements.txt (line 1))
  File was already downloaded /tmp/dataflow-requirements-cache/PyHamcrest-1.9.0.tar.gz
Collecting mock (from -r postcommit_requirements.txt (line 2))
  File was already downloaded /tmp/dataflow-requirements-cache/mock-2.0.0.tar.gz
Collecting setuptools (from pyhamcrest->-r postcommit_requirements.txt (line 1))
  File was already downloaded /tmp/dataflow-requirements-cache/setuptools-34.3.0.zip
Collecting six (from pyhamcrest->-r postcommit_requirements.txt (line 1))
  File was already downloaded /tmp/dataflow-requirements-cache/six-1.10.0.tar.gz
Collecting funcsigs>=1 (from mock->-r postcommit_requirements.txt (line 2))
  File was already downloaded /tmp/dataflow-requirements-cache/funcsigs-1.0.2.tar.gz
Collecting pbr>=0.11 (from mock->-r postcommit_requirements.txt (line 2))
  File was already downloaded /tmp/dataflow-requirements-cache/pbr-1.10.0.tar.gz
Collecting packaging>=16.8 (from setuptools->pyhamcrest->-r postcommit_requirements.txt
(line 1))
  File was already downloaded /tmp/dataflow-requirements-cache/packaging-16.8.tar.gz
Collecting appdirs>=1.4.0 (from setuptools->pyhamcrest->-r postcommit_requirements.txt
(line 1))
  File was already downloaded /tmp/dataflow-requirements-cache/appdirs-1.4.2.tar.gz
Collecting pyparsing (from packaging>=16.8->setuptools->pyhamcrest->-r postcommit_requirements.txt
(line 1))
  File was already downloaded /tmp/dataflow-requirements-cache/pyparsing-2.1.10.zip
Successfully downloaded pyhamcrest mock setuptools six funcsigs pbr packaging appdirs pyparsing
ok
test_iterable_side_input (apache_beam.transforms.sideinputs_test.SideInputsTest) ... DEPRECATION:
pip install --download has been deprecated and will be removed in the future. Pip now has
a download command that should be used instead.
Collecting pyhamcrest (from -r postcommit_requirements.txt (line 1))
<https://builds.apache.org/job/beam_PostCommit_Python_Verify/ws/sdks/python/local/lib/python2.7/site-packages/pip/_vendor/requests/packages/urllib3/util/ssl_.py>:318:
SNIMissingWarning: An HTTPS request has been made, but the SNI (Subject Name Indication) extension
to TLS is not available on this platform. This may cause the server to present an incorrect
TLS certificate, which can cause validation failures. You can upgrade to a newer version of
Python to solve this. For more information, see https://urllib3.readthedocs.io/en/latest/security.html#snimissingwarning.
  SNIMissingWarning
<https://builds.apache.org/job/beam_PostCommit_Python_Verify/ws/sdks/python/local/lib/python2.7/site-packages/pip/_vendor/requests/packages/urllib3/util/ssl_.py>:122:
InsecurePlatformWarning: A true SSLContext object is not available. This prevents urllib3
from configuring SSL appropriately and may cause certain SSL connections to fail. You can
upgrade to a newer version of Python to solve this. For more information, see https://urllib3.readthedocs.io/en/latest/security.html#insecureplatformwarning.
  InsecurePlatformWarning
  File was already downloaded /tmp/dataflow-requirements-cache/PyHamcrest-1.9.0.tar.gz
Collecting mock (from -r postcommit_requirements.txt (line 2))
  File was already downloaded /tmp/dataflow-requirements-cache/mock-2.0.0.tar.gz
Collecting setuptools (from pyhamcrest->-r postcommit_requirements.txt (line 1))
  File was already downloaded /tmp/dataflow-requirements-cache/setuptools-34.3.0.zip
Collecting six (from pyhamcrest->-r postcommit_requirements.txt (line 1))
  File was already downloaded /tmp/dataflow-requirements-cache/six-1.10.0.tar.gz
Collecting funcsigs>=1 (from mock->-r postcommit_requirements.txt (line 2))
  File was already downloaded /tmp/dataflow-requirements-cache/funcsigs-1.0.2.tar.gz
Collecting pbr>=0.11 (from mock->-r postcommit_requirements.txt (line 2))
  File was already downloaded /tmp/dataflow-requirements-cache/pbr-1.10.0.tar.gz
Collecting packaging>=16.8 (from setuptools->pyhamcrest->-r postcommit_requirements.txt
(line 1))
  File was already downloaded /tmp/dataflow-requirements-cache/packaging-16.8.tar.gz
Collecting appdirs>=1.4.0 (from setuptools->pyhamcrest->-r postcommit_requirements.txt
(line 1))
  File was already downloaded /tmp/dataflow-requirements-cache/appdirs-1.4.2.tar.gz
Collecting pyparsing (from packaging>=16.8->setuptools->pyhamcrest->-r postcommit_requirements.txt
(line 1))
  File was already downloaded /tmp/dataflow-requirements-cache/pyparsing-2.1.10.zip
Successfully downloaded pyhamcrest mock setuptools six funcsigs pbr packaging appdirs pyparsing
ok
test_metrics_in_source (apache_beam.pipeline_test.PipelineTest) ... ERROR

======================================================================
ERROR: test_metrics_in_source (apache_beam.pipeline_test.PipelineTest)
----------------------------------------------------------------------
Traceback (most recent call last):
  File "<https://builds.apache.org/job/beam_PostCommit_Python_Verify/ws/sdks/python/apache_beam/pipeline_test.py",>
line 145, in test_metrics_in_source
    res = pipeline.run()
  File "<https://builds.apache.org/job/beam_PostCommit_Python_Verify/ws/sdks/python/apache_beam/test_pipeline.py",>
line 91, in run
    result = super(TestPipeline, self).run()
  File "<https://builds.apache.org/job/beam_PostCommit_Python_Verify/ws/sdks/python/apache_beam/pipeline.py",>
line 163, in run
    return self.runner.run(self)
  File "<https://builds.apache.org/job/beam_PostCommit_Python_Verify/ws/sdks/python/apache_beam/runners/dataflow/test_dataflow_runner.py",>
line 32, in run
    self.result = super(TestDataflowRunner, self).run(pipeline)
  File "<https://builds.apache.org/job/beam_PostCommit_Python_Verify/ws/sdks/python/apache_beam/runners/dataflow/dataflow_runner.py",>
line 161, in run
    super(DataflowRunner, self).run(pipeline)
  File "<https://builds.apache.org/job/beam_PostCommit_Python_Verify/ws/sdks/python/apache_beam/runners/runner.py",>
line 122, in run
    pipeline.visit(RunVisitor(self))
  File "<https://builds.apache.org/job/beam_PostCommit_Python_Verify/ws/sdks/python/apache_beam/pipeline.py",>
line 186, in visit
    self._root_transform().visit(visitor, self, visited)
  File "<https://builds.apache.org/job/beam_PostCommit_Python_Verify/ws/sdks/python/apache_beam/pipeline.py",>
line 423, in visit
    part.visit(visitor, pipeline, visited)
  File "<https://builds.apache.org/job/beam_PostCommit_Python_Verify/ws/sdks/python/apache_beam/pipeline.py",>
line 426, in visit
    visitor.visit_transform(self)
  File "<https://builds.apache.org/job/beam_PostCommit_Python_Verify/ws/sdks/python/apache_beam/runners/runner.py",>
line 117, in visit_transform
    self.runner.run_transform(transform_node)
  File "<https://builds.apache.org/job/beam_PostCommit_Python_Verify/ws/sdks/python/apache_beam/runners/runner.py",>
line 192, in run_transform
    return m(transform_node)
  File "<https://builds.apache.org/job/beam_PostCommit_Python_Verify/ws/sdks/python/apache_beam/runners/dataflow/dataflow_runner.py",>
line 554, in run_Read
    coder = coders.WindowedValueCoder(transform._infer_output_coder())  # pylint: disable=protected-access
  File "<https://builds.apache.org/job/beam_PostCommit_Python_Verify/ws/sdks/python/apache_beam/io/iobase.py",>
line 671, in _infer_output_coder
    return self.source.coder
AttributeError: 'FakeSource' object has no attribute 'coder'
-------------------- >> begin captured logging << --------------------
root: INFO: Could not estimate size of source <FakeSource _vals=[1, 2, 3, 4, 5, 6]>
due to an exception: Traceback (most recent call last):
  File "<https://builds.apache.org/job/beam_PostCommit_Python_Verify/ws/sdks/python/apache_beam/runners/dataflow/dataflow_runner.py",>
line 492, in run_Read
    transform.source.estimate_size())
AttributeError: 'FakeSource' object has no attribute 'estimate_size'

root: ERROR: Error while visiting Read
--------------------- >> end captured logging << ---------------------

----------------------------------------------------------------------
Ran 15 tests in 4201.715s

FAILED (errors=1)
Build step 'Execute shell' marked build as failure

Mime
View raw message