beam-commits mailing list archives

Site index · List index
Message view « Date » · « Thread »
Top « Date » · « Thread »
From Apache Jenkins Server <jenk...@builds.apache.org>
Subject Build failed in Jenkins: beam_PostCommit_Java_RunnableOnService_Apex #435
Date Wed, 08 Feb 2017 07:04:33 GMT
See <https://builds.apache.org/job/beam_PostCommit_Java_RunnableOnService_Apex/435/changes>

Changes:

[dhalperi] Implement tests that coders are equivalent across-sdks

------------------------------------------
[...truncated 3194 lines...]
Running org.apache.beam.runners.core.SplittableParDoTest
Tests run: 8, Failures: 0, Errors: 0, Skipped: 0, Time elapsed: 3.82 sec - in org.apache.beam.runners.core.SplittableParDoTest
Running org.apache.beam.runners.core.OutputAndTimeBoundedSplittableProcessElementInvokerTest
Tests run: 3, Failures: 0, Errors: 0, Skipped: 0, Time elapsed: 3.55 sec - in org.apache.beam.runners.core.OutputAndTimeBoundedSplittableProcessElementInvokerTest
Running org.apache.beam.runners.core.UnboundedReadFromBoundedSourceTest
Tests run: 8, Failures: 0, Errors: 0, Skipped: 0, Time elapsed: 1.434 sec - in org.apache.beam.runners.core.UnboundedReadFromBoundedSourceTest
Running org.apache.beam.runners.core.ReduceFnRunnerTest
Tests run: 30, Failures: 0, Errors: 0, Skipped: 0, Time elapsed: 0.851 sec - in org.apache.beam.runners.core.ReduceFnRunnerTest
Running org.apache.beam.runners.core.GroupAlsoByWindowViaOutputBufferDoFnTest
Tests run: 9, Failures: 0, Errors: 0, Skipped: 0, Time elapsed: 0.122 sec - in org.apache.beam.runners.core.GroupAlsoByWindowViaOutputBufferDoFnTest
Running org.apache.beam.runners.core.OldDoFnContextTest
Tests run: 1, Failures: 0, Errors: 0, Skipped: 0, Time elapsed: 0.078 sec - in org.apache.beam.runners.core.OldDoFnContextTest
Running org.apache.beam.runners.core.PushbackSideInputDoFnRunnerTest
Tests run: 7, Failures: 0, Errors: 0, Skipped: 0, Time elapsed: 0.246 sec - in org.apache.beam.runners.core.PushbackSideInputDoFnRunnerTest
Running org.apache.beam.runners.core.StateNamespacesTest
Tests run: 6, Failures: 0, Errors: 0, Skipped: 0, Time elapsed: 0.006 sec - in org.apache.beam.runners.core.StateNamespacesTest
Running org.apache.beam.runners.core.MergingActiveWindowSetTest
Tests run: 2, Failures: 0, Errors: 0, Skipped: 0, Time elapsed: 0.024 sec - in org.apache.beam.runners.core.MergingActiveWindowSetTest
Running org.apache.beam.runners.core.KeyedWorkItemCoderTest
Tests run: 3, Failures: 0, Errors: 0, Skipped: 0, Time elapsed: 0.041 sec - in org.apache.beam.runners.core.KeyedWorkItemCoderTest
Running org.apache.beam.runners.core.ElementAndRestrictionCoderTest
Tests run: 882, Failures: 0, Errors: 0, Skipped: 0, Time elapsed: 1.437 sec - in org.apache.beam.runners.core.ElementAndRestrictionCoderTest
Running org.apache.beam.runners.core.SideInputHandlerTest
Tests run: 6, Failures: 0, Errors: 0, Skipped: 0, Time elapsed: 0.003 sec - in org.apache.beam.runners.core.SideInputHandlerTest
Running org.apache.beam.runners.core.SimpleOldDoFnRunnerTest
Tests run: 2, Failures: 0, Errors: 0, Skipped: 0, Time elapsed: 0 sec - in org.apache.beam.runners.core.SimpleOldDoFnRunnerTest
Running org.apache.beam.runners.core.WindowMatchersTest
Tests run: 2, Failures: 0, Errors: 0, Skipped: 0, Time elapsed: 0 sec - in org.apache.beam.runners.core.WindowMatchersTest
Running org.apache.beam.runners.core.InMemoryTimerInternalsTest
Tests run: 7, Failures: 0, Errors: 0, Skipped: 0, Time elapsed: 0 sec - in org.apache.beam.runners.core.InMemoryTimerInternalsTest
Running org.apache.beam.runners.core.OldDoFnTest
Tests run: 8, Failures: 0, Errors: 0, Skipped: 0, Time elapsed: 0 sec - in org.apache.beam.runners.core.OldDoFnTest
Running org.apache.beam.runners.core.LateDataDroppingDoFnRunnerTest
Tests run: 1, Failures: 0, Errors: 0, Skipped: 0, Time elapsed: 0 sec - in org.apache.beam.runners.core.LateDataDroppingDoFnRunnerTest
Running org.apache.beam.runners.core.SimpleDoFnRunnerTest
Tests run: 6, Failures: 0, Errors: 0, Skipped: 0, Time elapsed: 0.116 sec - in org.apache.beam.runners.core.SimpleDoFnRunnerTest
Running org.apache.beam.runners.core.TimerInternalsTest
Tests run: 3, Failures: 0, Errors: 0, Skipped: 0, Time elapsed: 0.01 sec - in org.apache.beam.runners.core.TimerInternalsTest
Running org.apache.beam.runners.core.InMemoryStateInternalsTest
Tests run: 15, Failures: 0, Errors: 0, Skipped: 0, Time elapsed: 0.003 sec - in org.apache.beam.runners.core.InMemoryStateInternalsTest
Running org.apache.beam.runners.core.DoFnDelegatingAggregatorTest
Tests run: 5, Failures: 0, Errors: 0, Skipped: 0, Time elapsed: 0.009 sec - in org.apache.beam.runners.core.DoFnDelegatingAggregatorTest
Running org.apache.beam.runners.core.triggers.FinishedTriggersSetTest
Tests run: 3, Failures: 0, Errors: 0, Skipped: 0, Time elapsed: 0.002 sec - in org.apache.beam.runners.core.triggers.FinishedTriggersSetTest
Running org.apache.beam.runners.core.triggers.OrFinallyStateMachineTest
Tests run: 5, Failures: 0, Errors: 0, Skipped: 0, Time elapsed: 0.011 sec - in org.apache.beam.runners.core.triggers.OrFinallyStateMachineTest
Running org.apache.beam.runners.core.triggers.TriggerStateMachinesTest
Tests run: 12, Failures: 0, Errors: 0, Skipped: 0, Time elapsed: 0.003 sec - in org.apache.beam.runners.core.triggers.TriggerStateMachinesTest
Running org.apache.beam.runners.core.triggers.NeverStateMachineTest
Tests run: 1, Failures: 0, Errors: 0, Skipped: 0, Time elapsed: 0 sec - in org.apache.beam.runners.core.triggers.NeverStateMachineTest
Running org.apache.beam.runners.core.triggers.TriggerStateMachineTest
Tests run: 2, Failures: 0, Errors: 0, Skipped: 0, Time elapsed: 0 sec - in org.apache.beam.runners.core.triggers.TriggerStateMachineTest
Running org.apache.beam.runners.core.triggers.AfterFirstStateMachineTest
Tests run: 5, Failures: 0, Errors: 0, Skipped: 0, Time elapsed: 0.014 sec - in org.apache.beam.runners.core.triggers.AfterFirstStateMachineTest
Running org.apache.beam.runners.core.triggers.RepeatedlyStateMachineTest
Tests run: 8, Failures: 0, Errors: 0, Skipped: 0, Time elapsed: 0.013 sec - in org.apache.beam.runners.core.triggers.RepeatedlyStateMachineTest
Running org.apache.beam.runners.core.triggers.AfterWatermarkStateMachineTest
Tests run: 13, Failures: 0, Errors: 0, Skipped: 0, Time elapsed: 0.016 sec - in org.apache.beam.runners.core.triggers.AfterWatermarkStateMachineTest
Running org.apache.beam.runners.core.triggers.AfterEachStateMachineTest
Tests run: 2, Failures: 0, Errors: 0, Skipped: 0, Time elapsed: 0.001 sec - in org.apache.beam.runners.core.triggers.AfterEachStateMachineTest
Running org.apache.beam.runners.core.triggers.FinishedTriggersBitSetTest
Tests run: 3, Failures: 0, Errors: 0, Skipped: 0, Time elapsed: 0 sec - in org.apache.beam.runners.core.triggers.FinishedTriggersBitSetTest
Running org.apache.beam.runners.core.triggers.ExecutableTriggerStateMachineTest
Tests run: 3, Failures: 0, Errors: 0, Skipped: 0, Time elapsed: 0 sec - in org.apache.beam.runners.core.triggers.ExecutableTriggerStateMachineTest
Running org.apache.beam.runners.core.triggers.DefaultTriggerStateMachineTest
Tests run: 3, Failures: 0, Errors: 0, Skipped: 0, Time elapsed: 0 sec - in org.apache.beam.runners.core.triggers.DefaultTriggerStateMachineTest
Running org.apache.beam.runners.core.triggers.AfterAllStateMachineTest
Tests run: 4, Failures: 0, Errors: 0, Skipped: 0, Time elapsed: 0.004 sec - in org.apache.beam.runners.core.triggers.AfterAllStateMachineTest
Running org.apache.beam.runners.core.triggers.ReshuffleTriggerStateMachineTest
Tests run: 3, Failures: 0, Errors: 0, Skipped: 0, Time elapsed: 0 sec - in org.apache.beam.runners.core.triggers.ReshuffleTriggerStateMachineTest
Running org.apache.beam.runners.core.triggers.AfterProcessingTimeStateMachineTest
Tests run: 7, Failures: 0, Errors: 0, Skipped: 0, Time elapsed: 0.01 sec - in org.apache.beam.runners.core.triggers.AfterProcessingTimeStateMachineTest
Running org.apache.beam.runners.core.triggers.AfterPaneStateMachineTest
Tests run: 4, Failures: 0, Errors: 0, Skipped: 0, Time elapsed: 0.001 sec - in org.apache.beam.runners.core.triggers.AfterPaneStateMachineTest
Running org.apache.beam.runners.core.triggers.AfterSynchronizedProcessingTimeStateMachineTest
Tests run: 2, Failures: 0, Errors: 0, Skipped: 0, Time elapsed: 0.002 sec - in org.apache.beam.runners.core.triggers.AfterSynchronizedProcessingTimeStateMachineTest

Results :

Tests run: 1094, Failures: 0, Errors: 0, Skipped: 0

[JENKINS] Recording test results
2017-02-08T07:04:23.146 [INFO] 
2017-02-08T07:04:23.147 [INFO] --- jacoco-maven-plugin:0.7.5.201505241946:report (report)
@ beam-runners-core-java ---
2017-02-08T07:04:23.207 [INFO] Analyzed bundle 'Apache Beam :: Runners :: Core Java' with
182 classes
2017-02-08T07:04:23.621 [INFO] 
2017-02-08T07:04:23.621 [INFO] --- maven-jar-plugin:2.5:jar (default-jar) @ beam-runners-core-java
---
2017-02-08T07:04:23.633 [INFO] Building jar: <https://builds.apache.org/job/beam_PostCommit_Java_RunnableOnService_Apex/ws/runners/core-java/target/beam-runners-core-java-0.6.0-SNAPSHOT.jar>
2017-02-08T07:04:23.727 [INFO] 
2017-02-08T07:04:23.727 [INFO] --- maven-site-plugin:3.5.1:attach-descriptor (attach-descriptor)
@ beam-runners-core-java ---
2017-02-08T07:04:23.832 [INFO] 
2017-02-08T07:04:23.833 [INFO] --- maven-jar-plugin:2.5:test-jar (default-test-jar) @ beam-runners-core-java
---
2017-02-08T07:04:23.844 [INFO] Building jar: <https://builds.apache.org/job/beam_PostCommit_Java_RunnableOnService_Apex/ws/runners/core-java/target/beam-runners-core-java-0.6.0-SNAPSHOT-tests.jar>
2017-02-08T07:04:23.936 [INFO] 
2017-02-08T07:04:23.936 [INFO] --- maven-shade-plugin:2.4.3:shade (bundle-and-repackage) @
beam-runners-core-java ---
2017-02-08T07:04:23.939 [INFO] Excluding org.apache.beam:beam-sdks-java-core:jar:0.6.0-SNAPSHOT
from the shaded jar.
2017-02-08T07:04:23.939 [INFO] Excluding io.grpc:grpc-auth:jar:1.0.1 from the shaded jar.
2017-02-08T07:04:23.939 [INFO] Excluding io.grpc:grpc-core:jar:1.0.1 from the shaded jar.
2017-02-08T07:04:23.939 [INFO] Excluding io.grpc:grpc-context:jar:1.0.1 from the shaded jar.
2017-02-08T07:04:23.939 [INFO] Excluding io.grpc:grpc-netty:jar:1.0.1 from the shaded jar.
2017-02-08T07:04:23.940 [INFO] Excluding io.netty:netty-codec-http2:jar:4.1.3.Final from the
shaded jar.
2017-02-08T07:04:23.940 [INFO] Excluding io.netty:netty-codec-http:jar:4.1.3.Final from the
shaded jar.
2017-02-08T07:04:23.940 [INFO] Excluding io.grpc:grpc-stub:jar:1.0.1 from the shaded jar.
2017-02-08T07:04:23.940 [INFO] Excluding io.grpc:grpc-all:jar:1.0.1 from the shaded jar.
2017-02-08T07:04:23.940 [INFO] Excluding io.grpc:grpc-protobuf:jar:1.0.1 from the shaded jar.
2017-02-08T07:04:23.940 [INFO] Excluding com.google.protobuf:protobuf-java-util:jar:3.0.0
from the shaded jar.
2017-02-08T07:04:23.940 [INFO] Excluding com.google.code.gson:gson:jar:2.3 from the shaded
jar.
2017-02-08T07:04:23.940 [INFO] Excluding io.grpc:grpc-protobuf-nano:jar:1.0.1 from the shaded
jar.
2017-02-08T07:04:23.940 [INFO] Excluding com.google.protobuf.nano:protobuf-javanano:jar:3.0.0-alpha-5
from the shaded jar.
2017-02-08T07:04:23.940 [INFO] Excluding io.grpc:grpc-okhttp:jar:1.0.1 from the shaded jar.
2017-02-08T07:04:23.940 [INFO] Excluding com.squareup.okio:okio:jar:1.6.0 from the shaded
jar.
2017-02-08T07:04:23.940 [INFO] Excluding com.squareup.okhttp:okhttp:jar:2.5.0 from the shaded
jar.
2017-02-08T07:04:23.940 [INFO] Excluding io.grpc:grpc-protobuf-lite:jar:1.0.1 from the shaded
jar.
2017-02-08T07:04:23.940 [INFO] Excluding com.google.protobuf:protobuf-lite:jar:3.0.1 from
the shaded jar.
2017-02-08T07:04:23.940 [INFO] Excluding com.google.auth:google-auth-library-credentials:jar:0.6.0
from the shaded jar.
2017-02-08T07:04:23.940 [INFO] Excluding com.google.auth:google-auth-library-oauth2-http:jar:0.6.0
from the shaded jar.
2017-02-08T07:04:23.940 [INFO] Excluding io.netty:netty-handler:jar:4.1.3.Final from the shaded
jar.
2017-02-08T07:04:23.940 [INFO] Excluding io.netty:netty-buffer:jar:4.1.3.Final from the shaded
jar.
2017-02-08T07:04:23.940 [INFO] Excluding io.netty:netty-common:jar:4.1.3.Final from the shaded
jar.
2017-02-08T07:04:23.940 [INFO] Excluding io.netty:netty-transport:jar:4.1.3.Final from the
shaded jar.
2017-02-08T07:04:23.940 [INFO] Excluding io.netty:netty-resolver:jar:4.1.3.Final from the
shaded jar.
2017-02-08T07:04:23.940 [INFO] Excluding io.netty:netty-codec:jar:4.1.3.Final from the shaded
jar.
2017-02-08T07:04:23.940 [INFO] Excluding com.google.api.grpc:grpc-google-pubsub-v1:jar:0.1.0
from the shaded jar.
2017-02-08T07:04:23.940 [INFO] Excluding com.google.api.grpc:grpc-google-common-protos:jar:0.1.0
from the shaded jar.
2017-02-08T07:04:23.940 [INFO] Excluding com.google.api.grpc:grpc-google-iam-v1:jar:0.1.0
from the shaded jar.
2017-02-08T07:04:23.940 [INFO] Excluding com.google.api-client:google-api-client:jar:1.22.0
from the shaded jar.
2017-02-08T07:04:23.941 [INFO] Excluding com.google.apis:google-api-services-bigquery:jar:v2-rev295-1.22.0
from the shaded jar.
2017-02-08T07:04:23.941 [INFO] Excluding com.google.apis:google-api-services-cloudresourcemanager:jar:v1-rev6-1.22.0
from the shaded jar.
2017-02-08T07:04:23.941 [INFO] Excluding com.google.apis:google-api-services-pubsub:jar:v1-rev10-1.22.0
from the shaded jar.
2017-02-08T07:04:23.941 [INFO] Excluding com.google.apis:google-api-services-storage:jar:v1-rev71-1.22.0
from the shaded jar.
2017-02-08T07:04:23.941 [INFO] Excluding com.google.http-client:google-http-client:jar:1.22.0
from the shaded jar.
2017-02-08T07:04:23.941 [INFO] Excluding org.apache.httpcomponents:httpclient:jar:4.0.1 from
the shaded jar.
2017-02-08T07:04:23.941 [INFO] Excluding org.apache.httpcomponents:httpcore:jar:4.0.1 from
the shaded jar.
2017-02-08T07:04:23.941 [INFO] Excluding commons-logging:commons-logging:jar:1.1.1 from the
shaded jar.
2017-02-08T07:04:23.941 [INFO] Excluding commons-codec:commons-codec:jar:1.3 from the shaded
jar.
2017-02-08T07:04:23.941 [INFO] Excluding com.google.http-client:google-http-client-jackson:jar:1.22.0
from the shaded jar.
2017-02-08T07:04:23.942 [INFO] Excluding com.google.http-client:google-http-client-jackson2:jar:1.22.0
from the shaded jar.
2017-02-08T07:04:23.942 [INFO] Excluding com.google.http-client:google-http-client-protobuf:jar:1.22.0
from the shaded jar.
2017-02-08T07:04:23.942 [INFO] Excluding com.google.oauth-client:google-oauth-client:jar:1.22.0
from the shaded jar.
2017-02-08T07:04:23.942 [INFO] Excluding com.google.cloud.bigdataoss:gcsio:jar:1.4.5 from
the shaded jar.
2017-02-08T07:04:23.942 [INFO] Excluding com.google.api-client:google-api-client-java6:jar:1.22.0
from the shaded jar.
2017-02-08T07:04:23.942 [INFO] Excluding com.google.api-client:google-api-client-jackson2:jar:1.22.0
from the shaded jar.
2017-02-08T07:04:23.943 [INFO] Excluding com.google.oauth-client:google-oauth-client-java6:jar:1.22.0
from the shaded jar.
2017-02-08T07:04:23.943 [INFO] Excluding com.google.cloud.bigdataoss:util:jar:1.4.5 from the
shaded jar.
2017-02-08T07:04:23.943 [INFO] Excluding com.google.protobuf:protobuf-java:jar:3.1.0 from
the shaded jar.
2017-02-08T07:04:23.943 [INFO] Excluding com.fasterxml.jackson.core:jackson-core:jar:2.7.2
from the shaded jar.
2017-02-08T07:04:23.943 [INFO] Excluding com.fasterxml.jackson.core:jackson-databind:jar:2.7.2
from the shaded jar.
2017-02-08T07:04:23.944 [INFO] Excluding net.bytebuddy:byte-buddy:jar:1.5.5 from the shaded
jar.
2017-02-08T07:04:23.944 [INFO] Excluding org.apache.avro:avro:jar:1.8.1 from the shaded jar.
2017-02-08T07:04:23.944 [INFO] Excluding org.codehaus.jackson:jackson-core-asl:jar:1.9.13
from the shaded jar.
2017-02-08T07:04:23.944 [INFO] Excluding org.codehaus.jackson:jackson-mapper-asl:jar:1.9.13
from the shaded jar.
2017-02-08T07:04:23.944 [INFO] Excluding com.thoughtworks.paranamer:paranamer:jar:2.7 from
the shaded jar.
2017-02-08T07:04:23.944 [INFO] Excluding org.tukaani:xz:jar:1.5 from the shaded jar.
2017-02-08T07:04:23.945 [INFO] Excluding org.xerial.snappy:snappy-java:jar:1.1.2.1 from the
shaded jar.
2017-02-08T07:04:23.945 [INFO] Excluding org.apache.commons:commons-compress:jar:1.9 from
the shaded jar.
2017-02-08T07:04:23.945 [INFO] Excluding com.fasterxml.jackson.core:jackson-annotations:jar:2.7.2
from the shaded jar.
2017-02-08T07:04:23.945 [INFO] Excluding com.google.code.findbugs:jsr305:jar:3.0.1 from the
shaded jar.
2017-02-08T07:04:23.945 [INFO] Including com.google.guava:guava:jar:20.0 in the shaded jar.
2017-02-08T07:04:23.946 [INFO] Excluding joda-time:joda-time:jar:2.4 from the shaded jar.
2017-02-08T07:04:23.946 [INFO] Excluding org.slf4j:slf4j-api:jar:1.7.14 from the shaded jar.
2017-02-08T07:04:25.088 [INFO] Replacing original artifact with shaded artifact.
2017-02-08T07:04:25.088 [INFO] Replacing <https://builds.apache.org/job/beam_PostCommit_Java_RunnableOnService_Apex/ws/runners/core-java/target/beam-runners-core-java-0.6.0-SNAPSHOT.jar>
with <https://builds.apache.org/job/beam_PostCommit_Java_RunnableOnService_Apex/ws/runners/core-java/target/beam-runners-core-java-0.6.0-SNAPSHOT-shaded.jar>
2017-02-08T07:04:25.088 [INFO] Replacing original test artifact with shaded test artifact.
2017-02-08T07:04:25.088 [INFO] Replacing <https://builds.apache.org/job/beam_PostCommit_Java_RunnableOnService_Apex/ws/runners/core-java/target/beam-runners-core-java-0.6.0-SNAPSHOT-tests.jar>
with <https://builds.apache.org/job/beam_PostCommit_Java_RunnableOnService_Apex/ws/runners/core-java/target/beam-runners-core-java-0.6.0-SNAPSHOT-shaded-tests.jar>
2017-02-08T07:04:25.088 [INFO] Dependency-reduced POM written at: <https://builds.apache.org/job/beam_PostCommit_Java_RunnableOnService_Apex/ws/runners/core-java/dependency-reduced-pom.xml>
2017-02-08T07:04:25.128 [INFO] Dependency-reduced POM written at: <https://builds.apache.org/job/beam_PostCommit_Java_RunnableOnService_Apex/ws/runners/core-java/dependency-reduced-pom.xml>
2017-02-08T07:04:25.213 [INFO] 
2017-02-08T07:04:25.213 [INFO] --- maven-surefire-plugin:2.19.1:test (runnable-on-service-tests)
@ beam-runners-core-java ---
2017-02-08T07:04:25.252 [INFO] Surefire report directory: <https://builds.apache.org/job/beam_PostCommit_Java_RunnableOnService_Apex/ws/runners/core-java/target/surefire-reports>
2017-02-08T07:04:25.252 [INFO] Using configured provider org.apache.maven.surefire.junitcore.JUnitCoreProvider
2017-02-08T07:04:25.252 [INFO] parallel='all', perCoreThreadCount=true, threadCount=4, useUnlimitedThreads=false,
threadCountSuites=0, threadCountClasses=0, threadCountMethods=0, parallelOptimized=true

-------------------------------------------------------
 T E S T S
-------------------------------------------------------

Results :

Tests run: 0, Failures: 0, Errors: 0, Skipped: 0

[JENKINS] Recording test results
[JENKINS] Archiving disabled
[JENKINS] Archiving disabled
[JENKINS] Archiving disabled
[JENKINS] Archiving disabled
[JENKINS] Archiving disabled
[JENKINS] Archiving disabled
[JENKINS] Archiving disabled
[JENKINS] Archiving disabled
[JENKINS] Archiving disabled
[JENKINS] Archiving disabled
[JENKINS] Archiving disabled
2017-02-08T07:04:30.508 [INFO] ------------------------------------------------------------------------
2017-02-08T07:04:30.508 [INFO] Reactor Summary:
2017-02-08T07:04:30.508 [INFO] 
2017-02-08T07:04:30.508 [INFO] Apache Beam :: Parent .............................. SUCCESS
[ 18.775 s]
2017-02-08T07:04:30.508 [INFO] Apache Beam :: SDKs :: Java :: Build Tools ......... SUCCESS
[  5.330 s]
2017-02-08T07:04:30.508 [INFO] Apache Beam :: SDKs ................................ SUCCESS
[  4.103 s]
2017-02-08T07:04:30.508 [INFO] Apache Beam :: SDKs :: Common ...................... SUCCESS
[  1.239 s]
2017-02-08T07:04:30.508 [INFO] Apache Beam :: SDKs :: Common :: Fn API ............ SUCCESS
[ 14.618 s]
2017-02-08T07:04:30.508 [INFO] Apache Beam :: SDKs :: Java ........................ SUCCESS
[  1.378 s]
2017-02-08T07:04:30.508 [INFO] Apache Beam :: SDKs :: Java :: Core ................ SUCCESS
[02:23 min]
2017-02-08T07:04:30.509 [INFO] Apache Beam :: Runners ............................. SUCCESS
[  0.934 s]
2017-02-08T07:04:30.509 [INFO] Apache Beam :: Runners :: Core Java ................ FAILURE
[ 31.073 s]
2017-02-08T07:04:30.509 [INFO] Apache Beam :: Runners :: Apex ..................... SKIPPED
2017-02-08T07:04:30.509 [INFO] ------------------------------------------------------------------------
2017-02-08T07:04:30.509 [INFO] BUILD FAILURE
2017-02-08T07:04:30.509 [INFO] ------------------------------------------------------------------------
2017-02-08T07:04:30.509 [INFO] Total time: 04:19 min
2017-02-08T07:04:30.509 [INFO] Finished at: 2017-02-08T07:04:30+00:00
2017-02-08T07:04:31.052 [INFO] Final Memory: 106M/1459M
2017-02-08T07:04:31.052 [INFO] ------------------------------------------------------------------------
2017-02-08T07:04:31.056 [ERROR] Failed to execute goal org.apache.maven.plugins:maven-surefire-plugin:2.19.1:test
(runnable-on-service-tests) on project beam-runners-core-java: Execution runnable-on-service-tests
of goal org.apache.maven.plugins:maven-surefire-plugin:2.19.1:test failed: There was an error
in the forked process
2017-02-08T07:04:31.056 [ERROR] java.lang.NoClassDefFoundError: com/fasterxml/jackson/dataformat/yaml/YAMLFactory
2017-02-08T07:04:31.056 [ERROR] at java.lang.Class.getDeclaredMethods0(Native Method)
2017-02-08T07:04:31.056 [ERROR] at java.lang.Class.privateGetDeclaredMethods(Class.java:2701)
2017-02-08T07:04:31.056 [ERROR] at java.lang.Class.privateGetMethodRecursive(Class.java:3048)
2017-02-08T07:04:31.056 [ERROR] at java.lang.Class.getMethod0(Class.java:3018)
2017-02-08T07:04:31.056 [ERROR] at java.lang.Class.getMethod(Class.java:1784)
2017-02-08T07:04:31.056 [ERROR] at org.apache.maven.surefire.util.ReflectionUtils.tryGetMethod(ReflectionUtils.java:61)
2017-02-08T07:04:31.056 [ERROR] at org.apache.maven.surefire.common.junit3.JUnit3TestChecker.isSuiteOnly(JUnit3TestChecker.java:64)
2017-02-08T07:04:31.056 [ERROR] at org.apache.maven.surefire.common.junit3.JUnit3TestChecker.isValidJUnit3Test(JUnit3TestChecker.java:59)
2017-02-08T07:04:31.056 [ERROR] at org.apache.maven.surefire.common.junit3.JUnit3TestChecker.accept(JUnit3TestChecker.java:54)
2017-02-08T07:04:31.056 [ERROR] at org.apache.maven.surefire.common.junit4.JUnit4TestChecker.accept(JUnit4TestChecker.java:52)
2017-02-08T07:04:31.056 [ERROR] at org.apache.maven.surefire.common.junit48.JUnit48TestChecker.accept(JUnit48TestChecker.java:50)
2017-02-08T07:04:31.056 [ERROR] at org.apache.maven.surefire.util.DefaultScanResult.applyFilter(DefaultScanResult.java:98)
2017-02-08T07:04:31.056 [ERROR] at org.apache.maven.surefire.junitcore.JUnitCoreProvider.scanClassPath(JUnitCoreProvider.java:295)
2017-02-08T07:04:31.056 [ERROR] at org.apache.maven.surefire.junitcore.JUnitCoreProvider.setTestsToRun(JUnitCoreProvider.java:203)
2017-02-08T07:04:31.056 [ERROR] at org.apache.maven.surefire.junitcore.JUnitCoreProvider.invoke(JUnitCoreProvider.java:138)
2017-02-08T07:04:31.056 [ERROR] at org.apache.maven.surefire.booter.ForkedBooter.invokeProviderInSameClassLoader(ForkedBooter.java:290)
2017-02-08T07:04:31.056 [ERROR] at org.apache.maven.surefire.booter.ForkedBooter.runSuitesInProcess(ForkedBooter.java:242)
2017-02-08T07:04:31.056 [ERROR] at org.apache.maven.surefire.booter.ForkedBooter.main(ForkedBooter.java:121)
2017-02-08T07:04:31.056 [ERROR] Caused by: java.lang.ClassNotFoundException: com.fasterxml.jackson.dataformat.yaml.YAMLFactory
2017-02-08T07:04:31.056 [ERROR] at java.net.URLClassLoader.findClass(URLClassLoader.java:381)
2017-02-08T07:04:31.056 [ERROR] at java.lang.ClassLoader.loadClass(ClassLoader.java:424)
2017-02-08T07:04:31.056 [ERROR] at sun.misc.Launcher$AppClassLoader.loadClass(Launcher.java:331)
2017-02-08T07:04:31.056 [ERROR] at java.lang.ClassLoader.loadClass(ClassLoader.java:357)
2017-02-08T07:04:31.056 [ERROR] ... 18 more
2017-02-08T07:04:31.056 [ERROR] -> [Help 1]
2017-02-08T07:04:31.056 [ERROR] 
2017-02-08T07:04:31.056 [ERROR] To see the full stack trace of the errors, re-run Maven with
the -e switch.
2017-02-08T07:04:31.056 [ERROR] Re-run Maven using the -X switch to enable full debug logging.
2017-02-08T07:04:31.056 [ERROR] 
2017-02-08T07:04:31.056 [ERROR] For more information about the errors and possible solutions,
please read the following articles:
2017-02-08T07:04:31.056 [ERROR] [Help 1] http://cwiki.apache.org/confluence/display/MAVEN/PluginExecutionException
2017-02-08T07:04:31.057 [ERROR] 
2017-02-08T07:04:31.057 [ERROR] After correcting the problems, you can resume the build with
the command
2017-02-08T07:04:31.057 [ERROR]   mvn <goals> -rf :beam-runners-core-java
channel stopped

Mime
View raw message