beam-commits mailing list archives

Site index · List index
Message view « Date » · « Thread »
Top « Date » · « Thread »
From Apache Jenkins Server <>
Subject Build failed in Jenkins: beam_PostCommit_Java_RunnableOnService_Apex #360
Date Tue, 31 Jan 2017 23:48:41 GMT
See <>


[robertwb] Implement combiner lifting for direct runner.

[robertwb] Fix typehints tests.

Started by an SCM change
Started by an SCM change
Started by an SCM change
Started by an SCM change
[EnvInject] - Loading node environment variables.
Building remotely on beam1 (beam) in workspace <>
 > git rev-parse --is-inside-work-tree # timeout=10
Fetching changes from the remote Git repository
 > git config remote.origin.url # timeout=10
Fetching upstream changes from
 > git --version # timeout=10
 > git -c core.askpass=true fetch --tags --progress
+refs/heads/*:refs/remotes/origin/* +refs/pull/*:refs/remotes/origin/pr/*
 > git rev-parse origin/master^{commit} # timeout=10
Checking out Revision e9cd4116591aa7ed2843885e6dfa8d469f4248ed (origin/master)
 > git config core.sparsecheckout # timeout=10
 > git checkout -f e9cd4116591aa7ed2843885e6dfa8d469f4248ed
 > git rev-list b80aac5e33d6d4171d756d8caf67ec8f10dc4e86 # timeout=10
Cleaning workspace
 > git rev-parse --verify HEAD # timeout=10
Resetting working tree
 > git reset --hard # timeout=10
 > git clean -fdx # timeout=10
[EnvInject] - Executing scripts and injecting environment variables after the SCM step.
[EnvInject] - Injecting as environment variables the properties content 

[EnvInject] - Variables injected successfully.
Parsing POMs
Downloaded artifact
Modules changed, recalculating dependency graph
Established TCP socket on 59550
maven32-agent.jar already up to date
maven32-interceptor.jar already up to date
maven3-interceptor-commons.jar already up to date
[beam_PostCommit_Java_RunnableOnService_Apex] $ /home/jenkins/tools/java/latest1.8/bin/java
-Dorg.slf4j.simpleLogger.showDateTime=true -Dorg.slf4j.simpleLogger.dateTimeFormat=yyyy-MM-dd'T'HH:mm:ss.SSS
-cp /home/jenkins/jenkins-slave/maven32-agent.jar:/home/jenkins/tools/maven/apache-maven-3.3.3/boot/plexus-classworlds-2.5.2.jar:/home/jenkins/tools/maven/apache-maven-3.3.3/conf/logging
jenkins.maven3.agent.Maven32Main /home/jenkins/tools/maven/apache-maven-3.3.3 /home/jenkins/jenkins-slave/slave.jar
/home/jenkins/jenkins-slave/maven32-interceptor.jar /home/jenkins/jenkins-slave/maven3-interceptor-commons.jar
<===[JENKINS REMOTING CAPACITY]===>   channel started
Executing Maven:  -B -f <>
clean verify --projects runners/apex --also-make --batch-mode --errors --activate-profiles
runnable-on-service-tests --activate-profiles local-runnable-on-service-tests
2017-01-31T23:46:17.206 [INFO] Error stacktraces are turned on.
2017-01-31T23:46:17.311 [INFO] Scanning for projects...
2017-01-31T23:46:19.095 [INFO] Downloading:
2017-01-31T23:46:19.643 [INFO] Downloaded:
(7 KB at 10.9 KB/sec)
2017-01-31T23:46:19.657 [INFO] Downloading:
2017-01-31T23:46:19.704 [INFO] Downloaded:
(7 KB at 136.5 KB/sec)
2017-01-31T23:46:19.726 [INFO] Downloading:
2017-01-31T23:46:19.763 [INFO] Downloaded:
(4 KB at 89.3 KB/sec)
2017-01-31T23:46:19.766 [INFO] Downloading:
2017-01-31T23:46:19.830 [INFO] Downloaded:
(23 KB at 344.7 KB/sec)
2017-01-31T23:46:19.834 [INFO] Downloading:
2017-01-31T23:46:19.883 [INFO] Downloaded:
(32 KB at 649.4 KB/sec)
2017-01-31T23:46:19.888 [INFO] Downloading:
2017-01-31T23:46:19.938 [INFO] Downloaded:
(14 KB at 284.3 KB/sec)
2017-01-31T23:46:19.951 [INFO] Downloading:
2017-01-31T23:46:19.981 [INFO] Downloaded:
(5 KB at 139.4 KB/sec)
2017-01-31T23:46:19.987 [INFO] Downloading:
2017-01-31T23:46:20.019 [INFO] Downloaded:
(4 KB at 103.6 KB/sec)
2017-01-31T23:46:20.022 [INFO] Downloading:
2017-01-31T23:46:20.061 [INFO] Downloaded:
(20 KB at 512.0 KB/sec)
2017-01-31T23:46:20.066 [INFO] Downloading:
2017-01-31T23:46:20.098 [INFO] Downloaded:
(7 KB at 206.3 KB/sec)
2017-01-31T23:46:20.101 [INFO] Downloading:
2017-01-31T23:46:20.136 [INFO] Downloaded:
(14 KB at 389.5 KB/sec)
2017-01-31T23:46:20.141 [INFO] Downloading:
2017-01-31T23:46:20.170 [INFO] Downloaded:
(2 KB at 66.3 KB/sec)
2017-01-31T23:46:20.179 [INFO] Downloading:
2017-01-31T23:46:20.210 [INFO] Downloaded:
(5 KB at 152.2 KB/sec)
2017-01-31T23:46:20.213 [INFO] Downloading:
2017-01-31T23:46:20.248 [INFO] Downloaded:
(13 KB at 368.4 KB/sec)
2017-01-31T23:46:20.251 [INFO] Downloading:
2017-01-31T23:46:20.286 [INFO] Downloaded:
(5 KB at 134.6 KB/sec)
2017-01-31T23:46:20.293 [INFO] Downloading:
2017-01-31T23:46:20.338 [INFO] Downloaded:
(2 KB at 31.1 KB/sec)
2017-01-31T23:46:20.342 [INFO] Downloading:
2017-01-31T23:46:20.380 [INFO] Downloaded:
(3 KB at 60.5 KB/sec)
2017-01-31T23:46:20.384 [INFO] Downloading:
2017-01-31T23:46:20.422 [INFO] Downloaded:
(8 KB at 203.2 KB/sec)
2017-01-31T23:46:20.428 [INFO] Downloading:
2017-01-31T23:46:20.467 [INFO] Downloaded:
(21 KB at 518.1 KB/sec)
2017-01-31T23:46:20.476 [INFO] Downloading:
2017-01-31T23:46:20.506 [INFO] Downloaded:
(1023 B at 33.3 KB/sec)
2017-01-31T23:46:20.510 [INFO] Downloading:
2017-01-31T23:46:20.543 [INFO] Downloaded:
(612 B at 18.1 KB/sec)
2017-01-31T23:46:20.547 [INFO] Downloading:
2017-01-31T23:46:20.577 [INFO] Downloaded:
(6 KB at 169.6 KB/sec)
2017-01-31T23:46:20.580 [INFO] Downloading:
2017-01-31T23:46:20.611 [INFO] Downloaded:
(2 KB at 63.8 KB/sec)
2017-01-31T23:46:20.615 [INFO] Downloading:
2017-01-31T23:46:20.647 [INFO] Downloaded:
(965 B at 29.4 KB/sec)
2017-01-31T23:46:20.650 [INFO] Downloading:
2017-01-31T23:46:20.684 [INFO] Downloaded:
(10 KB at 291.5 KB/sec)
2017-01-31T23:46:20.687 [INFO] Downloading:
2017-01-31T23:46:20.721 [INFO] Downloaded:
(11 KB at 313.8 KB/sec)
2017-01-31T23:46:20.731 [INFO] Downloading:
2017-01-31T23:46:20.767 [INFO] Downloaded:
(363 B at 9.6 KB/sec)
2017-01-31T23:46:20.770 [INFO] Downloading:
2017-01-31T23:46:20.800 [INFO] Downloaded:
(3 KB at 82.0 KB/sec)
2017-01-31T23:46:20.803 [INFO] Downloading:
2017-01-31T23:46:20.849 [INFO] Downloaded:
(14 KB at 297.1 KB/sec)
2017-01-31T23:46:20.859 [INFO] Downloading:
2017-01-31T23:46:20.890 [INFO] Downloaded:
(815 B at 24.9 KB/sec)
2017-01-31T23:46:20.893 [INFO] Downloading:
2017-01-31T23:46:20.923 [INFO] Downloaded:
(5 KB at 138.0 KB/sec)
2017-01-31T23:46:20.925 [INFO] Downloading:
2017-01-31T23:46:20.960 [INFO] Downloaded:
(17 KB at 482.6 KB/sec)
2017-01-31T23:46:20.964 [INFO] Downloading:
2017-01-31T23:46:20.993 [INFO] Downloaded:
(4 KB at 130.8 KB/sec)
2017-01-31T23:46:20.996 [INFO] Downloading:
2017-01-31T23:46:21.038 [INFO] Downloaded:
(4 KB at 93.8 KB/sec)
2017-01-31T23:46:21.042 [INFO] Downloading:
2017-01-31T23:46:21.072 [INFO] Downloaded:
(9 KB at 272.1 KB/sec)
2017-01-31T23:46:21.077 [INFO] Downloading:
2017-01-31T23:46:21.113 [INFO] Downloaded:
(9 KB at 226.9 KB/sec)
2017-01-31T23:46:21.184 [INFO] Downloading:
2017-01-31T23:46:21.184 [INFO] Downloading:
2017-01-31T23:46:21.196 [INFO] Downloading:
2017-01-31T23:46:21.212 [INFO] Downloading:
2017-01-31T23:46:21.215 [INFO] Downloading:
2017-01-31T23:46:21.311 [INFO] Downloaded:
(29 KB at 200.2 KB/sec)
2017-01-31T23:46:21.311 [INFO] Downloading:
2017-01-31T23:46:21.322 [INFO] Downloaded:
(45 KB at 298.4 KB/sec)
2017-01-31T23:46:21.322 [INFO] Downloading:
2017-01-31T23:46:21.352 [INFO] Downloaded:
(157 KB at 934.8 KB/sec)
2017-01-31T23:46:21.352 [INFO] Downloading:
2017-01-31T23:46:21.357 [INFO] Downloaded:
(44 KB at 272.4 KB/sec)
2017-01-31T23:46:21.357 [INFO] Downloading:
2017-01-31T23:46:21.360 [INFO] Downloaded:
(6 KB at 34.8 KB/sec)
2017-01-31T23:46:21.360 [INFO] Downloading:
2017-01-31T23:46:21.360 [INFO] Downloaded:
(192 KB at 1170.4 KB/sec)
2017-01-31T23:46:21.361 [INFO] Downloading:
2017-01-31T23:46:21.391 [INFO] Downloaded:
(3 KB at 12.5 KB/sec)
2017-01-31T23:46:21.392 [INFO] Downloading:
2017-01-31T23:46:21.393 [INFO] Downloaded:
(33 KB at 164.5 KB/sec)
2017-01-31T23:46:21.394 [INFO] Downloading:
2017-01-31T23:46:21.424 [INFO] Downloaded:
(5 KB at 19.3 KB/sec)
2017-01-31T23:46:21.424 [INFO] Downloading:
2017-01-31T23:46:21.475 [INFO] Downloaded:
(5 KB at 14.8 KB/sec)
2017-01-31T23:46:21.477 [INFO] Downloading:
2017-01-31T23:46:21.521 [INFO] Downloaded:
(46 KB at 141.8 KB/sec)
2017-01-31T23:46:21.522 [INFO] Downloading:
2017-01-31T23:46:21.527 [INFO] Downloaded:
(285 KB at 862.3 KB/sec)
2017-01-31T23:46:21.529 [INFO] Downloaded:
(350 KB at 1051.3 KB/sec)
2017-01-31T23:46:21.593 [INFO] Downloaded:
(246 KB at 647.1 KB/sec)
2017-01-31T23:46:21.676 [INFO] Downloaded:
(1467 KB at 3055.0 KB/sec)
2017-01-31T23:48:28.548 [ERROR] [ERROR] Some problems were encountered while processing the
[ERROR] Unresolveable build extension: Plugin kr.motd.maven:os-maven-plugin:1.4.0.Final or
one of its dependencies could not be resolved: Could not transfer artifact org.apache.maven:maven-artifact:jar:3.2.1
from/to central ( Connect to
[] failed: Connection timed out @ 
2017-01-31T23:48:28.552 [ERROR] The build could not read 1 project -> [Help 1]
2017-01-31T23:48:28.552 [ERROR]   
2017-01-31T23:48:28.552 [ERROR]   The project org.apache.beam:beam-parent:0.6.0-SNAPSHOT (<>
has 1 error
2017-01-31T23:48:28.552 [ERROR]     Unresolveable build extension: Plugin kr.motd.maven:os-maven-plugin:1.4.0.Final
or one of its dependencies could not be resolved: Could not transfer artifact org.apache.maven:maven-artifact:jar:3.2.1
from/to central ( Connect to
[] failed: Connection timed out -> [Help 2]
2017-01-31T23:48:28.553 [ERROR] 
2017-01-31T23:48:28.553 [ERROR] To see the full stack trace of the errors, re-run Maven with
the -e switch.
2017-01-31T23:48:28.553 [ERROR] Re-run Maven using the -X switch to enable full debug logging.
2017-01-31T23:48:28.553 [ERROR] 
2017-01-31T23:48:28.553 [ERROR] For more information about the errors and possible solutions,
please read the following articles:
2017-01-31T23:48:28.553 [ERROR] [Help 1]
2017-01-31T23:48:28.553 [ERROR] [Help 2]
channel stopped

View raw message