beam-commits mailing list archives

Site index · List index
Message view « Date » · « Thread »
Top « Date » · « Thread »
From Apache Jenkins Server <jenk...@builds.apache.org>
Subject Build failed in Jenkins: beam_PostCommit_Java_MavenInstall #2475
Date Tue, 31 Jan 2017 03:22:53 GMT
See <https://builds.apache.org/job/beam_PostCommit_Java_MavenInstall/2475/changes>

Changes:

[dhalperi] [BEAM-1357] Upgrade error-prone-annotations to get Java7 support back

------------------------------------------
[...truncated 12560 lines...]
hard linking apache_beam/transforms/util.py -> apache-beam-sdk-0.6.0.dev/apache_beam/transforms
hard linking apache_beam/transforms/window.py -> apache-beam-sdk-0.6.0.dev/apache_beam/transforms
hard linking apache_beam/transforms/window_test.py -> apache-beam-sdk-0.6.0.dev/apache_beam/transforms
hard linking apache_beam/transforms/write_ptransform_test.py -> apache-beam-sdk-0.6.0.dev/apache_beam/transforms
hard linking apache_beam/typehints/__init__.py -> apache-beam-sdk-0.6.0.dev/apache_beam/typehints
hard linking apache_beam/typehints/decorators.py -> apache-beam-sdk-0.6.0.dev/apache_beam/typehints
hard linking apache_beam/typehints/opcodes.py -> apache-beam-sdk-0.6.0.dev/apache_beam/typehints
hard linking apache_beam/typehints/trivial_inference.py -> apache-beam-sdk-0.6.0.dev/apache_beam/typehints
hard linking apache_beam/typehints/trivial_inference_test.py -> apache-beam-sdk-0.6.0.dev/apache_beam/typehints
hard linking apache_beam/typehints/typecheck.py -> apache-beam-sdk-0.6.0.dev/apache_beam/typehints
hard linking apache_beam/typehints/typed_pipeline_test.py -> apache-beam-sdk-0.6.0.dev/apache_beam/typehints
hard linking apache_beam/typehints/typehints.py -> apache-beam-sdk-0.6.0.dev/apache_beam/typehints
hard linking apache_beam/typehints/typehints_test.py -> apache-beam-sdk-0.6.0.dev/apache_beam/typehints
hard linking apache_beam/utils/__init__.py -> apache-beam-sdk-0.6.0.dev/apache_beam/utils
hard linking apache_beam/utils/annotations.py -> apache-beam-sdk-0.6.0.dev/apache_beam/utils
hard linking apache_beam/utils/annotations_test.py -> apache-beam-sdk-0.6.0.dev/apache_beam/utils
hard linking apache_beam/utils/counters.pxd -> apache-beam-sdk-0.6.0.dev/apache_beam/utils
hard linking apache_beam/utils/counters.py -> apache-beam-sdk-0.6.0.dev/apache_beam/utils
hard linking apache_beam/utils/dependency.py -> apache-beam-sdk-0.6.0.dev/apache_beam/utils
hard linking apache_beam/utils/dependency_test.py -> apache-beam-sdk-0.6.0.dev/apache_beam/utils
hard linking apache_beam/utils/names.py -> apache-beam-sdk-0.6.0.dev/apache_beam/utils
hard linking apache_beam/utils/path.py -> apache-beam-sdk-0.6.0.dev/apache_beam/utils
hard linking apache_beam/utils/path_test.py -> apache-beam-sdk-0.6.0.dev/apache_beam/utils
hard linking apache_beam/utils/pipeline_options.py -> apache-beam-sdk-0.6.0.dev/apache_beam/utils
hard linking apache_beam/utils/pipeline_options_test.py -> apache-beam-sdk-0.6.0.dev/apache_beam/utils
hard linking apache_beam/utils/pipeline_options_validator.py -> apache-beam-sdk-0.6.0.dev/apache_beam/utils
hard linking apache_beam/utils/pipeline_options_validator_test.py -> apache-beam-sdk-0.6.0.dev/apache_beam/utils
hard linking apache_beam/utils/processes.py -> apache-beam-sdk-0.6.0.dev/apache_beam/utils
hard linking apache_beam/utils/processes_test.py -> apache-beam-sdk-0.6.0.dev/apache_beam/utils
hard linking apache_beam/utils/profiler.py -> apache-beam-sdk-0.6.0.dev/apache_beam/utils
hard linking apache_beam/utils/retry.py -> apache-beam-sdk-0.6.0.dev/apache_beam/utils
hard linking apache_beam/utils/retry_test.py -> apache-beam-sdk-0.6.0.dev/apache_beam/utils
hard linking apache_beam/utils/timestamp.py -> apache-beam-sdk-0.6.0.dev/apache_beam/utils
hard linking apache_beam/utils/timestamp_test.py -> apache-beam-sdk-0.6.0.dev/apache_beam/utils
hard linking apache_beam/utils/windowed_value.pxd -> apache-beam-sdk-0.6.0.dev/apache_beam/utils
hard linking apache_beam/utils/windowed_value.py -> apache-beam-sdk-0.6.0.dev/apache_beam/utils
hard linking apache_beam/utils/windowed_value_test.py -> apache-beam-sdk-0.6.0.dev/apache_beam/utils
hard linking apache_beam_sdk.egg-info/PKG-INFO -> apache-beam-sdk-0.6.0.dev/apache_beam_sdk.egg-info
hard linking apache_beam_sdk.egg-info/SOURCES.txt -> apache-beam-sdk-0.6.0.dev/apache_beam_sdk.egg-info
hard linking apache_beam_sdk.egg-info/dependency_links.txt -> apache-beam-sdk-0.6.0.dev/apache_beam_sdk.egg-info
hard linking apache_beam_sdk.egg-info/entry_points.txt -> apache-beam-sdk-0.6.0.dev/apache_beam_sdk.egg-info
hard linking apache_beam_sdk.egg-info/not-zip-safe -> apache-beam-sdk-0.6.0.dev/apache_beam_sdk.egg-info
hard linking apache_beam_sdk.egg-info/requires.txt -> apache-beam-sdk-0.6.0.dev/apache_beam_sdk.egg-info
hard linking apache_beam_sdk.egg-info/top_level.txt -> apache-beam-sdk-0.6.0.dev/apache_beam_sdk.egg-info
copying setup.cfg -> apache-beam-sdk-0.6.0.dev
Writing apache-beam-sdk-0.6.0.dev/setup.cfg
Creating tar archive
removing 'apache-beam-sdk-0.6.0.dev' (and everything under it)
2017-01-31T03:22:12.183 [INFO] 
2017-01-31T03:22:12.183 [INFO] --- maven-dependency-plugin:2.10:analyze-only (default) @ beam-sdks-python
---
2017-01-31T03:22:12.183 [INFO] Skipping pom project
2017-01-31T03:22:12.232 [INFO] 
2017-01-31T03:22:12.232 [INFO] --- apache-rat-plugin:0.12:check (default) @ beam-sdks-python
---
2017-01-31T03:22:12.235 [INFO] Enabled default license matchers.
2017-01-31T03:22:12.235 [INFO] Will parse SCM ignores for exclusions...
2017-01-31T03:22:12.236 [INFO] Finished adding exclusions from SCM ignore files.
2017-01-31T03:22:12.236 [INFO] 61 implicit excludes (use -debug for more details).
2017-01-31T03:22:12.236 [INFO] Exclude: **/target/**/*
2017-01-31T03:22:12.236 [INFO] Exclude: **/dependency-reduced-pom.xml
2017-01-31T03:22:12.236 [INFO] Exclude: **/hs_err_pid*.log
2017-01-31T03:22:12.236 [INFO] Exclude: .github/**/*
2017-01-31T03:22:12.236 [INFO] Exclude: **/*.iml
2017-01-31T03:22:12.236 [INFO] Exclude: **/.idea/**/*
2017-01-31T03:22:12.236 [INFO] Exclude: **/package-list
2017-01-31T03:22:12.236 [INFO] Exclude: **/user.avsc
2017-01-31T03:22:12.236 [INFO] Exclude: **/test/resources/**/*.txt
2017-01-31T03:22:12.236 [INFO] Exclude: **/test/**/.placeholder
2017-01-31T03:22:12.236 [INFO] Exclude: .repository/**/*
2017-01-31T03:22:12.236 [INFO] Exclude: **/nose-*.egg/**/*
2017-01-31T03:22:12.236 [INFO] Exclude: **/.tox/**/*
2017-01-31T03:22:12.236 [INFO] Exclude: **/.checkstyle
2017-01-31T03:22:12.236 [INFO] Exclude: **/.classpath
2017-01-31T03:22:12.236 [INFO] Exclude: **/.factorypath
2017-01-31T03:22:12.236 [INFO] Exclude: **/.project
2017-01-31T03:22:12.236 [INFO] Exclude: **/.settings/**/*
2017-01-31T03:22:12.397 [INFO] 465 resources included (use -debug for more details)
2017-01-31T03:22:12.464 [INFO] Rat check: Summary over all files. Unapproved: 7, unknown:
7, generated: 0, approved: 243 licenses.
2017-01-31T03:22:12.464 [INFO] Enabled default license matchers.
2017-01-31T03:22:12.464 [INFO] Will parse SCM ignores for exclusions...
2017-01-31T03:22:12.464 [INFO] Finished adding exclusions from SCM ignore files.
2017-01-31T03:22:12.464 [INFO] 61 implicit excludes (use -debug for more details).
2017-01-31T03:22:12.465 [INFO] Exclude: **/target/**/*
2017-01-31T03:22:12.465 [INFO] Exclude: **/dependency-reduced-pom.xml
2017-01-31T03:22:12.465 [INFO] Exclude: **/hs_err_pid*.log
2017-01-31T03:22:12.465 [INFO] Exclude: .github/**/*
2017-01-31T03:22:12.465 [INFO] Exclude: **/*.iml
2017-01-31T03:22:12.465 [INFO] Exclude: **/.idea/**/*
2017-01-31T03:22:12.465 [INFO] Exclude: **/package-list
2017-01-31T03:22:12.465 [INFO] Exclude: **/user.avsc
2017-01-31T03:22:12.465 [INFO] Exclude: **/test/resources/**/*.txt
2017-01-31T03:22:12.465 [INFO] Exclude: **/test/**/.placeholder
2017-01-31T03:22:12.465 [INFO] Exclude: .repository/**/*
2017-01-31T03:22:12.465 [INFO] Exclude: **/nose-*.egg/**/*
2017-01-31T03:22:12.465 [INFO] Exclude: **/.tox/**/*
2017-01-31T03:22:12.465 [INFO] Exclude: **/.checkstyle
2017-01-31T03:22:12.465 [INFO] Exclude: **/.classpath
2017-01-31T03:22:12.465 [INFO] Exclude: **/.factorypath
2017-01-31T03:22:12.465 [INFO] Exclude: **/.project
2017-01-31T03:22:12.465 [INFO] Exclude: **/.settings/**/*
2017-01-31T03:22:12.575 [INFO] 465 resources included (use -debug for more details)
2017-01-31T03:22:12.625 [WARNING] Files with unapproved licenses:
  <https://builds.apache.org/job/beam_PostCommit_Java_MavenInstall/ws/sdks/python/apache_beam_sdk.egg-info/entry_points.txt>
  <https://builds.apache.org/job/beam_PostCommit_Java_MavenInstall/ws/sdks/python/apache_beam_sdk.egg-info/requires.txt>
  <https://builds.apache.org/job/beam_PostCommit_Java_MavenInstall/ws/sdks/python/apache_beam_sdk.egg-info/dependency_links.txt>
  <https://builds.apache.org/job/beam_PostCommit_Java_MavenInstall/ws/sdks/python/apache_beam_sdk.egg-info/top_level.txt>
  <https://builds.apache.org/job/beam_PostCommit_Java_MavenInstall/ws/sdks/python/apache_beam_sdk.egg-info/SOURCES.txt>
  <https://builds.apache.org/job/beam_PostCommit_Java_MavenInstall/ws/sdks/python/apache_beam_sdk.egg-info/PKG-INFO>
  <https://builds.apache.org/job/beam_PostCommit_Java_MavenInstall/ws/sdks/python/apache_beam_sdk.egg-info/not-zip-safe>
[JENKINS] Archiving disabled
2017-01-31T03:22:13.222 [INFO]                                                           
             
2017-01-31T03:22:13.222 [INFO] ------------------------------------------------------------------------
2017-01-31T03:22:13.222 [INFO] Skipping Apache Beam :: Parent
2017-01-31T03:22:13.222 [INFO] This project has been banned from the build due to previous
failures.
2017-01-31T03:22:13.222 [INFO] ------------------------------------------------------------------------
[JENKINS] Archiving disabled
[JENKINS] Archiving disabled
[JENKINS] Archiving disabled
[JENKINS] Archiving disabled
[JENKINS] Archiving disabled
[JENKINS] Archiving disabled
[JENKINS] Archiving disabled
[JENKINS] Archiving disabled
[JENKINS] Archiving disabled
[JENKINS] Archiving disabled
[JENKINS] Archiving disabled
[JENKINS] Archiving disabled
[JENKINS] Archiving disabled
[JENKINS] Archiving disabled
[JENKINS] Archiving disabled
[JENKINS] Archiving disabled
[JENKINS] Archiving disabled
[JENKINS] Archiving disabled
[JENKINS] Archiving disabled
[JENKINS] Archiving disabled
[JENKINS] Archiving disabled
[JENKINS] Archiving disabled
[JENKINS] Archiving disabled
[JENKINS] Archiving disabled
[JENKINS] Archiving disabled
[JENKINS] Archiving disabled
[JENKINS] Archiving disabled
[JENKINS] Archiving disabled
[JENKINS] Archiving disabled
[JENKINS] Archiving disabled
[JENKINS] Archiving disabled
[JENKINS] Archiving disabled
[JENKINS] Archiving disabled
[JENKINS] Archiving disabled
[JENKINS] Archiving disabled
[JENKINS] Archiving disabled
2017-01-31T03:22:26.984 [INFO] ------------------------------------------------------------------------
2017-01-31T03:22:26.984 [INFO] Reactor Summary:
2017-01-31T03:22:26.984 [INFO] 
2017-01-31T03:22:26.984 [INFO] Apache Beam :: Parent .............................. SUCCESS
[ 24.069 s]
2017-01-31T03:22:26.984 [INFO] Apache Beam :: SDKs :: Java :: Build Tools ......... SUCCESS
[  5.884 s]
2017-01-31T03:22:26.984 [INFO] Apache Beam :: SDKs ................................ SUCCESS
[  9.555 s]
2017-01-31T03:22:26.984 [INFO] Apache Beam :: SDKs :: Common ...................... SUCCESS
[  2.227 s]
2017-01-31T03:22:26.984 [INFO] Apache Beam :: SDKs :: Common :: Fn API ............ SUCCESS
[ 26.762 s]
2017-01-31T03:22:26.984 [INFO] Apache Beam :: SDKs :: Java ........................ SUCCESS
[  2.385 s]
2017-01-31T03:22:26.984 [INFO] Apache Beam :: SDKs :: Java :: Core ................ SUCCESS
[03:27 min]
2017-01-31T03:22:26.984 [INFO] Apache Beam :: Runners ............................. SUCCESS
[  2.747 s]
2017-01-31T03:22:26.984 [INFO] Apache Beam :: Runners :: Core Java ................ SUCCESS
[ 43.093 s]
2017-01-31T03:22:26.985 [INFO] Apache Beam :: Runners :: Direct Java .............. SUCCESS
[02:37 min]
2017-01-31T03:22:26.985 [INFO] Apache Beam :: Runners :: Google Cloud Dataflow .... SUCCESS
[ 28.736 s]
2017-01-31T03:22:26.985 [INFO] Apache Beam :: SDKs :: Java :: IO .................. SUCCESS
[  1.552 s]
2017-01-31T03:22:26.985 [INFO] Apache Beam :: SDKs :: Java :: IO :: Google Cloud Platform
SUCCESS [04:10 min]
2017-01-31T03:22:26.985 [INFO] Apache Beam :: SDKs :: Java :: IO :: HDFS .......... SUCCESS
[ 23.928 s]
2017-01-31T03:22:26.985 [INFO] Apache Beam :: SDKs :: Java :: IO :: JMS ........... SUCCESS
[ 16.088 s]
2017-01-31T03:22:26.985 [INFO] Apache Beam :: SDKs :: Java :: IO :: Kafka ......... SUCCESS
[ 16.614 s]
2017-01-31T03:22:26.985 [INFO] Apache Beam :: SDKs :: Java :: IO :: Kinesis ....... SUCCESS
[ 19.478 s]
2017-01-31T03:22:26.985 [INFO] Apache Beam :: SDKs :: Java :: IO :: MongoDB ....... SUCCESS
[ 28.532 s]
2017-01-31T03:22:26.985 [INFO] Apache Beam :: SDKs :: Java :: IO :: JDBC .......... SUCCESS
[ 22.780 s]
2017-01-31T03:22:26.985 [INFO] Apache Beam :: SDKs :: Java :: IO :: Elasticsearch . SUCCESS
[ 36.910 s]
2017-01-31T03:22:26.985 [INFO] Apache Beam :: SDKs :: Java :: IO :: MQTT .......... SUCCESS
[ 15.904 s]
2017-01-31T03:22:26.985 [INFO] Apache Beam :: SDKs :: Java :: Maven Archetypes .... SUCCESS
[  5.872 s]
2017-01-31T03:22:26.985 [INFO] Apache Beam :: SDKs :: Java :: Maven Archetypes :: Starter
SUCCESS [ 15.275 s]
2017-01-31T03:22:26.985 [INFO] Apache Beam :: SDKs :: Java :: Maven Archetypes :: Examples
SUCCESS [ 13.631 s]
2017-01-31T03:22:26.985 [INFO] Apache Beam :: SDKs :: Java :: Maven Archetypes :: Examples
- Java 8 SUCCESS [ 17.622 s]
2017-01-31T03:22:26.985 [INFO] Apache Beam :: SDKs :: Java :: Extensions .......... SUCCESS
[  1.468 s]
2017-01-31T03:22:26.985 [INFO] Apache Beam :: SDKs :: Java :: Extensions :: Join library SUCCESS
[ 12.496 s]
2017-01-31T03:22:26.985 [INFO] Apache Beam :: SDKs :: Java :: Extensions :: Sorter  SUCCESS
[ 28.652 s]
2017-01-31T03:22:26.985 [INFO] Apache Beam :: SDKs :: Java :: Harness ............. SUCCESS
[ 32.156 s]
2017-01-31T03:22:26.985 [INFO] Apache Beam :: SDKs :: Java :: Java 8 Tests ........ SUCCESS
[ 10.671 s]
2017-01-31T03:22:26.985 [INFO] Apache Beam :: SDKs :: Python ...................... FAILURE
[02:42 min]
2017-01-31T03:22:26.985 [INFO] Apache Beam :: Runners :: Flink .................... SKIPPED
2017-01-31T03:22:26.985 [INFO] Apache Beam :: Runners :: Flink :: Core ............ SKIPPED
2017-01-31T03:22:26.985 [INFO] Apache Beam :: Runners :: Flink :: Examples ........ SKIPPED
2017-01-31T03:22:26.985 [INFO] Apache Beam :: Runners :: Spark .................... SKIPPED
2017-01-31T03:22:26.985 [INFO] Apache Beam :: Runners :: Apex ..................... SKIPPED
2017-01-31T03:22:26.985 [INFO] Apache Beam :: Examples ............................ SKIPPED
2017-01-31T03:22:26.985 [INFO] Apache Beam :: Examples :: Java .................... SKIPPED
2017-01-31T03:22:26.985 [INFO] Apache Beam :: Examples :: Java 8 .................. SKIPPED
2017-01-31T03:22:26.985 [INFO] ------------------------------------------------------------------------
2017-01-31T03:22:26.985 [INFO] BUILD FAILURE
2017-01-31T03:22:26.986 [INFO] ------------------------------------------------------------------------
2017-01-31T03:22:26.986 [INFO] Total time: 21:51 min
2017-01-31T03:22:26.986 [INFO] Finished at: 2017-01-31T03:22:26+00:00
2017-01-31T03:22:27.776 [INFO] Final Memory: 184M/1387M
2017-01-31T03:22:27.776 [INFO] ------------------------------------------------------------------------
Waiting for Jenkins to finish collecting data
2017-01-31T03:22:45.781 [ERROR] Failed to execute goal org.apache.rat:apache-rat-plugin:0.12:check
(default) on project beam-sdks-python: Too many files with unapproved license: 7 See RAT report
in: <https://builds.apache.org/job/beam_PostCommit_Java_MavenInstall/ws/sdks/python/target/beam-sdks-python-0.6.0-SNAPSHOT.rat>
-> [Help 1]
org.apache.maven.lifecycle.LifecycleExecutionException: Failed to execute goal org.apache.rat:apache-rat-plugin:0.12:check
(default) on project beam-sdks-python: Too many files with unapproved license: 7 See RAT report
in: <https://builds.apache.org/job/beam_PostCommit_Java_MavenInstall/ws/sdks/python/target/beam-sdks-python-0.6.0-SNAPSHOT.rat>
	at org.apache.maven.lifecycle.internal.MojoExecutor.execute(MojoExecutor.java:212)
	at org.apache.maven.lifecycle.internal.MojoExecutor.execute(MojoExecutor.java:153)
	at org.apache.maven.lifecycle.internal.MojoExecutor.execute(MojoExecutor.java:145)
	at org.apache.maven.lifecycle.internal.LifecycleModuleBuilder.buildProject(LifecycleModuleBuilder.java:116)
	at org.apache.maven.lifecycle.internal.LifecycleModuleBuilder.buildProject(LifecycleModuleBuilder.java:80)
	at org.apache.maven.lifecycle.internal.builder.singlethreaded.SingleThreadedBuilder.build(SingleThreadedBuilder.java:51)
	at org.apache.maven.lifecycle.internal.LifecycleStarter.execute(LifecycleStarter.java:128)
	at org.apache.maven.DefaultMaven.doExecute(DefaultMaven.java:307)
	at org.apache.maven.DefaultMaven.doExecute(DefaultMaven.java:193)
	at org.apache.maven.DefaultMaven.execute(DefaultMaven.java:106)
	at org.jvnet.hudson.maven3.launcher.Maven32Launcher.main(Maven32Launcher.java:132)
	at sun.reflect.NativeMethodAccessorImpl.invoke0(Native Method)
	at sun.reflect.NativeMethodAccessorImpl.invoke(NativeMethodAccessorImpl.java:62)
	at sun.reflect.DelegatingMethodAccessorImpl.invoke(DelegatingMethodAccessorImpl.java:43)
	at java.lang.reflect.Method.invoke(Method.java:498)
	at org.codehaus.plexus.classworlds.launcher.Launcher.launchStandard(Launcher.java:330)
	at org.codehaus.plexus.classworlds.launcher.Launcher.launch(Launcher.java:238)
	at jenkins.maven3.agent.Maven32Main.launch(Maven32Main.java:186)
	at sun.reflect.NativeMethodAccessorImpl.invoke0(Native Method)
	at sun.reflect.NativeMethodAccessorImpl.invoke(NativeMethodAccessorImpl.java:62)
	at sun.reflect.DelegatingMethodAccessorImpl.invoke(DelegatingMethodAccessorImpl.java:43)
	at java.lang.reflect.Method.invoke(Method.java:498)
	at hudson.maven.Maven3Builder.call(Maven3Builder.java:136)
	at hudson.maven.Maven3Builder.call(Maven3Builder.java:71)
	at hudson.remoting.UserRequest.perform(UserRequest.java:153)
	at hudson.remoting.UserRequest.perform(UserRequest.java:50)
	at hudson.remoting.Request$2.run(Request.java:332)
	at hudson.remoting.InterceptingExecutorService$1.call(InterceptingExecutorService.java:68)
	at java.util.concurrent.FutureTask.run(FutureTask.java:266)
	at java.util.concurrent.ThreadPoolExecutor.runWorker(ThreadPoolExecutor.java:1142)
	at java.util.concurrent.ThreadPoolExecutor$Worker.run(ThreadPoolExecutor.java:617)
	at java.lang.Thread.run(Thread.java:745)
Caused by: org.apache.rat.mp.RatCheckException: Too many files with unapproved license: 7
See RAT report in: <https://builds.apache.org/job/beam_PostCommit_Java_MavenInstall/ws/sdks/python/target/beam-sdks-python-0.6.0-SNAPSHOT.rat>
	at org.apache.rat.mp.RatCheckMojo.check(RatCheckMojo.java:183)
	at org.apache.rat.mp.RatCheckMojo.execute(RatCheckMojo.java:156)
	at org.apache.maven.plugin.DefaultBuildPluginManager.executeMojo(DefaultBuildPluginManager.java:134)
	at org.apache.maven.lifecycle.internal.MojoExecutor.execute(MojoExecutor.java:208)
	... 31 more
2017-01-31T03:22:45.782 [ERROR] 
2017-01-31T03:22:45.782 [ERROR] Re-run Maven using the -X switch to enable full debug logging.
2017-01-31T03:22:45.782 [ERROR] 
2017-01-31T03:22:45.782 [ERROR] For more information about the errors and possible solutions,
please read the following articles:
2017-01-31T03:22:45.783 [ERROR] [Help 1] http://cwiki.apache.org/confluence/display/MAVEN/MojoFailureException
2017-01-31T03:22:45.783 [ERROR] 
2017-01-31T03:22:45.783 [ERROR] After correcting the problems, you can resume the build with
the command
2017-01-31T03:22:45.783 [ERROR]   mvn <goals> -rf :beam-sdks-python
channel stopped

Mime
View raw message