beam-commits mailing list archives

Site index · List index
Message view « Date » · « Thread »
Top « Date » · « Thread »
From Apache Jenkins Server <jenk...@builds.apache.org>
Subject Build failed in Jenkins: beam_PostCommit_Java_RunnableOnService_Spark #503
Date Mon, 19 Dec 2016 23:41:01 GMT
See <https://builds.apache.org/job/beam_PostCommit_Java_RunnableOnService_Spark/503/changes>

Changes:

[joshualitt] Change counter name in TestDataflowRunner

[bchambers] Change counter name in TestDataflowRunner

[lcwik] [BEAM-59] initial interfaces and classes of Beam FileSystem.

------------------------------------------
[...truncated 2349 lines...]
	at java.lang.reflect.Method.invoke(Method.java:498)
	at org.codehaus.plexus.classworlds.launcher.Launcher.launchStandard(Launcher.java:330)
	at org.codehaus.plexus.classworlds.launcher.Launcher.launch(Launcher.java:238)
	at jenkins.maven3.agent.Maven32Main.launch(Maven32Main.java:186)
	at sun.reflect.NativeMethodAccessorImpl.invoke0(Native Method)
	at sun.reflect.NativeMethodAccessorImpl.invoke(NativeMethodAccessorImpl.java:62)
	at sun.reflect.DelegatingMethodAccessorImpl.invoke(DelegatingMethodAccessorImpl.java:43)
	at java.lang.reflect.Method.invoke(Method.java:498)
	at hudson.maven.Maven3Builder.call(Maven3Builder.java:136)
	at hudson.maven.Maven3Builder.call(Maven3Builder.java:71)
	at hudson.remoting.UserRequest.perform(UserRequest.java:153)
	at hudson.remoting.UserRequest.perform(UserRequest.java:50)
	at hudson.remoting.Request$2.run(Request.java:332)
	at hudson.remoting.InterceptingExecutorService$1.call(InterceptingExecutorService.java:68)
	at java.util.concurrent.FutureTask.run(FutureTask.java:266)
	at java.util.concurrent.ThreadPoolExecutor.runWorker(ThreadPoolExecutor.java:1142)
	at java.util.concurrent.ThreadPoolExecutor$Worker.run(ThreadPoolExecutor.java:617)
	at java.lang.Thread.run(Thread.java:745)
java.io.FileNotFoundException: <https://builds.apache.org/job/beam_PostCommit_Java_RunnableOnService_Spark/ws/sdks/java/io/kafka/pom.xml>
(No such file or directory)
	at java.io.FileInputStream.open0(Native Method)
	at java.io.FileInputStream.open(FileInputStream.java:195)
	at java.io.FileInputStream.<init>(FileInputStream.java:138)
	at hudson.Util.getDigestOf(Util.java:800)
	at hudson.maven.reporters.MavenArtifactArchiver.postBuild(MavenArtifactArchiver.java:100)
	at hudson.maven.Maven3Builder$MavenExecutionListener.sessionEnded(Maven3Builder.java:471)
	at hudson.maven.Maven3Builder$JenkinsEventSpy.onEvent(Maven3Builder.java:287)
	at org.apache.maven.eventspy.internal.EventSpyDispatcher.onEvent(EventSpyDispatcher.java:108)
	at org.apache.maven.eventspy.internal.EventSpyExecutionListener.sessionEnded(EventSpyExecutionListener.java:61)
	at org.apache.maven.lifecycle.internal.DefaultExecutionEventCatapult.fire(DefaultExecutionEventCatapult.java:64)
	at org.apache.maven.lifecycle.internal.DefaultExecutionEventCatapult.fire(DefaultExecutionEventCatapult.java:42)
	at org.apache.maven.lifecycle.internal.LifecycleStarter.execute(LifecycleStarter.java:137)
	at org.apache.maven.DefaultMaven.doExecute(DefaultMaven.java:307)
	at org.apache.maven.DefaultMaven.doExecute(DefaultMaven.java:193)
	at org.apache.maven.DefaultMaven.execute(DefaultMaven.java:106)
	at org.jvnet.hudson.maven3.launcher.Maven32Launcher.main(Maven32Launcher.java:132)
	at sun.reflect.NativeMethodAccessorImpl.invoke0(Native Method)
	at sun.reflect.NativeMethodAccessorImpl.invoke(NativeMethodAccessorImpl.java:62)
	at sun.reflect.DelegatingMethodAccessorImpl.invoke(DelegatingMethodAccessorImpl.java:43)
	at java.lang.reflect.Method.invoke(Method.java:498)
	at org.codehaus.plexus.classworlds.launcher.Launcher.launchStandard(Launcher.java:330)
	at org.codehaus.plexus.classworlds.launcher.Launcher.launch(Launcher.java:238)
	at jenkins.maven3.agent.Maven32Main.launch(Maven32Main.java:186)
	at sun.reflect.NativeMethodAccessorImpl.invoke0(Native Method)
	at sun.reflect.NativeMethodAccessorImpl.invoke(NativeMethodAccessorImpl.java:62)
	at sun.reflect.DelegatingMethodAccessorImpl.invoke(DelegatingMethodAccessorImpl.java:43)
	at java.lang.reflect.Method.invoke(Method.java:498)
	at hudson.maven.Maven3Builder.call(Maven3Builder.java:136)
	at hudson.maven.Maven3Builder.call(Maven3Builder.java:71)
	at hudson.remoting.UserRequest.perform(UserRequest.java:153)
	at hudson.remoting.UserRequest.perform(UserRequest.java:50)
	at hudson.remoting.Request$2.run(Request.java:332)
	at hudson.remoting.InterceptingExecutorService$1.call(InterceptingExecutorService.java:68)
	at java.util.concurrent.FutureTask.run(FutureTask.java:266)
	at java.util.concurrent.ThreadPoolExecutor.runWorker(ThreadPoolExecutor.java:1142)
	at java.util.concurrent.ThreadPoolExecutor$Worker.run(ThreadPoolExecutor.java:617)
	at java.lang.Thread.run(Thread.java:745)
java.io.FileNotFoundException: <https://builds.apache.org/job/beam_PostCommit_Java_RunnableOnService_Spark/ws/sdks/java/pom.xml>
(No such file or directory)
	at java.io.FileInputStream.open0(Native Method)
	at java.io.FileInputStream.open(FileInputStream.java:195)
	at java.io.FileInputStream.<init>(FileInputStream.java:138)
	at hudson.Util.getDigestOf(Util.java:800)
	at hudson.maven.reporters.MavenArtifactArchiver.postBuild(MavenArtifactArchiver.java:100)
	at hudson.maven.Maven3Builder$MavenExecutionListener.sessionEnded(Maven3Builder.java:471)
	at hudson.maven.Maven3Builder$JenkinsEventSpy.onEvent(Maven3Builder.java:287)
	at org.apache.maven.eventspy.internal.EventSpyDispatcher.onEvent(EventSpyDispatcher.java:108)
	at org.apache.maven.eventspy.internal.EventSpyExecutionListener.sessionEnded(EventSpyExecutionListener.java:61)
	at org.apache.maven.lifecycle.internal.DefaultExecutionEventCatapult.fire(DefaultExecutionEventCatapult.java:64)
	at org.apache.maven.lifecycle.internal.DefaultExecutionEventCatapult.fire(DefaultExecutionEventCatapult.java:42)
	at org.apache.maven.lifecycle.internal.LifecycleStarter.execute(LifecycleStarter.java:137)
	at org.apache.maven.DefaultMaven.doExecute(DefaultMaven.java:307)
	at org.apache.maven.DefaultMaven.doExecute(DefaultMaven.java:193)
	at org.apache.maven.DefaultMaven.execute(DefaultMaven.java:106)
	at org.jvnet.hudson.maven3.launcher.Maven32Launcher.main(Maven32Launcher.java:132)
	at sun.reflect.NativeMethodAccessorImpl.invoke0(Native Method)
	at sun.reflect.NativeMethodAccessorImpl.invoke(NativeMethodAccessorImpl.java:62)
	at sun.reflect.DelegatingMethodAccessorImpl.invoke(DelegatingMethodAccessorImpl.java:43)
	at java.lang.reflect.Method.invoke(Method.java:498)
	at org.codehaus.plexus.classworlds.launcher.Launcher.launchStandard(Launcher.java:330)
	at org.codehaus.plexus.classworlds.launcher.Launcher.launch(Launcher.java:238)
	at jenkins.maven3.agent.Maven32Main.launch(Maven32Main.java:186)
	at sun.reflect.NativeMethodAccessorImpl.invoke0(Native Method)
	at sun.reflect.NativeMethodAccessorImpl.invoke(NativeMethodAccessorImpl.java:62)
	at sun.reflect.DelegatingMethodAccessorImpl.invoke(DelegatingMethodAccessorImpl.java:43)
	at java.lang.reflect.Method.invoke(Method.java:498)
	at hudson.maven.Maven3Builder.call(Maven3Builder.java:136)
	at hudson.maven.Maven3Builder.call(Maven3Builder.java:71)
	at hudson.remoting.UserRequest.perform(UserRequest.java:153)
	at hudson.remoting.UserRequest.perform(UserRequest.java:50)
	at hudson.remoting.Request$2.run(Request.java:332)
	at hudson.remoting.InterceptingExecutorService$1.call(InterceptingExecutorService.java:68)
	at java.util.concurrent.FutureTask.run(FutureTask.java:266)
	at java.util.concurrent.ThreadPoolExecutor.runWorker(ThreadPoolExecutor.java:1142)
	at java.util.concurrent.ThreadPoolExecutor$Worker.run(ThreadPoolExecutor.java:617)
	at java.lang.Thread.run(Thread.java:745)
java.io.FileNotFoundException: <https://builds.apache.org/job/beam_PostCommit_Java_RunnableOnService_Spark/ws/pom.xml>
(No such file or directory)
	at java.io.FileInputStream.open0(Native Method)
	at java.io.FileInputStream.open(FileInputStream.java:195)
	at java.io.FileInputStream.<init>(FileInputStream.java:138)
	at hudson.Util.getDigestOf(Util.java:800)
	at hudson.maven.reporters.MavenArtifactArchiver.postBuild(MavenArtifactArchiver.java:100)
	at hudson.maven.Maven3Builder$MavenExecutionListener.sessionEnded(Maven3Builder.java:471)
	at hudson.maven.Maven3Builder$JenkinsEventSpy.onEvent(Maven3Builder.java:287)
	at org.apache.maven.eventspy.internal.EventSpyDispatcher.onEvent(EventSpyDispatcher.java:108)
	at org.apache.maven.eventspy.internal.EventSpyExecutionListener.sessionEnded(EventSpyExecutionListener.java:61)
	at org.apache.maven.lifecycle.internal.DefaultExecutionEventCatapult.fire(DefaultExecutionEventCatapult.java:64)
	at org.apache.maven.lifecycle.internal.DefaultExecutionEventCatapult.fire(DefaultExecutionEventCatapult.java:42)
	at org.apache.maven.lifecycle.internal.LifecycleStarter.execute(LifecycleStarter.java:137)
	at org.apache.maven.DefaultMaven.doExecute(DefaultMaven.java:307)
	at org.apache.maven.DefaultMaven.doExecute(DefaultMaven.java:193)
	at org.apache.maven.DefaultMaven.execute(DefaultMaven.java:106)
	at org.jvnet.hudson.maven3.launcher.Maven32Launcher.main(Maven32Launcher.java:132)
	at sun.reflect.NativeMethodAccessorImpl.invoke0(Native Method)
	at sun.reflect.NativeMethodAccessorImpl.invoke(NativeMethodAccessorImpl.java:62)
	at sun.reflect.DelegatingMethodAccessorImpl.invoke(DelegatingMethodAccessorImpl.java:43)
	at java.lang.reflect.Method.invoke(Method.java:498)
	at org.codehaus.plexus.classworlds.launcher.Launcher.launchStandard(Launcher.java:330)
	at org.codehaus.plexus.classworlds.launcher.Launcher.launch(Launcher.java:238)
	at jenkins.maven3.agent.Maven32Main.launch(Maven32Main.java:186)
	at sun.reflect.NativeMethodAccessorImpl.invoke0(Native Method)
	at sun.reflect.NativeMethodAccessorImpl.invoke(NativeMethodAccessorImpl.java:62)
	at sun.reflect.DelegatingMethodAccessorImpl.invoke(DelegatingMethodAccessorImpl.java:43)
	at java.lang.reflect.Method.invoke(Method.java:498)
	at hudson.maven.Maven3Builder.call(Maven3Builder.java:136)
	at hudson.maven.Maven3Builder.call(Maven3Builder.java:71)
	at hudson.remoting.UserRequest.perform(UserRequest.java:153)
	at hudson.remoting.UserRequest.perform(UserRequest.java:50)
	at hudson.remoting.Request$2.run(Request.java:332)
	at hudson.remoting.InterceptingExecutorService$1.call(InterceptingExecutorService.java:68)
	at java.util.concurrent.FutureTask.run(FutureTask.java:266)
	at java.util.concurrent.ThreadPoolExecutor.runWorker(ThreadPoolExecutor.java:1142)
	at java.util.concurrent.ThreadPoolExecutor$Worker.run(ThreadPoolExecutor.java:617)
	at java.lang.Thread.run(Thread.java:745)
2016-12-19T23:41:00.800 [INFO] ------------------------------------------------------------------------
2016-12-19T23:41:00.800 [INFO] Reactor Summary:
2016-12-19T23:41:00.800 [INFO] 
2016-12-19T23:41:00.801 [INFO] Apache Beam :: Parent .............................. SUCCESS
[ 16.692 s]
2016-12-19T23:41:00.801 [INFO] Apache Beam :: SDKs ................................ SUCCESS
[  0.450 s]
2016-12-19T23:41:00.801 [INFO] Apache Beam :: SDKs :: Java ........................ SUCCESS
[  0.393 s]
2016-12-19T23:41:00.801 [INFO] Apache Beam :: SDKs :: Java :: Core ................ FAILURE
[  7.755 s]
2016-12-19T23:41:00.802 [INFO] Apache Beam :: Runners ............................. SKIPPED
2016-12-19T23:41:00.802 [INFO] Apache Beam :: Runners :: Core Java ................ SKIPPED
2016-12-19T23:41:00.802 [INFO] Apache Beam :: Runners :: Direct Java .............. SKIPPED
2016-12-19T23:41:00.802 [INFO] Apache Beam :: SDKs :: Java :: IO .................. SKIPPED
2016-12-19T23:41:00.802 [INFO] Apache Beam :: SDKs :: Java :: IO :: Kafka ......... SKIPPED
2016-12-19T23:41:00.803 [INFO] Apache Beam :: Runners :: Spark .................... SKIPPED
2016-12-19T23:41:00.803 [INFO] ------------------------------------------------------------------------
2016-12-19T23:41:00.803 [INFO] BUILD FAILURE
2016-12-19T23:41:00.803 [INFO] ------------------------------------------------------------------------
2016-12-19T23:41:00.803 [INFO] Total time: 37.386 s
2016-12-19T23:41:00.804 [INFO] Finished at: 2016-12-19T23:41:00+00:00
2016-12-19T23:41:01.102 [INFO] Final Memory: 38M/412M
2016-12-19T23:41:01.102 [INFO] ------------------------------------------------------------------------
Waiting for Jenkins to finish collecting data
2016-12-19T23:41:01.402 [ERROR] Failed to execute goal org.apache.avro:avro-maven-plugin:1.8.1:schema
(schemas) on project beam-sdks-java-core: neither sourceDirectory: <https://builds.apache.org/job/beam_PostCommit_Java_RunnableOnService_Spark/ws/sdks/java/core/src/main/avro>
or testSourceDirectory: <https://builds.apache.org/job/beam_PostCommit_Java_RunnableOnService_Spark/ws/sdks/java/core/src/test>
are directories -> [Help 1]
org.apache.maven.lifecycle.LifecycleExecutionException: Failed to execute goal org.apache.avro:avro-maven-plugin:1.8.1:schema
(schemas) on project beam-sdks-java-core: neither sourceDirectory: <https://builds.apache.org/job/beam_PostCommit_Java_RunnableOnService_Spark/ws/sdks/java/core/src/main/avro>
or testSourceDirectory: <https://builds.apache.org/job/beam_PostCommit_Java_RunnableOnService_Spark/ws/sdks/java/core/src/test>
are directories
	at org.apache.maven.lifecycle.internal.MojoExecutor.execute(MojoExecutor.java:216)
	at org.apache.maven.lifecycle.internal.MojoExecutor.execute(MojoExecutor.java:153)
	at org.apache.maven.lifecycle.internal.MojoExecutor.execute(MojoExecutor.java:145)
	at org.apache.maven.lifecycle.internal.LifecycleModuleBuilder.buildProject(LifecycleModuleBuilder.java:116)
	at org.apache.maven.lifecycle.internal.LifecycleModuleBuilder.buildProject(LifecycleModuleBuilder.java:80)
	at org.apache.maven.lifecycle.internal.builder.singlethreaded.SingleThreadedBuilder.build(SingleThreadedBuilder.java:51)
	at org.apache.maven.lifecycle.internal.LifecycleStarter.execute(LifecycleStarter.java:128)
	at org.apache.maven.DefaultMaven.doExecute(DefaultMaven.java:307)
	at org.apache.maven.DefaultMaven.doExecute(DefaultMaven.java:193)
	at org.apache.maven.DefaultMaven.execute(DefaultMaven.java:106)
	at org.jvnet.hudson.maven3.launcher.Maven32Launcher.main(Maven32Launcher.java:132)
	at sun.reflect.NativeMethodAccessorImpl.invoke0(Native Method)
	at sun.reflect.NativeMethodAccessorImpl.invoke(NativeMethodAccessorImpl.java:62)
	at sun.reflect.DelegatingMethodAccessorImpl.invoke(DelegatingMethodAccessorImpl.java:43)
	at java.lang.reflect.Method.invoke(Method.java:498)
	at org.codehaus.plexus.classworlds.launcher.Launcher.launchStandard(Launcher.java:330)
	at org.codehaus.plexus.classworlds.launcher.Launcher.launch(Launcher.java:238)
	at jenkins.maven3.agent.Maven32Main.launch(Maven32Main.java:186)
	at sun.reflect.NativeMethodAccessorImpl.invoke0(Native Method)
	at sun.reflect.NativeMethodAccessorImpl.invoke(NativeMethodAccessorImpl.java:62)
	at sun.reflect.DelegatingMethodAccessorImpl.invoke(DelegatingMethodAccessorImpl.java:43)
	at java.lang.reflect.Method.invoke(Method.java:498)
	at hudson.maven.Maven3Builder.call(Maven3Builder.java:136)
	at hudson.maven.Maven3Builder.call(Maven3Builder.java:71)
	at hudson.remoting.UserRequest.perform(UserRequest.java:153)
	at hudson.remoting.UserRequest.perform(UserRequest.java:50)
	at hudson.remoting.Request$2.run(Request.java:332)
	at hudson.remoting.InterceptingExecutorService$1.call(InterceptingExecutorService.java:68)
	at java.util.concurrent.FutureTask.run(FutureTask.java:266)
	at java.util.concurrent.ThreadPoolExecutor.runWorker(ThreadPoolExecutor.java:1142)
	at java.util.concurrent.ThreadPoolExecutor$Worker.run(ThreadPoolExecutor.java:617)
	at java.lang.Thread.run(Thread.java:745)
Caused by: org.apache.maven.plugin.MojoExecutionException: neither sourceDirectory: <https://builds.apache.org/job/beam_PostCommit_Java_RunnableOnService_Spark/ws/sdks/java/core/src/main/avro>
or testSourceDirectory: <https://builds.apache.org/job/beam_PostCommit_Java_RunnableOnService_Spark/ws/sdks/java/core/src/test>
are directories
	at org.apache.avro.mojo.AbstractAvroMojo.execute(AbstractAvroMojo.java:142)
	at org.apache.maven.plugin.DefaultBuildPluginManager.executeMojo(DefaultBuildPluginManager.java:134)
	at org.apache.maven.lifecycle.internal.MojoExecutor.execute(MojoExecutor.java:208)
	... 31 more
2016-12-19T23:41:01.403 [ERROR] 
2016-12-19T23:41:01.403 [ERROR] Re-run Maven using the -X switch to enable full debug logging.
2016-12-19T23:41:01.403 [ERROR] 
2016-12-19T23:41:01.403 [ERROR] For more information about the errors and possible solutions,
please read the following articles:
2016-12-19T23:41:01.403 [ERROR] [Help 1] http://cwiki.apache.org/confluence/display/MAVEN/MojoExecutionException
2016-12-19T23:41:01.403 [ERROR] 
2016-12-19T23:41:01.403 [ERROR] After correcting the problems, you can resume the build with
the command
2016-12-19T23:41:01.403 [ERROR]   mvn <goals> -rf :beam-sdks-java-core
[JENKINS] Archiving <https://builds.apache.org/job/beam_PostCommit_Java_RunnableOnService_Spark/ws/pom.xml>
to org.apache.beam/beam-parent/0.5.0-incubating-SNAPSHOT/beam-parent-0.5.0-incubating-SNAPSHOT.pom
No artifacts from beam_PostCommit_Java_RunnableOnService_Spark ยป Apache Beam :: Parent #477
to compare, so performing full copy of artifacts
ERROR: Failed to parse POMs
java.io.IOException: java.util.concurrent.ExecutionException: hudson.os.PosixException: native
error calling stat: No such file or directory <https://builds.apache.org/job/beam_PostCommit_Java_RunnableOnService_Spark/ws/pom.xml>
ENOENT
	at hudson.FilePath.copyRecursiveTo(FilePath.java:2253)
	at jenkins.model.StandardArtifactManager.archive(StandardArtifactManager.java:61)
	at com.cloudbees.jenkins.plugins.jsync.archiver.JSyncArtifactManager.remoteSync(JSyncArtifactManager.java:128)
	at com.cloudbees.jenkins.plugins.jsync.archiver.JSyncArtifactManager.archive(JSyncArtifactManager.java:76)
	at hudson.maven.MavenBuild$ProxyImpl.performArchiving(MavenBuild.java:483)
	at hudson.maven.MavenModuleSetBuild$MavenModuleSetBuildExecution.doRun(MavenModuleSetBuild.java:855)
	at hudson.model.AbstractBuild$AbstractBuildExecution.run(AbstractBuild.java:534)
	at hudson.model.Run.execute(Run.java:1741)
	at hudson.maven.MavenModuleSetBuild.run(MavenModuleSetBuild.java:531)
	at hudson.model.ResourceController.execute(ResourceController.java:98)
	at hudson.model.Executor.run(Executor.java:410)
Caused by: java.util.concurrent.ExecutionException: hudson.os.PosixException: native error
calling stat: No such file or directory <https://builds.apache.org/job/beam_PostCommit_Java_RunnableOnService_Spark/ws/pom.xml>
ENOENT
	at hudson.remoting.Channel$2.adapt(Channel.java:813)
	at hudson.remoting.Channel$2.adapt(Channel.java:808)
	at hudson.remoting.FutureAdapter.get(FutureAdapter.java:55)
	at hudson.FilePath.copyRecursiveTo(FilePath.java:2251)
	... 10 more
Caused by: hudson.os.PosixException: native error calling stat: No such file or directory
<https://builds.apache.org/job/beam_PostCommit_Java_RunnableOnService_Spark/ws/pom.xml>
ENOENT
	at hudson.os.PosixAPI$1.error(PosixAPI.java:36)
	at jnr.posix.LinuxPOSIX.stat(LinuxPOSIX.java:117)
	at jnr.posix.CheckedPOSIX.stat(CheckedPOSIX.java:265)
	at jnr.posix.LazyPOSIX.stat(LazyPOSIX.java:267)
	at hudson.util.IOUtils.mode(IOUtils.java:128)
	at hudson.util.io.TarArchiver.visit(TarArchiver.java:87)
	at hudson.util.DirScanner.scanSingle(DirScanner.java:49)
	at hudson.FilePath$ExplicitlySpecifiedDirScanner.scan(FilePath.java:2845)
	at hudson.FilePath.writeToTar(FilePath.java:2289)
	at hudson.FilePath.access$2100(FilePath.java:195)
	at hudson.FilePath$45.invoke(FilePath.java:2230)
	at hudson.FilePath$45.invoke(FilePath.java:2226)
	at hudson.FilePath$FileCallableWrapper.call(FilePath.java:2772)
	at hudson.remoting.UserRequest.perform(UserRequest.java:153)
	at hudson.remoting.UserRequest.perform(UserRequest.java:50)
	at hudson.remoting.Request$2.run(Request.java:332)
	at hudson.remoting.InterceptingExecutorService$1.call(InterceptingExecutorService.java:68)
	at java.util.concurrent.FutureTask.run(FutureTask.java:262)
	at java.util.concurrent.ThreadPoolExecutor.runWorker(ThreadPoolExecutor.java:1145)
	at java.util.concurrent.ThreadPoolExecutor$Worker.run(ThreadPoolExecutor.java:615)
	at java.lang.Thread.run(Thread.java:745)
	at ......remote call to beam3(Native Method)
	at hudson.remoting.Channel.attachCallSiteStackTrace(Channel.java:1416)
	at hudson.remoting.UserResponse.retrieve(UserRequest.java:253)
	at hudson.remoting.Channel$2.adapt(Channel.java:811)
	... 13 more
channel stopped

Mime
View raw message