beam-commits mailing list archives

Site index · List index
Message view « Date » · « Thread »
Top « Date » · « Thread »
From Apache Jenkins Server <jenk...@builds.apache.org>
Subject Build failed in Jenkins: beam_PostCommit_Python_Verify #910
Date Thu, 22 Dec 2016 15:03:02 GMT
See <https://builds.apache.org/job/beam_PostCommit_Python_Verify/910/>

------------------------------------------
[...truncated 2482 lines...]
Traceback (most recent call last):
  File "<https://builds.apache.org/job/beam_PostCommit_Python_Verify/ws/sdks/python/apache_beam/dataflow_test.py",>
line 239, in test_as_list_and_as_dict_side_inputs
    pipeline = TestPipeline()
  File "<https://builds.apache.org/job/beam_PostCommit_Python_Verify/ws/sdks/python/apache_beam/test_pipeline.py",>
line 58, in __init__
    super(TestPipeline, self).__init__(runner, options, argv)
  File "<https://builds.apache.org/job/beam_PostCommit_Python_Verify/ws/sdks/python/apache_beam/pipeline.py",>
line 127, in __init__
    'Pipeline has validations errors: \n' + '\n'.join(errors))
ValueError: Pipeline has validations errors: 
Missing GCS path option: temp_location.

======================================================================
ERROR: test_as_list_with_unique_labels (apache_beam.dataflow_test.DataflowTest)
----------------------------------------------------------------------
Traceback (most recent call last):
  File "<https://builds.apache.org/job/beam_PostCommit_Python_Verify/ws/sdks/python/apache_beam/dataflow_test.py",>
line 352, in test_as_list_with_unique_labels
    pipeline = TestPipeline()
  File "<https://builds.apache.org/job/beam_PostCommit_Python_Verify/ws/sdks/python/apache_beam/test_pipeline.py",>
line 58, in __init__
    super(TestPipeline, self).__init__(runner, options, argv)
  File "<https://builds.apache.org/job/beam_PostCommit_Python_Verify/ws/sdks/python/apache_beam/pipeline.py",>
line 127, in __init__
    'Pipeline has validations errors: \n' + '\n'.join(errors))
ValueError: Pipeline has validations errors: 
Missing GCS path option: temp_location.

======================================================================
ERROR: test_as_list_without_unique_labels (apache_beam.dataflow_test.DataflowTest)
----------------------------------------------------------------------
Traceback (most recent call last):
  File "<https://builds.apache.org/job/beam_PostCommit_Python_Verify/ws/sdks/python/apache_beam/dataflow_test.py",>
line 330, in test_as_list_without_unique_labels
    pipeline = TestPipeline()
  File "<https://builds.apache.org/job/beam_PostCommit_Python_Verify/ws/sdks/python/apache_beam/test_pipeline.py",>
line 58, in __init__
    super(TestPipeline, self).__init__(runner, options, argv)
  File "<https://builds.apache.org/job/beam_PostCommit_Python_Verify/ws/sdks/python/apache_beam/pipeline.py",>
line 127, in __init__
    'Pipeline has validations errors: \n' + '\n'.join(errors))
ValueError: Pipeline has validations errors: 
Missing GCS path option: temp_location.

======================================================================
ERROR: test_as_singleton_with_different_defaults_with_unique_labels (apache_beam.dataflow_test.DataflowTest)
----------------------------------------------------------------------
Traceback (most recent call last):
  File "<https://builds.apache.org/job/beam_PostCommit_Python_Verify/ws/sdks/python/apache_beam/dataflow_test.py",>
line 305, in test_as_singleton_with_different_defaults_with_unique_labels
    pipeline = TestPipeline()
  File "<https://builds.apache.org/job/beam_PostCommit_Python_Verify/ws/sdks/python/apache_beam/test_pipeline.py",>
line 58, in __init__
    super(TestPipeline, self).__init__(runner, options, argv)
  File "<https://builds.apache.org/job/beam_PostCommit_Python_Verify/ws/sdks/python/apache_beam/pipeline.py",>
line 127, in __init__
    'Pipeline has validations errors: \n' + '\n'.join(errors))
ValueError: Pipeline has validations errors: 
Missing GCS path option: temp_location.

======================================================================
ERROR: test_as_singleton_with_different_defaults_without_unique_labels (apache_beam.dataflow_test.DataflowTest)
----------------------------------------------------------------------
Traceback (most recent call last):
  File "<https://builds.apache.org/job/beam_PostCommit_Python_Verify/ws/sdks/python/apache_beam/dataflow_test.py",>
line 288, in test_as_singleton_with_different_defaults_without_unique_labels
    pipeline = TestPipeline()
  File "<https://builds.apache.org/job/beam_PostCommit_Python_Verify/ws/sdks/python/apache_beam/test_pipeline.py",>
line 58, in __init__
    super(TestPipeline, self).__init__(runner, options, argv)
  File "<https://builds.apache.org/job/beam_PostCommit_Python_Verify/ws/sdks/python/apache_beam/pipeline.py",>
line 127, in __init__
    'Pipeline has validations errors: \n' + '\n'.join(errors))
ValueError: Pipeline has validations errors: 
Missing GCS path option: temp_location.

======================================================================
ERROR: test_as_singleton_without_unique_labels (apache_beam.dataflow_test.DataflowTest)
----------------------------------------------------------------------
Traceback (most recent call last):
  File "<https://builds.apache.org/job/beam_PostCommit_Python_Verify/ws/sdks/python/apache_beam/dataflow_test.py",>
line 264, in test_as_singleton_without_unique_labels
    pipeline = TestPipeline()
  File "<https://builds.apache.org/job/beam_PostCommit_Python_Verify/ws/sdks/python/apache_beam/test_pipeline.py",>
line 58, in __init__
    super(TestPipeline, self).__init__(runner, options, argv)
  File "<https://builds.apache.org/job/beam_PostCommit_Python_Verify/ws/sdks/python/apache_beam/pipeline.py",>
line 127, in __init__
    'Pipeline has validations errors: \n' + '\n'.join(errors))
ValueError: Pipeline has validations errors: 
Missing GCS path option: temp_location.

======================================================================
ERROR: test_default_value_singleton_side_input (apache_beam.dataflow_test.DataflowTest)
----------------------------------------------------------------------
Traceback (most recent call last):
  File "<https://builds.apache.org/job/beam_PostCommit_Python_Verify/ws/sdks/python/apache_beam/dataflow_test.py",>
line 192, in test_default_value_singleton_side_input
    pipeline = TestPipeline()
  File "<https://builds.apache.org/job/beam_PostCommit_Python_Verify/ws/sdks/python/apache_beam/test_pipeline.py",>
line 58, in __init__
    super(TestPipeline, self).__init__(runner, options, argv)
  File "<https://builds.apache.org/job/beam_PostCommit_Python_Verify/ws/sdks/python/apache_beam/pipeline.py",>
line 127, in __init__
    'Pipeline has validations errors: \n' + '\n'.join(errors))
ValueError: Pipeline has validations errors: 
Missing GCS path option: temp_location.

======================================================================
ERROR: test_empty_side_outputs (apache_beam.dataflow_test.DataflowTest)
----------------------------------------------------------------------
Traceback (most recent call last):
  File "<https://builds.apache.org/job/beam_PostCommit_Python_Verify/ws/sdks/python/apache_beam/dataflow_test.py",>
line 224, in test_empty_side_outputs
    pipeline = TestPipeline()
  File "<https://builds.apache.org/job/beam_PostCommit_Python_Verify/ws/sdks/python/apache_beam/test_pipeline.py",>
line 58, in __init__
    super(TestPipeline, self).__init__(runner, options, argv)
  File "<https://builds.apache.org/job/beam_PostCommit_Python_Verify/ws/sdks/python/apache_beam/pipeline.py",>
line 127, in __init__
    'Pipeline has validations errors: \n' + '\n'.join(errors))
ValueError: Pipeline has validations errors: 
Missing GCS path option: temp_location.

======================================================================
ERROR: test_empty_singleton_side_input (apache_beam.dataflow_test.DataflowTest)
----------------------------------------------------------------------
Traceback (most recent call last):
  File "<https://builds.apache.org/job/beam_PostCommit_Python_Verify/ws/sdks/python/apache_beam/dataflow_test.py",>
line 168, in test_empty_singleton_side_input
    pipeline = TestPipeline()
  File "<https://builds.apache.org/job/beam_PostCommit_Python_Verify/ws/sdks/python/apache_beam/test_pipeline.py",>
line 58, in __init__
    super(TestPipeline, self).__init__(runner, options, argv)
  File "<https://builds.apache.org/job/beam_PostCommit_Python_Verify/ws/sdks/python/apache_beam/pipeline.py",>
line 127, in __init__
    'Pipeline has validations errors: \n' + '\n'.join(errors))
ValueError: Pipeline has validations errors: 
Missing GCS path option: temp_location.

======================================================================
ERROR: test_iterable_side_input (apache_beam.dataflow_test.DataflowTest)
----------------------------------------------------------------------
Traceback (most recent call last):
  File "<https://builds.apache.org/job/beam_PostCommit_Python_Verify/ws/sdks/python/apache_beam/dataflow_test.py",>
line 201, in test_iterable_side_input
    pipeline = TestPipeline()
  File "<https://builds.apache.org/job/beam_PostCommit_Python_Verify/ws/sdks/python/apache_beam/test_pipeline.py",>
line 58, in __init__
    super(TestPipeline, self).__init__(runner, options, argv)
  File "<https://builds.apache.org/job/beam_PostCommit_Python_Verify/ws/sdks/python/apache_beam/pipeline.py",>
line 127, in __init__
    'Pipeline has validations errors: \n' + '\n'.join(errors))
ValueError: Pipeline has validations errors: 
Missing GCS path option: temp_location.

======================================================================
ERROR: test_map (apache_beam.dataflow_test.DataflowTest)
----------------------------------------------------------------------
Traceback (most recent call last):
  File "<https://builds.apache.org/job/beam_PostCommit_Python_Verify/ws/sdks/python/apache_beam/dataflow_test.py",>
line 74, in test_map
    pipeline = TestPipeline()
  File "<https://builds.apache.org/job/beam_PostCommit_Python_Verify/ws/sdks/python/apache_beam/test_pipeline.py",>
line 58, in __init__
    super(TestPipeline, self).__init__(runner, options, argv)
  File "<https://builds.apache.org/job/beam_PostCommit_Python_Verify/ws/sdks/python/apache_beam/pipeline.py",>
line 127, in __init__
    'Pipeline has validations errors: \n' + '\n'.join(errors))
ValueError: Pipeline has validations errors: 
Missing GCS path option: temp_location.

======================================================================
ERROR: test_par_do_with_do_fn_object (apache_beam.dataflow_test.DataflowTest)
----------------------------------------------------------------------
Traceback (most recent call last):
  File "<https://builds.apache.org/job/beam_PostCommit_Python_Verify/ws/sdks/python/apache_beam/dataflow_test.py",>
line 118, in test_par_do_with_do_fn_object
    pipeline = TestPipeline()
  File "<https://builds.apache.org/job/beam_PostCommit_Python_Verify/ws/sdks/python/apache_beam/test_pipeline.py",>
line 58, in __init__
    super(TestPipeline, self).__init__(runner, options, argv)
  File "<https://builds.apache.org/job/beam_PostCommit_Python_Verify/ws/sdks/python/apache_beam/pipeline.py",>
line 127, in __init__
    'Pipeline has validations errors: \n' + '\n'.join(errors))
ValueError: Pipeline has validations errors: 
Missing GCS path option: temp_location.

======================================================================
ERROR: test_par_do_with_multiple_outputs_and_using_return (apache_beam.dataflow_test.DataflowTest)
----------------------------------------------------------------------
Traceback (most recent call last):
  File "<https://builds.apache.org/job/beam_PostCommit_Python_Verify/ws/sdks/python/apache_beam/dataflow_test.py",>
line 157, in test_par_do_with_multiple_outputs_and_using_return
    pipeline = TestPipeline()
  File "<https://builds.apache.org/job/beam_PostCommit_Python_Verify/ws/sdks/python/apache_beam/test_pipeline.py",>
line 58, in __init__
    super(TestPipeline, self).__init__(runner, options, argv)
  File "<https://builds.apache.org/job/beam_PostCommit_Python_Verify/ws/sdks/python/apache_beam/pipeline.py",>
line 127, in __init__
    'Pipeline has validations errors: \n' + '\n'.join(errors))
ValueError: Pipeline has validations errors: 
Missing GCS path option: temp_location.

======================================================================
ERROR: test_par_do_with_multiple_outputs_and_using_yield (apache_beam.dataflow_test.DataflowTest)
----------------------------------------------------------------------
Traceback (most recent call last):
  File "<https://builds.apache.org/job/beam_PostCommit_Python_Verify/ws/sdks/python/apache_beam/dataflow_test.py",>
line 140, in test_par_do_with_multiple_outputs_and_using_yield
    pipeline = TestPipeline()
  File "<https://builds.apache.org/job/beam_PostCommit_Python_Verify/ws/sdks/python/apache_beam/test_pipeline.py",>
line 58, in __init__
    super(TestPipeline, self).__init__(runner, options, argv)
  File "<https://builds.apache.org/job/beam_PostCommit_Python_Verify/ws/sdks/python/apache_beam/pipeline.py",>
line 127, in __init__
    'Pipeline has validations errors: \n' + '\n'.join(errors))
ValueError: Pipeline has validations errors: 
Missing GCS path option: temp_location.

======================================================================
ERROR: test_par_do_with_side_input_as_arg (apache_beam.dataflow_test.DataflowTest)
----------------------------------------------------------------------
Traceback (most recent call last):
  File "<https://builds.apache.org/job/beam_PostCommit_Python_Verify/ws/sdks/python/apache_beam/dataflow_test.py",>
line 84, in test_par_do_with_side_input_as_arg
    pipeline = TestPipeline()
  File "<https://builds.apache.org/job/beam_PostCommit_Python_Verify/ws/sdks/python/apache_beam/test_pipeline.py",>
line 58, in __init__
    super(TestPipeline, self).__init__(runner, options, argv)
  File "<https://builds.apache.org/job/beam_PostCommit_Python_Verify/ws/sdks/python/apache_beam/pipeline.py",>
line 127, in __init__
    'Pipeline has validations errors: \n' + '\n'.join(errors))
ValueError: Pipeline has validations errors: 
Missing GCS path option: temp_location.

======================================================================
ERROR: test_par_do_with_side_input_as_keyword_arg (apache_beam.dataflow_test.DataflowTest)
----------------------------------------------------------------------
Traceback (most recent call last):
  File "<https://builds.apache.org/job/beam_PostCommit_Python_Verify/ws/sdks/python/apache_beam/dataflow_test.py",>
line 98, in test_par_do_with_side_input_as_keyword_arg
    pipeline = TestPipeline()
  File "<https://builds.apache.org/job/beam_PostCommit_Python_Verify/ws/sdks/python/apache_beam/test_pipeline.py",>
line 58, in __init__
    super(TestPipeline, self).__init__(runner, options, argv)
  File "<https://builds.apache.org/job/beam_PostCommit_Python_Verify/ws/sdks/python/apache_beam/pipeline.py",>
line 127, in __init__
    'Pipeline has validations errors: \n' + '\n'.join(errors))
ValueError: Pipeline has validations errors: 
Missing GCS path option: temp_location.

======================================================================
ERROR: test_undeclared_side_outputs (apache_beam.dataflow_test.DataflowTest)
----------------------------------------------------------------------
Traceback (most recent call last):
  File "<https://builds.apache.org/job/beam_PostCommit_Python_Verify/ws/sdks/python/apache_beam/dataflow_test.py",>
line 211, in test_undeclared_side_outputs
    pipeline = TestPipeline()
  File "<https://builds.apache.org/job/beam_PostCommit_Python_Verify/ws/sdks/python/apache_beam/test_pipeline.py",>
line 58, in __init__
    super(TestPipeline, self).__init__(runner, options, argv)
  File "<https://builds.apache.org/job/beam_PostCommit_Python_Verify/ws/sdks/python/apache_beam/pipeline.py",>
line 127, in __init__
    'Pipeline has validations errors: \n' + '\n'.join(errors))
ValueError: Pipeline has validations errors: 
Missing GCS path option: temp_location.

======================================================================
ERROR: test_window_transform (apache_beam.dataflow_test.DataflowTest)
----------------------------------------------------------------------
Traceback (most recent call last):
  File "<https://builds.apache.org/job/beam_PostCommit_Python_Verify/ws/sdks/python/apache_beam/dataflow_test.py",>
line 405, in test_window_transform
    pipeline = TestPipeline()
  File "<https://builds.apache.org/job/beam_PostCommit_Python_Verify/ws/sdks/python/apache_beam/test_pipeline.py",>
line 58, in __init__
    super(TestPipeline, self).__init__(runner, options, argv)
  File "<https://builds.apache.org/job/beam_PostCommit_Python_Verify/ws/sdks/python/apache_beam/pipeline.py",>
line 127, in __init__
    'Pipeline has validations errors: \n' + '\n'.join(errors))
ValueError: Pipeline has validations errors: 
Missing GCS path option: temp_location.

======================================================================
ERROR: test_word_count (apache_beam.dataflow_test.DataflowTest)
----------------------------------------------------------------------
Traceback (most recent call last):
  File "<https://builds.apache.org/job/beam_PostCommit_Python_Verify/ws/sdks/python/apache_beam/dataflow_test.py",>
line 64, in test_word_count
    pipeline = TestPipeline()
  File "<https://builds.apache.org/job/beam_PostCommit_Python_Verify/ws/sdks/python/apache_beam/test_pipeline.py",>
line 58, in __init__
    super(TestPipeline, self).__init__(runner, options, argv)
  File "<https://builds.apache.org/job/beam_PostCommit_Python_Verify/ws/sdks/python/apache_beam/pipeline.py",>
line 127, in __init__
    'Pipeline has validations errors: \n' + '\n'.join(errors))
ValueError: Pipeline has validations errors: 
Missing GCS path option: temp_location.

----------------------------------------------------------------------
Ran 20 tests in 0.979s

FAILED (errors=20)
Build step 'Execute shell' marked build as failure

Mime
View raw message