beam-commits mailing list archives

Site index · List index
Message view « Date » · « Thread »
Top « Date » · « Thread »
From Apache Jenkins Server <jenk...@builds.apache.org>
Subject Build failed in Jenkins: beam_PostCommit_Java_MavenInstall #1952
Date Thu, 01 Dec 2016 00:57:05 GMT
See <https://builds.apache.org/job/beam_PostCommit_Java_MavenInstall/1952/>

------------------------------------------
[...truncated 12292 lines...]
[INFO] Apache Beam :: Parent .............................. FAILURE [  1.338 s]
[INFO] Apache Beam :: SDKs :: Java :: Build Tools ......... SUCCESS [  3.367 s]
[INFO] Apache Beam :: SDKs ................................ SUCCESS [  5.950 s]
[INFO] Apache Beam :: SDKs :: Java ........................ SUCCESS [  1.632 s]
[INFO] Apache Beam :: SDKs :: Java :: Core ................ SUCCESS [02:37 min]
[INFO] Apache Beam :: Runners ............................. SUCCESS [  1.620 s]
[INFO] Apache Beam :: Runners :: Core Java ................ SUCCESS [ 32.384 s]
[INFO] Apache Beam :: Runners :: Direct Java .............. SUCCESS [01:57 min]
[INFO] Apache Beam :: Runners :: Google Cloud Dataflow .... SUCCESS [ 23.437 s]
[INFO] Apache Beam :: SDKs :: Java :: IO .................. SUCCESS [  2.706 s]
[INFO] Apache Beam :: SDKs :: Java :: IO :: Google Cloud Platform SUCCESS [04:25 min]
[INFO] Apache Beam :: SDKs :: Java :: IO :: HDFS .......... SUCCESS [ 22.792 s]
[INFO] Apache Beam :: SDKs :: Java :: IO :: JMS ........... SUCCESS [  9.532 s]
[INFO] Apache Beam :: SDKs :: Java :: IO :: Kafka ......... SUCCESS [ 15.845 s]
[INFO] Apache Beam :: SDKs :: Java :: IO :: Kinesis ....... SUCCESS [ 17.217 s]
[INFO] Apache Beam :: SDKs :: Java :: IO :: MongoDB ....... SUCCESS [ 26.480 s]
[INFO] Apache Beam :: SDKs :: Java :: IO :: JDBC .......... SUCCESS [ 18.708 s]
[INFO] Apache Beam :: SDKs :: Java :: Maven Archetypes .... SUCCESS [  1.552 s]
[INFO] Apache Beam :: SDKs :: Java :: Maven Archetypes :: Starter SUCCESS [ 14.090 s]
[INFO] Apache Beam :: SDKs :: Java :: Maven Archetypes :: Examples SUCCESS [ 12.115 s]
[INFO] Apache Beam :: SDKs :: Java :: Extensions .......... SUCCESS [  1.217 s]
[INFO] Apache Beam :: SDKs :: Java :: Extensions :: Join library SUCCESS [ 14.511 s]
[INFO] Apache Beam :: SDKs :: Java :: Extensions :: Sorter  SUCCESS [ 29.234 s]
[INFO] Apache Beam :: SDKs :: Java :: Java 8 Tests ........ SUCCESS [  8.690 s]
[INFO] Apache Beam :: Runners :: Flink .................... SUCCESS [  1.336 s]
[INFO] Apache Beam :: Runners :: Flink :: Core ............ SUCCESS [ 38.778 s]
[INFO] Apache Beam :: Runners :: Flink :: Examples ........ SUCCESS [ 12.396 s]
[INFO] Apache Beam :: Runners :: Spark .................... SUCCESS [02:47 min]
[INFO] Apache Beam :: Runners :: Apex ..................... SUCCESS [ 54.895 s]
[INFO] Apache Beam :: Examples ............................ SUCCESS [  1.477 s]
[INFO] Apache Beam :: Examples :: Java .................... SUCCESS [07:41 min]
[INFO] Apache Beam :: Examples :: Java 8 .................. SUCCESS [ 15.316 s]
[INFO] ------------------------------------------------------------------------
[INFO] BUILD FAILURE
[INFO] ------------------------------------------------------------------------
[INFO] Total time: 27:18 min
[INFO] Finished at: 2016-12-01T00:55:55+00:00
[INFO] Final Memory: 211M/1014M
[INFO] ------------------------------------------------------------------------
Waiting for Jenkins to finish collecting data
[ERROR] Failed to execute goal org.eluder.coveralls:coveralls-maven-plugin:4.1.0:report (default-cli) on project beam-parent: Build error: Either repository token or service with job id must be defined -> [Help 1]
org.apache.maven.lifecycle.LifecycleExecutionException: Failed to execute goal org.eluder.coveralls:coveralls-maven-plugin:4.1.0:report (default-cli) on project beam-parent: Build error
	at org.apache.maven.lifecycle.internal.MojoExecutor.execute(MojoExecutor.java:216)
	at org.apache.maven.lifecycle.internal.MojoExecutor.execute(MojoExecutor.java:153)
	at org.apache.maven.lifecycle.internal.MojoExecutor.execute(MojoExecutor.java:145)
	at org.apache.maven.lifecycle.internal.LifecycleModuleBuilder.buildProject(LifecycleModuleBuilder.java:116)
	at org.apache.maven.lifecycle.internal.LifecycleModuleBuilder.buildProject(LifecycleModuleBuilder.java:80)
	at org.apache.maven.lifecycle.internal.builder.singlethreaded.SingleThreadedBuilder.build(SingleThreadedBuilder.java:51)
	at org.apache.maven.lifecycle.internal.LifecycleStarter.execute(LifecycleStarter.java:128)
	at org.apache.maven.DefaultMaven.doExecute(DefaultMaven.java:307)
	at org.apache.maven.DefaultMaven.doExecute(DefaultMaven.java:193)
	at org.apache.maven.DefaultMaven.execute(DefaultMaven.java:106)
	at org.jvnet.hudson.maven3.launcher.Maven32Launcher.main(Maven32Launcher.java:132)
	at sun.reflect.NativeMethodAccessorImpl.invoke0(Native Method)
	at sun.reflect.NativeMethodAccessorImpl.invoke(NativeMethodAccessorImpl.java:62)
	at sun.reflect.DelegatingMethodAccessorImpl.invoke(DelegatingMethodAccessorImpl.java:43)
	at java.lang.reflect.Method.invoke(Method.java:498)
	at org.codehaus.plexus.classworlds.launcher.Launcher.launchStandard(Launcher.java:330)
	at org.codehaus.plexus.classworlds.launcher.Launcher.launch(Launcher.java:238)
	at jenkins.maven3.agent.Maven32Main.launch(Maven32Main.java:186)
	at sun.reflect.NativeMethodAccessorImpl.invoke0(Native Method)
	at sun.reflect.NativeMethodAccessorImpl.invoke(NativeMethodAccessorImpl.java:62)
	at sun.reflect.DelegatingMethodAccessorImpl.invoke(DelegatingMethodAccessorImpl.java:43)
	at java.lang.reflect.Method.invoke(Method.java:498)
	at hudson.maven.Maven3Builder.call(Maven3Builder.java:136)
	at hudson.maven.Maven3Builder.call(Maven3Builder.java:71)
	at hudson.remoting.UserRequest.perform(UserRequest.java:153)
	at hudson.remoting.UserRequest.perform(UserRequest.java:50)
	at hudson.remoting.Request$2.run(Request.java:332)
	at hudson.remoting.InterceptingExecutorService$1.call(InterceptingExecutorService.java:68)
	at java.util.concurrent.FutureTask.run(FutureTask.java:266)
	at java.util.concurrent.ThreadPoolExecutor.runWorker(ThreadPoolExecutor.java:1142)
	at java.util.concurrent.ThreadPoolExecutor$Worker.run(ThreadPoolExecutor.java:617)
	at java.lang.Thread.run(Thread.java:745)
Caused by: org.apache.maven.plugin.MojoExecutionException: Build error
	at org.eluder.coveralls.maven.plugin.CoverallsReportMojo.execute(CoverallsReportMojo.java:251)
	at org.apache.maven.plugin.DefaultBuildPluginManager.executeMojo(DefaultBuildPluginManager.java:134)
	at org.apache.maven.lifecycle.internal.MojoExecutor.execute(MojoExecutor.java:208)
	... 31 more
Caused by: org.eluder.coveralls.maven.plugin.validation.ValidationException: Either repository token or service with job id must be defined
	at org.eluder.coveralls.maven.plugin.validation.ValidationErrors.throwOrInform(ValidationErrors.java:40)
	at org.eluder.coveralls.maven.plugin.CoverallsReportMojo.execute(CoverallsReportMojo.java:229)
	... 33 more
[ERROR] 
[ERROR] Re-run Maven using the -X switch to enable full debug logging.
[ERROR] 
[ERROR] For more information about the errors and possible solutions, please read the following articles:
[ERROR] [Help 1] http://cwiki.apache.org/confluence/display/MAVEN/MojoExecutionException
[JENKINS] Archiving <https://builds.apache.org/job/beam_PostCommit_Java_MavenInstall/ws/sdks/java/io/pom.xml> to org.apache.beam/beam-sdks-java-io-parent/0.4.0-incubating-SNAPSHOT/beam-sdks-java-io-parent-0.4.0-incubating-SNAPSHOT.pom
No artifacts from beam_PostCommit_Java_MavenInstall » Apache Beam :: SDKs :: Java :: IO #1953 to compare, so performing full copy of artifacts
[JENKINS] Archiving <https://builds.apache.org/job/beam_PostCommit_Java_MavenInstall/ws/sdks/java/maven-archetypes/starter/pom.xml> to org.apache.beam/beam-sdks-java-maven-archetypes-starter/0.4.0-incubating-SNAPSHOT/beam-sdks-java-maven-archetypes-starter-0.4.0-incubating-SNAPSHOT.pom
[JENKINS] Archiving <https://builds.apache.org/job/beam_PostCommit_Java_MavenInstall/ws/sdks/java/maven-archetypes/starter/target/beam-sdks-java-maven-archetypes-starter-0.4.0-incubating-SNAPSHOT.jar> to org.apache.beam/beam-sdks-java-maven-archetypes-starter/0.4.0-incubating-SNAPSHOT/beam-sdks-java-maven-archetypes-starter-0.4.0-incubating-SNAPSHOT.jar
[JENKINS] Archiving <https://builds.apache.org/job/beam_PostCommit_Java_MavenInstall/ws/sdks/java/maven-archetypes/starter/target/beam-sdks-java-maven-archetypes-starter-0.4.0-incubating-SNAPSHOT-sources.jar> to org.apache.beam/beam-sdks-java-maven-archetypes-starter/0.4.0-incubating-SNAPSHOT/beam-sdks-java-maven-archetypes-starter-0.4.0-incubating-SNAPSHOT-sources.jar
[JENKINS] Archiving <https://builds.apache.org/job/beam_PostCommit_Java_MavenInstall/ws/sdks/java/maven-archetypes/starter/target/beam-sdks-java-maven-archetypes-starter-0.4.0-incubating-SNAPSHOT-test-sources.jar> to org.apache.beam/beam-sdks-java-maven-archetypes-starter/0.4.0-incubating-SNAPSHOT/beam-sdks-java-maven-archetypes-starter-0.4.0-incubating-SNAPSHOT-test-sources.jar
No artifacts from beam_PostCommit_Java_MavenInstall » Apache Beam :: SDKs :: Java :: Maven Archetypes :: Starter #1953 to compare, so performing full copy of artifacts
[JENKINS] Archiving <https://builds.apache.org/job/beam_PostCommit_Java_MavenInstall/ws/runners/direct-java/dependency-reduced-pom.xml> to org.apache.beam/beam-runners-direct-java/0.4.0-incubating-SNAPSHOT/beam-runners-direct-java-0.4.0-incubating-SNAPSHOT.pom
[JENKINS] Archiving <https://builds.apache.org/job/beam_PostCommit_Java_MavenInstall/ws/runners/direct-java/target/beam-runners-direct-java-0.4.0-incubating-SNAPSHOT.jar> to org.apache.beam/beam-runners-direct-java/0.4.0-incubating-SNAPSHOT/beam-runners-direct-java-0.4.0-incubating-SNAPSHOT.jar
[JENKINS] Archiving <https://builds.apache.org/job/beam_PostCommit_Java_MavenInstall/ws/runners/direct-java/target/beam-runners-direct-java-0.4.0-incubating-SNAPSHOT-javadoc.jar> to org.apache.beam/beam-runners-direct-java/0.4.0-incubating-SNAPSHOT/beam-runners-direct-java-0.4.0-incubating-SNAPSHOT-javadoc.jar
[JENKINS] Archiving <https://builds.apache.org/job/beam_PostCommit_Java_MavenInstall/ws/runners/direct-java/target/beam-runners-direct-java-0.4.0-incubating-SNAPSHOT-sources.jar> to org.apache.beam/beam-runners-direct-java/0.4.0-incubating-SNAPSHOT/beam-runners-direct-java-0.4.0-incubating-SNAPSHOT-sources.jar
[JENKINS] Archiving <https://builds.apache.org/job/beam_PostCommit_Java_MavenInstall/ws/runners/direct-java/target/beam-runners-direct-java-0.4.0-incubating-SNAPSHOT-test-sources.jar> to org.apache.beam/beam-runners-direct-java/0.4.0-incubating-SNAPSHOT/beam-runners-direct-java-0.4.0-incubating-SNAPSHOT-test-sources.jar
[JENKINS] Archiving <https://builds.apache.org/job/beam_PostCommit_Java_MavenInstall/ws/runners/direct-java/target/beam-runners-direct-java-0.4.0-incubating-SNAPSHOT-tests.jar> to org.apache.beam/beam-runners-direct-java/0.4.0-incubating-SNAPSHOT/beam-runners-direct-java-0.4.0-incubating-SNAPSHOT-tests.jar
No artifacts from beam_PostCommit_Java_MavenInstall » Apache Beam :: Runners :: Direct Java #1953 to compare, so performing full copy of artifacts
[JENKINS] Archiving <https://builds.apache.org/job/beam_PostCommit_Java_MavenInstall/ws/examples/java/pom.xml> to org.apache.beam/beam-examples-java/0.4.0-incubating-SNAPSHOT/beam-examples-java-0.4.0-incubating-SNAPSHOT.pom
[JENKINS] Archiving <https://builds.apache.org/job/beam_PostCommit_Java_MavenInstall/ws/examples/java/target/beam-examples-java-0.4.0-incubating-SNAPSHOT.jar> to org.apache.beam/beam-examples-java/0.4.0-incubating-SNAPSHOT/beam-examples-java-0.4.0-incubating-SNAPSHOT.jar
[JENKINS] Archiving <https://builds.apache.org/job/beam_PostCommit_Java_MavenInstall/ws/examples/java/target/beam-examples-java-0.4.0-incubating-SNAPSHOT-javadoc.jar> to org.apache.beam/beam-examples-java/0.4.0-incubating-SNAPSHOT/beam-examples-java-0.4.0-incubating-SNAPSHOT-javadoc.jar
[JENKINS] Archiving <https://builds.apache.org/job/beam_PostCommit_Java_MavenInstall/ws/examples/java/target/beam-examples-java-0.4.0-incubating-SNAPSHOT-sources.jar> to org.apache.beam/beam-examples-java/0.4.0-incubating-SNAPSHOT/beam-examples-java-0.4.0-incubating-SNAPSHOT-sources.jar
[JENKINS] Archiving <https://builds.apache.org/job/beam_PostCommit_Java_MavenInstall/ws/examples/java/target/beam-examples-java-0.4.0-incubating-SNAPSHOT-test-sources.jar> to org.apache.beam/beam-examples-java/0.4.0-incubating-SNAPSHOT/beam-examples-java-0.4.0-incubating-SNAPSHOT-test-sources.jar
[JENKINS] Archiving <https://builds.apache.org/job/beam_PostCommit_Java_MavenInstall/ws/examples/java/target/beam-examples-java-0.4.0-incubating-SNAPSHOT-tests.jar> to org.apache.beam/beam-examples-java/0.4.0-incubating-SNAPSHOT/beam-examples-java-0.4.0-incubating-SNAPSHOT-tests.jar
[JENKINS] Archiving <https://builds.apache.org/job/beam_PostCommit_Java_MavenInstall/ws/sdks/java/build-tools/pom.xml> to org.apache.beam/beam-sdks-java-build-tools/0.4.0-incubating-SNAPSHOT/beam-sdks-java-build-tools-0.4.0-incubating-SNAPSHOT.pom
[JENKINS] Archiving <https://builds.apache.org/job/beam_PostCommit_Java_MavenInstall/ws/sdks/java/build-tools/target/beam-sdks-java-build-tools-0.4.0-incubating-SNAPSHOT.jar> to org.apache.beam/beam-sdks-java-build-tools/0.4.0-incubating-SNAPSHOT/beam-sdks-java-build-tools-0.4.0-incubating-SNAPSHOT.jar
[JENKINS] Archiving <https://builds.apache.org/job/beam_PostCommit_Java_MavenInstall/ws/sdks/java/build-tools/target/beam-sdks-java-build-tools-0.4.0-incubating-SNAPSHOT-sources.jar> to org.apache.beam/beam-sdks-java-build-tools/0.4.0-incubating-SNAPSHOT/beam-sdks-java-build-tools-0.4.0-incubating-SNAPSHOT-sources.jar
[JENKINS] Archiving <https://builds.apache.org/job/beam_PostCommit_Java_MavenInstall/ws/sdks/java/build-tools/target/beam-sdks-java-build-tools-0.4.0-incubating-SNAPSHOT-test-sources.jar> to org.apache.beam/beam-sdks-java-build-tools/0.4.0-incubating-SNAPSHOT/beam-sdks-java-build-tools-0.4.0-incubating-SNAPSHOT-test-sources.jar
[JENKINS] Archiving <https://builds.apache.org/job/beam_PostCommit_Java_MavenInstall/ws/sdks/java/build-tools/target/beam-sdks-java-build-tools-0.4.0-incubating-SNAPSHOT-tests.jar> to org.apache.beam/beam-sdks-java-build-tools/0.4.0-incubating-SNAPSHOT/beam-sdks-java-build-tools-0.4.0-incubating-SNAPSHOT-tests.jar
No artifacts from beam_PostCommit_Java_MavenInstall » Apache Beam :: SDKs :: Java :: Build Tools #1953 to compare, so performing full copy of artifacts
[JENKINS] Archiving <https://builds.apache.org/job/beam_PostCommit_Java_MavenInstall/ws/sdks/java/core/dependency-reduced-pom.xml> to org.apache.beam/beam-sdks-java-core/0.4.0-incubating-SNAPSHOT/beam-sdks-java-core-0.4.0-incubating-SNAPSHOT.pom
[JENKINS] Archiving <https://builds.apache.org/job/beam_PostCommit_Java_MavenInstall/ws/sdks/java/core/target/beam-sdks-java-core-0.4.0-incubating-SNAPSHOT.jar> to org.apache.beam/beam-sdks-java-core/0.4.0-incubating-SNAPSHOT/beam-sdks-java-core-0.4.0-incubating-SNAPSHOT.jar
[JENKINS] Archiving <https://builds.apache.org/job/beam_PostCommit_Java_MavenInstall/ws/sdks/java/core/target/beam-sdks-java-core-0.4.0-incubating-SNAPSHOT-javadoc.jar> to org.apache.beam/beam-sdks-java-core/0.4.0-incubating-SNAPSHOT/beam-sdks-java-core-0.4.0-incubating-SNAPSHOT-javadoc.jar
[JENKINS] Archiving <https://builds.apache.org/job/beam_PostCommit_Java_MavenInstall/ws/sdks/java/core/target/beam-sdks-java-core-0.4.0-incubating-SNAPSHOT-sources.jar> to org.apache.beam/beam-sdks-java-core/0.4.0-incubating-SNAPSHOT/beam-sdks-java-core-0.4.0-incubating-SNAPSHOT-sources.jar
[JENKINS] Archiving <https://builds.apache.org/job/beam_PostCommit_Java_MavenInstall/ws/sdks/java/core/target/beam-sdks-java-core-0.4.0-incubating-SNAPSHOT-test-sources.jar> to org.apache.beam/beam-sdks-java-core/0.4.0-incubating-SNAPSHOT/beam-sdks-java-core-0.4.0-incubating-SNAPSHOT-test-sources.jar
[JENKINS] Archiving <https://builds.apache.org/job/beam_PostCommit_Java_MavenInstall/ws/sdks/java/core/target/beam-sdks-java-core-0.4.0-incubating-SNAPSHOT-tests.jar> to org.apache.beam/beam-sdks-java-core/0.4.0-incubating-SNAPSHOT/beam-sdks-java-core-0.4.0-incubating-SNAPSHOT-tests.jar
No artifacts from beam_PostCommit_Java_MavenInstall » Apache Beam :: SDKs :: Java :: Core #1953 to compare, so performing full copy of artifacts
[JENKINS] Archiving <https://builds.apache.org/job/beam_PostCommit_Java_MavenInstall/ws/runners/flink/examples/pom.xml> to org.apache.beam/beam-runners-flink_2.10-examples/0.4.0-incubating-SNAPSHOT/beam-runners-flink_2.10-examples-0.4.0-incubating-SNAPSHOT.pom
[JENKINS] Archiving <https://builds.apache.org/job/beam_PostCommit_Java_MavenInstall/ws/runners/flink/examples/target/beam-runners-flink_2.10-examples-0.4.0-incubating-SNAPSHOT.jar> to org.apache.beam/beam-runners-flink_2.10-examples/0.4.0-incubating-SNAPSHOT/beam-runners-flink_2.10-examples-0.4.0-incubating-SNAPSHOT.jar
[JENKINS] Archiving <https://builds.apache.org/job/beam_PostCommit_Java_MavenInstall/ws/runners/flink/examples/target/beam-runners-flink_2.10-examples-0.4.0-incubating-SNAPSHOT-tests.jar> to org.apache.beam/beam-runners-flink_2.10-examples/0.4.0-incubating-SNAPSHOT/beam-runners-flink_2.10-examples-0.4.0-incubating-SNAPSHOT-tests.jar
[JENKINS] Archiving <https://builds.apache.org/job/beam_PostCommit_Java_MavenInstall/ws/runners/flink/examples/target/beam-runners-flink_2.10-examples-0.4.0-incubating-SNAPSHOT-javadoc.jar> to org.apache.beam/beam-runners-flink_2.10-examples/0.4.0-incubating-SNAPSHOT/beam-runners-flink_2.10-examples-0.4.0-incubating-SNAPSHOT-javadoc.jar
[JENKINS] Archiving <https://builds.apache.org/job/beam_PostCommit_Java_MavenInstall/ws/runners/flink/examples/target/beam-runners-flink_2.10-examples-0.4.0-incubating-SNAPSHOT-sources.jar> to org.apache.beam/beam-runners-flink_2.10-examples/0.4.0-incubating-SNAPSHOT/beam-runners-flink_2.10-examples-0.4.0-incubating-SNAPSHOT-sources.jar
[JENKINS] Archiving <https://builds.apache.org/job/beam_PostCommit_Java_MavenInstall/ws/runners/flink/examples/target/beam-runners-flink_2.10-examples-0.4.0-incubating-SNAPSHOT-test-sources.jar> to org.apache.beam/beam-runners-flink_2.10-examples/0.4.0-incubating-SNAPSHOT/beam-runners-flink_2.10-examples-0.4.0-incubating-SNAPSHOT-test-sources.jar
No artifacts from beam_PostCommit_Java_MavenInstall » Apache Beam :: Runners :: Flink :: Examples #1953 to compare, so performing full copy of artifacts
[JENKINS] Archiving <https://builds.apache.org/job/beam_PostCommit_Java_MavenInstall/ws/runners/core-java/dependency-reduced-pom.xml> to org.apache.beam/beam-runners-core-java/0.4.0-incubating-SNAPSHOT/beam-runners-core-java-0.4.0-incubating-SNAPSHOT.pom
[JENKINS] Archiving <https://builds.apache.org/job/beam_PostCommit_Java_MavenInstall/ws/runners/core-java/target/beam-runners-core-java-0.4.0-incubating-SNAPSHOT.jar> to org.apache.beam/beam-runners-core-java/0.4.0-incubating-SNAPSHOT/beam-runners-core-java-0.4.0-incubating-SNAPSHOT.jar
[JENKINS] Archiving <https://builds.apache.org/job/beam_PostCommit_Java_MavenInstall/ws/runners/core-java/target/beam-runners-core-java-0.4.0-incubating-SNAPSHOT-javadoc.jar> to org.apache.beam/beam-runners-core-java/0.4.0-incubating-SNAPSHOT/beam-runners-core-java-0.4.0-incubating-SNAPSHOT-javadoc.jar
[JENKINS] Archiving <https://builds.apache.org/job/beam_PostCommit_Java_MavenInstall/ws/runners/core-java/target/beam-runners-core-java-0.4.0-incubating-SNAPSHOT-sources.jar> to org.apache.beam/beam-runners-core-java/0.4.0-incubating-SNAPSHOT/beam-runners-core-java-0.4.0-incubating-SNAPSHOT-sources.jar
[JENKINS] Archiving <https://builds.apache.org/job/beam_PostCommit_Java_MavenInstall/ws/runners/core-java/target/beam-runners-core-java-0.4.0-incubating-SNAPSHOT-test-sources.jar> to org.apache.beam/beam-runners-core-java/0.4.0-incubating-SNAPSHOT/beam-runners-core-java-0.4.0-incubating-SNAPSHOT-test-sources.jar
[JENKINS] Archiving <https://builds.apache.org/job/beam_PostCommit_Java_MavenInstall/ws/runners/core-java/target/beam-runners-core-java-0.4.0-incubating-SNAPSHOT-tests.jar> to org.apache.beam/beam-runners-core-java/0.4.0-incubating-SNAPSHOT/beam-runners-core-java-0.4.0-incubating-SNAPSHOT-tests.jar
No artifacts from beam_PostCommit_Java_MavenInstall » Apache Beam :: Runners :: Core Java #1953 to compare, so performing full copy of artifacts
[JENKINS] Archiving <https://builds.apache.org/job/beam_PostCommit_Java_MavenInstall/ws/sdks/java/io/kinesis/pom.xml> to org.apache.beam/beam-sdks-java-io-kinesis/0.4.0-incubating-SNAPSHOT/beam-sdks-java-io-kinesis-0.4.0-incubating-SNAPSHOT.pom
[JENKINS] Archiving <https://builds.apache.org/job/beam_PostCommit_Java_MavenInstall/ws/sdks/java/io/kinesis/target/beam-sdks-java-io-kinesis-0.4.0-incubating-SNAPSHOT.jar> to org.apache.beam/beam-sdks-java-io-kinesis/0.4.0-incubating-SNAPSHOT/beam-sdks-java-io-kinesis-0.4.0-incubating-SNAPSHOT.jar
[JENKINS] Archiving <https://builds.apache.org/job/beam_PostCommit_Java_MavenInstall/ws/sdks/java/io/kinesis/target/beam-sdks-java-io-kinesis-0.4.0-incubating-SNAPSHOT-javadoc.jar> to org.apache.beam/beam-sdks-java-io-kinesis/0.4.0-incubating-SNAPSHOT/beam-sdks-java-io-kinesis-0.4.0-incubating-SNAPSHOT-javadoc.jar
[JENKINS] Archiving <https://builds.apache.org/job/beam_PostCommit_Java_MavenInstall/ws/sdks/java/io/kinesis/target/beam-sdks-java-io-kinesis-0.4.0-incubating-SNAPSHOT-sources.jar> to org.apache.beam/beam-sdks-java-io-kinesis/0.4.0-incubating-SNAPSHOT/beam-sdks-java-io-kinesis-0.4.0-incubating-SNAPSHOT-sources.jar
[JENKINS] Archiving <https://builds.apache.org/job/beam_PostCommit_Java_MavenInstall/ws/sdks/java/io/kinesis/target/beam-sdks-java-io-kinesis-0.4.0-incubating-SNAPSHOT-test-sources.jar> to org.apache.beam/beam-sdks-java-io-kinesis/0.4.0-incubating-SNAPSHOT/beam-sdks-java-io-kinesis-0.4.0-incubating-SNAPSHOT-test-sources.jar
[JENKINS] Archiving <https://builds.apache.org/job/beam_PostCommit_Java_MavenInstall/ws/sdks/java/io/kinesis/target/beam-sdks-java-io-kinesis-0.4.0-incubating-SNAPSHOT-tests.jar> to org.apache.beam/beam-sdks-java-io-kinesis/0.4.0-incubating-SNAPSHOT/beam-sdks-java-io-kinesis-0.4.0-incubating-SNAPSHOT-tests.jar
No artifacts from beam_PostCommit_Java_MavenInstall » Apache Beam :: SDKs :: Java :: IO :: Kinesis #1953 to compare, so performing full copy of artifacts
[JENKINS] Archiving <https://builds.apache.org/job/beam_PostCommit_Java_MavenInstall/ws/sdks/java/io/kafka/pom.xml> to org.apache.beam/beam-sdks-java-io-kafka/0.4.0-incubating-SNAPSHOT/beam-sdks-java-io-kafka-0.4.0-incubating-SNAPSHOT.pom
[JENKINS] Archiving <https://builds.apache.org/job/beam_PostCommit_Java_MavenInstall/ws/sdks/java/io/kafka/target/beam-sdks-java-io-kafka-0.4.0-incubating-SNAPSHOT.jar> to org.apache.beam/beam-sdks-java-io-kafka/0.4.0-incubating-SNAPSHOT/beam-sdks-java-io-kafka-0.4.0-incubating-SNAPSHOT.jar
[JENKINS] Archiving <https://builds.apache.org/job/beam_PostCommit_Java_MavenInstall/ws/sdks/java/io/kafka/target/beam-sdks-java-io-kafka-0.4.0-incubating-SNAPSHOT-javadoc.jar> to org.apache.beam/beam-sdks-java-io-kafka/0.4.0-incubating-SNAPSHOT/beam-sdks-java-io-kafka-0.4.0-incubating-SNAPSHOT-javadoc.jar
[JENKINS] Archiving <https://builds.apache.org/job/beam_PostCommit_Java_MavenInstall/ws/sdks/java/io/kafka/target/beam-sdks-java-io-kafka-0.4.0-incubating-SNAPSHOT-sources.jar> to org.apache.beam/beam-sdks-java-io-kafka/0.4.0-incubating-SNAPSHOT/beam-sdks-java-io-kafka-0.4.0-incubating-SNAPSHOT-sources.jar
[JENKINS] Archiving <https://builds.apache.org/job/beam_PostCommit_Java_MavenInstall/ws/sdks/java/io/kafka/target/beam-sdks-java-io-kafka-0.4.0-incubating-SNAPSHOT-test-sources.jar> to org.apache.beam/beam-sdks-java-io-kafka/0.4.0-incubating-SNAPSHOT/beam-sdks-java-io-kafka-0.4.0-incubating-SNAPSHOT-test-sources.jar
[JENKINS] Archiving <https://builds.apache.org/job/beam_PostCommit_Java_MavenInstall/ws/sdks/java/io/kafka/target/beam-sdks-java-io-kafka-0.4.0-incubating-SNAPSHOT-tests.jar> to org.apache.beam/beam-sdks-java-io-kafka/0.4.0-incubating-SNAPSHOT/beam-sdks-java-io-kafka-0.4.0-incubating-SNAPSHOT-tests.jar
No artifacts from beam_PostCommit_Java_MavenInstall » Apache Beam :: SDKs :: Java :: IO :: Kafka #1953 to compare, so performing full copy of artifacts
[JENKINS] Archiving <https://builds.apache.org/job/beam_PostCommit_Java_MavenInstall/ws/runners/flink/runner/pom.xml> to org.apache.beam/beam-runners-flink_2.10/0.4.0-incubating-SNAPSHOT/beam-runners-flink_2.10-0.4.0-incubating-SNAPSHOT.pom
[JENKINS] Archiving <https://builds.apache.org/job/beam_PostCommit_Java_MavenInstall/ws/runners/flink/runner/target/beam-runners-flink_2.10-0.4.0-incubating-SNAPSHOT.jar> to org.apache.beam/beam-runners-flink_2.10/0.4.0-incubating-SNAPSHOT/beam-runners-flink_2.10-0.4.0-incubating-SNAPSHOT.jar
[JENKINS] Archiving <https://builds.apache.org/job/beam_PostCommit_Java_MavenInstall/ws/runners/flink/runner/target/beam-runners-flink_2.10-0.4.0-incubating-SNAPSHOT-tests.jar> to org.apache.beam/beam-runners-flink_2.10/0.4.0-incubating-SNAPSHOT/beam-runners-flink_2.10-0.4.0-incubating-SNAPSHOT-tests.jar
[JENKINS] Archiving <https://builds.apache.org/job/beam_PostCommit_Java_MavenInstall/ws/runners/flink/runner/target/beam-runners-flink_2.10-0.4.0-incubating-SNAPSHOT-javadoc.jar> to org.apache.beam/beam-runners-flink_2.10/0.4.0-incubating-SNAPSHOT/beam-runners-flink_2.10-0.4.0-incubating-SNAPSHOT-javadoc.jar
[JENKINS] Archiving <https://builds.apache.org/job/beam_PostCommit_Java_MavenInstall/ws/runners/flink/runner/target/beam-runners-flink_2.10-0.4.0-incubating-SNAPSHOT-sources.jar> to org.apache.beam/beam-runners-flink_2.10/0.4.0-incubating-SNAPSHOT/beam-runners-flink_2.10-0.4.0-incubating-SNAPSHOT-sources.jar
[JENKINS] Archiving <https://builds.apache.org/job/beam_PostCommit_Java_MavenInstall/ws/runners/flink/runner/target/beam-runners-flink_2.10-0.4.0-incubating-SNAPSHOT-test-sources.jar> to org.apache.beam/beam-runners-flink_2.10/0.4.0-incubating-SNAPSHOT/beam-runners-flink_2.10-0.4.0-incubating-SNAPSHOT-test-sources.jar
No artifacts from beam_PostCommit_Java_MavenInstall » Apache Beam :: Runners :: Flink :: Core #1953 to compare, so performing full copy of artifacts
[JENKINS] Archiving <https://builds.apache.org/job/beam_PostCommit_Java_MavenInstall/ws/sdks/java/io/google-cloud-platform/pom.xml> to org.apache.beam/beam-sdks-java-io-google-cloud-platform/0.4.0-incubating-SNAPSHOT/beam-sdks-java-io-google-cloud-platform-0.4.0-incubating-SNAPSHOT.pom
[JENKINS] Archiving <https://builds.apache.org/job/beam_PostCommit_Java_MavenInstall/ws/sdks/java/io/google-cloud-platform/target/beam-sdks-java-io-google-cloud-platform-0.4.0-incubating-SNAPSHOT.jar> to org.apache.beam/beam-sdks-java-io-google-cloud-platform/0.4.0-incubating-SNAPSHOT/beam-sdks-java-io-google-cloud-platform-0.4.0-incubating-SNAPSHOT.jar
[JENKINS] Archiving <https://builds.apache.org/job/beam_PostCommit_Java_MavenInstall/ws/sdks/java/io/google-cloud-platform/target/beam-sdks-java-io-google-cloud-platform-0.4.0-incubating-SNAPSHOT-javadoc.jar> to org.apache.beam/beam-sdks-java-io-google-cloud-platform/0.4.0-incubating-SNAPSHOT/beam-sdks-java-io-google-cloud-platform-0.4.0-incubating-SNAPSHOT-javadoc.jar
[JENKINS] Archiving <https://builds.apache.org/job/beam_PostCommit_Java_MavenInstall/ws/sdks/java/io/google-cloud-platform/target/beam-sdks-java-io-google-cloud-platform-0.4.0-incubating-SNAPSHOT-sources.jar> to org.apache.beam/beam-sdks-java-io-google-cloud-platform/0.4.0-incubating-SNAPSHOT/beam-sdks-java-io-google-cloud-platform-0.4.0-incubating-SNAPSHOT-sources.jar
[JENKINS] Archiving <https://builds.apache.org/job/beam_PostCommit_Java_MavenInstall/ws/sdks/java/io/google-cloud-platform/target/beam-sdks-java-io-google-cloud-platform-0.4.0-incubating-SNAPSHOT-test-sources.jar> to org.apache.beam/beam-sdks-java-io-google-cloud-platform/0.4.0-incubating-SNAPSHOT/beam-sdks-java-io-google-cloud-platform-0.4.0-incubating-SNAPSHOT-test-sources.jar
[JENKINS] Archiving <https://builds.apache.org/job/beam_PostCommit_Java_MavenInstall/ws/sdks/java/io/google-cloud-platform/target/beam-sdks-java-io-google-cloud-platform-0.4.0-incubating-SNAPSHOT-tests.jar> to org.apache.beam/beam-sdks-java-io-google-cloud-platform/0.4.0-incubating-SNAPSHOT/beam-sdks-java-io-google-cloud-platform-0.4.0-incubating-SNAPSHOT-tests.jar
No artifacts from beam_PostCommit_Java_MavenInstall » Apache Beam :: SDKs :: Java :: IO :: Google Cloud Platform #1953 to compare, so performing full copy of artifacts
[JENKINS] Archiving <https://builds.apache.org/job/beam_PostCommit_Java_MavenInstall/ws/sdks/java/pom.xml> to org.apache.beam/beam-sdks-java-parent/0.4.0-incubating-SNAPSHOT/beam-sdks-java-parent-0.4.0-incubating-SNAPSHOT.pom
No artifacts from beam_PostCommit_Java_MavenInstall » Apache Beam :: SDKs :: Java #1953 to compare, so performing full copy of artifacts
[JENKINS] Archiving <https://builds.apache.org/job/beam_PostCommit_Java_MavenInstall/ws/pom.xml> to org.apache.beam/beam-parent/0.4.0-incubating-SNAPSHOT/beam-parent-0.4.0-incubating-SNAPSHOT.pom
No artifacts from beam_PostCommit_Java_MavenInstall » Apache Beam :: Parent #1953 to compare, so performing full copy of artifacts
[JENKINS] Archiving <https://builds.apache.org/job/beam_PostCommit_Java_MavenInstall/ws/sdks/java/maven-archetypes/examples/pom.xml> to org.apache.beam/beam-sdks-java-maven-archetypes-examples/0.4.0-incubating-SNAPSHOT/beam-sdks-java-maven-archetypes-examples-0.4.0-incubating-SNAPSHOT.pom
[JENKINS] Archiving <https://builds.apache.org/job/beam_PostCommit_Java_MavenInstall/ws/sdks/java/maven-archetypes/examples/target/beam-sdks-java-maven-archetypes-examples-0.4.0-incubating-SNAPSHOT.jar> to org.apache.beam/beam-sdks-java-maven-archetypes-examples/0.4.0-incubating-SNAPSHOT/beam-sdks-java-maven-archetypes-examples-0.4.0-incubating-SNAPSHOT.jar
[JENKINS] Archiving <https://builds.apache.org/job/beam_PostCommit_Java_MavenInstall/ws/sdks/java/maven-archetypes/examples/target/beam-sdks-java-maven-archetypes-examples-0.4.0-incubating-SNAPSHOT-sources.jar> to org.apache.beam/beam-sdks-java-maven-archetypes-examples/0.4.0-incubating-SNAPSHOT/beam-sdks-java-maven-archetypes-examples-0.4.0-incubating-SNAPSHOT-sources.jar
[JENKINS] Archiving <https://builds.apache.org/job/beam_PostCommit_Java_MavenInstall/ws/sdks/java/maven-archetypes/examples/target/beam-sdks-java-maven-archetypes-examples-0.4.0-incubating-SNAPSHOT-test-sources.jar> to org.apache.beam/beam-sdks-java-maven-archetypes-examples/0.4.0-incubating-SNAPSHOT/beam-sdks-java-maven-archetypes-examples-0.4.0-incubating-SNAPSHOT-test-sources.jar
No artifacts from beam_PostCommit_Java_MavenInstall » Apache Beam :: SDKs :: Java :: Maven Archetypes :: Examples #1953 to compare, so performing full copy of artifacts
[JENKINS] Archiving <https://builds.apache.org/job/beam_PostCommit_Java_MavenInstall/ws/runners/spark/pom.xml> to org.apache.beam/beam-runners-spark/0.4.0-incubating-SNAPSHOT/beam-runners-spark-0.4.0-incubating-SNAPSHOT.pom
[JENKINS] Archiving <https://builds.apache.org/job/beam_PostCommit_Java_MavenInstall/ws/runners/spark/target/beam-runners-spark-0.4.0-incubating-SNAPSHOT.jar> to org.apache.beam/beam-runners-spark/0.4.0-incubating-SNAPSHOT/beam-runners-spark-0.4.0-incubating-SNAPSHOT.jar
[JENKINS] Archiving <https://builds.apache.org/job/beam_PostCommit_Java_MavenInstall/ws/runners/spark/target/beam-runners-spark-0.4.0-incubating-SNAPSHOT-javadoc.jar> to org.apache.beam/beam-runners-spark/0.4.0-incubating-SNAPSHOT/beam-runners-spark-0.4.0-incubating-SNAPSHOT-javadoc.jar
[JENKINS] Archiving <https://builds.apache.org/job/beam_PostCommit_Java_MavenInstall/ws/runners/spark/target/beam-runners-spark-0.4.0-incubating-SNAPSHOT-sources.jar> to org.apache.beam/beam-runners-spark/0.4.0-incubating-SNAPSHOT/beam-runners-spark-0.4.0-incubating-SNAPSHOT-sources.jar
[JENKINS] Archiving <https://builds.apache.org/job/beam_PostCommit_Java_MavenInstall/ws/runners/spark/target/beam-runners-spark-0.4.0-incubating-SNAPSHOT-test-sources.jar> to org.apache.beam/beam-runners-spark/0.4.0-incubating-SNAPSHOT/beam-runners-spark-0.4.0-incubating-SNAPSHOT-test-sources.jar
[JENKINS] Archiving <https://builds.apache.org/job/beam_PostCommit_Java_MavenInstall/ws/runners/spark/target/beam-runners-spark-0.4.0-incubating-SNAPSHOT-tests.jar> to org.apache.beam/beam-runners-spark/0.4.0-incubating-SNAPSHOT/beam-runners-spark-0.4.0-incubating-SNAPSHOT-tests.jar
[JENKINS] Archiving <https://builds.apache.org/job/beam_PostCommit_Java_MavenInstall/ws/runners/spark/target/beam-runners-spark-0.4.0-incubating-SNAPSHOT-spark-app.jar> to org.apache.beam/beam-runners-spark/0.4.0-incubating-SNAPSHOT/beam-runners-spark-0.4.0-incubating-SNAPSHOT-spark-app.jar
No artifacts from beam_PostCommit_Java_MavenInstall » Apache Beam :: Runners :: Spark #1953 to compare, so performing full copy of artifacts
[JENKINS] Archiving <https://builds.apache.org/job/beam_PostCommit_Java_MavenInstall/ws/sdks/java/io/hdfs/pom.xml> to org.apache.beam/beam-sdks-java-io-hdfs/0.4.0-incubating-SNAPSHOT/beam-sdks-java-io-hdfs-0.4.0-incubating-SNAPSHOT.pom
[JENKINS] Archiving <https://builds.apache.org/job/beam_PostCommit_Java_MavenInstall/ws/sdks/java/io/hdfs/target/beam-sdks-java-io-hdfs-0.4.0-incubating-SNAPSHOT.jar> to org.apache.beam/beam-sdks-java-io-hdfs/0.4.0-incubating-SNAPSHOT/beam-sdks-java-io-hdfs-0.4.0-incubating-SNAPSHOT.jar
[JENKINS] Archiving <https://builds.apache.org/job/beam_PostCommit_Java_MavenInstall/ws/sdks/java/io/hdfs/target/beam-sdks-java-io-hdfs-0.4.0-incubating-SNAPSHOT-javadoc.jar> to org.apache.beam/beam-sdks-java-io-hdfs/0.4.0-incubating-SNAPSHOT/beam-sdks-java-io-hdfs-0.4.0-incubating-SNAPSHOT-javadoc.jar
[JENKINS] Archiving <https://builds.apache.org/job/beam_PostCommit_Java_MavenInstall/ws/sdks/java/io/hdfs/target/beam-sdks-java-io-hdfs-0.4.0-incubating-SNAPSHOT-sources.jar> to org.apache.beam/beam-sdks-java-io-hdfs/0.4.0-incubating-SNAPSHOT/beam-sdks-java-io-hdfs-0.4.0-incubating-SNAPSHOT-sources.jar
[JENKINS] Archiving <https://builds.apache.org/job/beam_PostCommit_Java_MavenInstall/ws/sdks/java/io/hdfs/target/beam-sdks-java-io-hdfs-0.4.0-incubating-SNAPSHOT-test-sources.jar> to org.apache.beam/beam-sdks-java-io-hdfs/0.4.0-incubating-SNAPSHOT/beam-sdks-java-io-hdfs-0.4.0-incubating-SNAPSHOT-test-sources.jar
[JENKINS] Archiving <https://builds.apache.org/job/beam_PostCommit_Java_MavenInstall/ws/sdks/java/io/hdfs/target/beam-sdks-java-io-hdfs-0.4.0-incubating-SNAPSHOT-tests.jar> to org.apache.beam/beam-sdks-java-io-hdfs/0.4.0-incubating-SNAPSHOT/beam-sdks-java-io-hdfs-0.4.0-incubating-SNAPSHOT-tests.jar
No artifacts from beam_PostCommit_Java_MavenInstall » Apache Beam :: SDKs :: Java :: IO :: HDFS #1953 to compare, so performing full copy of artifacts
[JENKINS] Archiving <https://builds.apache.org/job/beam_PostCommit_Java_MavenInstall/ws/sdks/java/maven-archetypes/pom.xml> to org.apache.beam/beam-sdks-java-maven-archetypes-parent/0.4.0-incubating-SNAPSHOT/beam-sdks-java-maven-archetypes-parent-0.4.0-incubating-SNAPSHOT.pom
No artifacts from beam_PostCommit_Java_MavenInstall » Apache Beam :: SDKs :: Java :: Maven Archetypes #1953 to compare, so performing full copy of artifacts
[JENKINS] Archiving <https://builds.apache.org/job/beam_PostCommit_Java_MavenInstall/ws/runners/google-cloud-dataflow-java/dependency-reduced-pom.xml> to org.apache.beam/beam-runners-google-cloud-dataflow-java/0.4.0-incubating-SNAPSHOT/beam-runners-google-cloud-dataflow-java-0.4.0-incubating-SNAPSHOT.pom
[JENKINS] Archiving <https://builds.apache.org/job/beam_PostCommit_Java_MavenInstall/ws/runners/google-cloud-dataflow-java/target/beam-runners-google-cloud-dataflow-java-0.4.0-incubating-SNAPSHOT.jar> to org.apache.beam/beam-runners-google-cloud-dataflow-java/0.4.0-incubating-SNAPSHOT/beam-runners-google-cloud-dataflow-java-0.4.0-incubating-SNAPSHOT.jar
[JENKINS] Archiving <https://builds.apache.org/job/beam_PostCommit_Java_MavenInstall/ws/runners/google-cloud-dataflow-java/target/beam-runners-google-cloud-dataflow-java-0.4.0-incubating-SNAPSHOT-javadoc.jar> to org.apache.beam/beam-runners-google-cloud-dataflow-java/0.4.0-incubating-SNAPSHOT/beam-runners-google-cloud-dataflow-java-0.4.0-incubating-SNAPSHOT-javadoc.jar
[JENKINS] Archiving <https://builds.apache.org/job/beam_PostCommit_Java_MavenInstall/ws/runners/google-cloud-dataflow-java/target/beam-runners-google-cloud-dataflow-java-0.4.0-incubating-SNAPSHOT-sources.jar> to org.apache.beam/beam-runners-google-cloud-dataflow-java/0.4.0-incubating-SNAPSHOT/beam-runners-google-cloud-dataflow-java-0.4.0-incubating-SNAPSHOT-sources.jar
[JENKINS] Archiving <https://builds.apache.org/job/beam_PostCommit_Java_MavenInstall/ws/runners/google-cloud-dataflow-java/target/beam-runners-google-cloud-dataflow-java-0.4.0-incubating-SNAPSHOT-test-sources.jar> to org.apache.beam/beam-runners-google-cloud-dataflow-java/0.4.0-incubating-SNAPSHOT/beam-runners-google-cloud-dataflow-java-0.4.0-incubating-SNAPSHOT-test-sources.jar
[JENKINS] Archiving <https://builds.apache.org/job/beam_PostCommit_Java_MavenInstall/ws/runners/google-cloud-dataflow-java/target/beam-runners-google-cloud-dataflow-java-0.4.0-incubating-SNAPSHOT-tests.jar> to org.apache.beam/beam-runners-google-cloud-dataflow-java/0.4.0-incubating-SNAPSHOT/beam-runners-google-cloud-dataflow-java-0.4.0-incubating-SNAPSHOT-tests.jar
No artifacts from beam_PostCommit_Java_MavenInstall » Apache Beam :: Runners :: Google Cloud Dataflow #1953 to compare, so performing full copy of artifacts
[JENKINS] Archiving <https://builds.apache.org/job/beam_PostCommit_Java_MavenInstall/ws/runners/apex/pom.xml> to org.apache.beam/beam-runners-apex/0.4.0-incubating-SNAPSHOT/beam-runners-apex-0.4.0-incubating-SNAPSHOT.pom
[JENKINS] Archiving <https://builds.apache.org/job/beam_PostCommit_Java_MavenInstall/ws/runners/apex/target/beam-runners-apex-0.4.0-incubating-SNAPSHOT.jar> to org.apache.beam/beam-runners-apex/0.4.0-incubating-SNAPSHOT/beam-runners-apex-0.4.0-incubating-SNAPSHOT.jar
[JENKINS] Archiving <https://builds.apache.org/job/beam_PostCommit_Java_MavenInstall/ws/runners/apex/target/beam-runners-apex-0.4.0-incubating-SNAPSHOT-javadoc.jar> to org.apache.beam/beam-runners-apex/0.4.0-incubating-SNAPSHOT/beam-runners-apex-0.4.0-incubating-SNAPSHOT-javadoc.jar
[JENKINS] Archiving <https://builds.apache.org/job/beam_PostCommit_Java_MavenInstall/ws/runners/apex/target/beam-runners-apex-0.4.0-incubating-SNAPSHOT-sources.jar> to org.apache.beam/beam-runners-apex/0.4.0-incubating-SNAPSHOT/beam-runners-apex-0.4.0-incubating-SNAPSHOT-sources.jar
[JENKINS] Archiving <https://builds.apache.org/job/beam_PostCommit_Java_MavenInstall/ws/runners/apex/target/beam-runners-apex-0.4.0-incubating-SNAPSHOT-test-sources.jar> to org.apache.beam/beam-runners-apex/0.4.0-incubating-SNAPSHOT/beam-runners-apex-0.4.0-incubating-SNAPSHOT-test-sources.jar
[JENKINS] Archiving <https://builds.apache.org/job/beam_PostCommit_Java_MavenInstall/ws/runners/apex/target/beam-runners-apex-0.4.0-incubating-SNAPSHOT-tests.jar> to org.apache.beam/beam-runners-apex/0.4.0-incubating-SNAPSHOT/beam-runners-apex-0.4.0-incubating-SNAPSHOT-tests.jar
No artifacts from beam_PostCommit_Java_MavenInstall » Apache Beam :: Runners :: Apex #1953 to compare, so performing full copy of artifacts
[JENKINS] Archiving <https://builds.apache.org/job/beam_PostCommit_Java_MavenInstall/ws/sdks/java/io/jms/pom.xml> to org.apache.beam/beam-sdks-java-io-jms/0.4.0-incubating-SNAPSHOT/beam-sdks-java-io-jms-0.4.0-incubating-SNAPSHOT.pom
[JENKINS] Archiving <https://builds.apache.org/job/beam_PostCommit_Java_MavenInstall/ws/sdks/java/io/jms/target/beam-sdks-java-io-jms-0.4.0-incubating-SNAPSHOT.jar> to org.apache.beam/beam-sdks-java-io-jms/0.4.0-incubating-SNAPSHOT/beam-sdks-java-io-jms-0.4.0-incubating-SNAPSHOT.jar
[JENKINS] Archiving <https://builds.apache.org/job/beam_PostCommit_Java_MavenInstall/ws/sdks/java/io/jms/target/beam-sdks-java-io-jms-0.4.0-incubating-SNAPSHOT-javadoc.jar> to org.apache.beam/beam-sdks-java-io-jms/0.4.0-incubating-SNAPSHOT/beam-sdks-java-io-jms-0.4.0-incubating-SNAPSHOT-javadoc.jar
[JENKINS] Archiving <https://builds.apache.org/job/beam_PostCommit_Java_MavenInstall/ws/sdks/java/io/jms/target/beam-sdks-java-io-jms-0.4.0-incubating-SNAPSHOT-sources.jar> to org.apache.beam/beam-sdks-java-io-jms/0.4.0-incubating-SNAPSHOT/beam-sdks-java-io-jms-0.4.0-incubating-SNAPSHOT-sources.jar
[JENKINS] Archiving <https://builds.apache.org/job/beam_PostCommit_Java_MavenInstall/ws/sdks/java/io/jms/target/beam-sdks-java-io-jms-0.4.0-incubating-SNAPSHOT-test-sources.jar> to org.apache.beam/beam-sdks-java-io-jms/0.4.0-incubating-SNAPSHOT/beam-sdks-java-io-jms-0.4.0-incubating-SNAPSHOT-test-sources.jar
[JENKINS] Archiving <https://builds.apache.org/job/beam_PostCommit_Java_MavenInstall/ws/sdks/java/io/jms/target/beam-sdks-java-io-jms-0.4.0-incubating-SNAPSHOT-tests.jar> to org.apache.beam/beam-sdks-java-io-jms/0.4.0-incubating-SNAPSHOT/beam-sdks-java-io-jms-0.4.0-incubating-SNAPSHOT-tests.jar
No artifacts from beam_PostCommit_Java_MavenInstall » Apache Beam :: SDKs :: Java :: IO :: JMS #1953 to compare, so performing full copy of artifacts
[JENKINS] Archiving <https://builds.apache.org/job/beam_PostCommit_Java_MavenInstall/ws/runners/flink/pom.xml> to org.apache.beam/beam-runners-flink-parent/0.4.0-incubating-SNAPSHOT/beam-runners-flink-parent-0.4.0-incubating-SNAPSHOT.pom
No artifacts from beam_PostCommit_Java_MavenInstall » Apache Beam :: Runners :: Flink #1953 to compare, so performing full copy of artifacts
[JENKINS] Archiving <https://builds.apache.org/job/beam_PostCommit_Java_MavenInstall/ws/sdks/java/io/mongodb/pom.xml> to org.apache.beam/beam-sdks-java-io-mongodb/0.4.0-incubating-SNAPSHOT/beam-sdks-java-io-mongodb-0.4.0-incubating-SNAPSHOT.pom
[JENKINS] Archiving <https://builds.apache.org/job/beam_PostCommit_Java_MavenInstall/ws/sdks/java/io/mongodb/target/beam-sdks-java-io-mongodb-0.4.0-incubating-SNAPSHOT.jar> to org.apache.beam/beam-sdks-java-io-mongodb/0.4.0-incubating-SNAPSHOT/beam-sdks-java-io-mongodb-0.4.0-incubating-SNAPSHOT.jar
[JENKINS] Archiving <https://builds.apache.org/job/beam_PostCommit_Java_MavenInstall/ws/sdks/java/io/mongodb/target/beam-sdks-java-io-mongodb-0.4.0-incubating-SNAPSHOT-javadoc.jar> to org.apache.beam/beam-sdks-java-io-mongodb/0.4.0-incubating-SNAPSHOT/beam-sdks-java-io-mongodb-0.4.0-incubating-SNAPSHOT-javadoc.jar
[JENKINS] Archiving <https://builds.apache.org/job/beam_PostCommit_Java_MavenInstall/ws/sdks/java/io/mongodb/target/beam-sdks-java-io-mongodb-0.4.0-incubating-SNAPSHOT-sources.jar> to org.apache.beam/beam-sdks-java-io-mongodb/0.4.0-incubating-SNAPSHOT/beam-sdks-java-io-mongodb-0.4.0-incubating-SNAPSHOT-sources.jar
[JENKINS] Archiving <https://builds.apache.org/job/beam_PostCommit_Java_MavenInstall/ws/sdks/java/io/mongodb/target/beam-sdks-java-io-mongodb-0.4.0-incubating-SNAPSHOT-test-sources.jar> to org.apache.beam/beam-sdks-java-io-mongodb/0.4.0-incubating-SNAPSHOT/beam-sdks-java-io-mongodb-0.4.0-incubating-SNAPSHOT-test-sources.jar
[JENKINS] Archiving <https://builds.apache.org/job/beam_PostCommit_Java_MavenInstall/ws/sdks/java/io/mongodb/target/beam-sdks-java-io-mongodb-0.4.0-incubating-SNAPSHOT-tests.jar> to org.apache.beam/beam-sdks-java-io-mongodb/0.4.0-incubating-SNAPSHOT/beam-sdks-java-io-mongodb-0.4.0-incubating-SNAPSHOT-tests.jar
No artifacts from beam_PostCommit_Java_MavenInstall » Apache Beam :: SDKs :: Java :: IO :: MongoDB #1953 to compare, so performing full copy of artifacts
[JENKINS] Archiving <https://builds.apache.org/job/beam_PostCommit_Java_MavenInstall/ws/sdks/java/extensions/sorter/dependency-reduced-pom.xml> to org.apache.beam/beam-sdks-java-extensions-sorter/0.4.0-incubating-SNAPSHOT/beam-sdks-java-extensions-sorter-0.4.0-incubating-SNAPSHOT.pom
[JENKINS] Archiving <https://builds.apache.org/job/beam_PostCommit_Java_MavenInstall/ws/sdks/java/extensions/sorter/target/beam-sdks-java-extensions-sorter-0.4.0-incubating-SNAPSHOT.jar> to org.apache.beam/beam-sdks-java-extensions-sorter/0.4.0-incubating-SNAPSHOT/beam-sdks-java-extensions-sorter-0.4.0-incubating-SNAPSHOT.jar
[JENKINS] Archiving <https://builds.apache.org/job/beam_PostCommit_Java_MavenInstall/ws/sdks/java/extensions/sorter/target/beam-sdks-java-extensions-sorter-0.4.0-incubating-SNAPSHOT-javadoc.jar> to org.apache.beam/beam-sdks-java-extensions-sorter/0.4.0-incubating-SNAPSHOT/beam-sdks-java-extensions-sorter-0.4.0-incubating-SNAPSHOT-javadoc.jar
[JENKINS] Archiving <https://builds.apache.org/job/beam_PostCommit_Java_MavenInstall/ws/sdks/java/extensions/sorter/target/beam-sdks-java-extensions-sorter-0.4.0-incubating-SNAPSHOT-sources.jar> to org.apache.beam/beam-sdks-java-extensions-sorter/0.4.0-incubating-SNAPSHOT/beam-sdks-java-extensions-sorter-0.4.0-incubating-SNAPSHOT-sources.jar
[JENKINS] Archiving <https://builds.apache.org/job/beam_PostCommit_Java_MavenInstall/ws/sdks/java/extensions/sorter/target/beam-sdks-java-extensions-sorter-0.4.0-incubating-SNAPSHOT-test-sources.jar> to org.apache.beam/beam-sdks-java-extensions-sorter/0.4.0-incubating-SNAPSHOT/beam-sdks-java-extensions-sorter-0.4.0-incubating-SNAPSHOT-test-sources.jar
[JENKINS] Archiving <https://builds.apache.org/job/beam_PostCommit_Java_MavenInstall/ws/sdks/java/extensions/sorter/target/beam-sdks-java-extensions-sorter-0.4.0-incubating-SNAPSHOT-tests.jar> to org.apache.beam/beam-sdks-java-extensions-sorter/0.4.0-incubating-SNAPSHOT/beam-sdks-java-extensions-sorter-0.4.0-incubating-SNAPSHOT-tests.jar
No artifacts from beam_PostCommit_Java_MavenInstall » Apache Beam :: SDKs :: Java :: Extensions :: Sorter #1953 to compare, so performing full copy of artifacts
[JENKINS] Archiving <https://builds.apache.org/job/beam_PostCommit_Java_MavenInstall/ws/sdks/pom.xml> to org.apache.beam/beam-sdks-parent/0.4.0-incubating-SNAPSHOT/beam-sdks-parent-0.4.0-incubating-SNAPSHOT.pom
No artifacts from beam_PostCommit_Java_MavenInstall » Apache Beam :: SDKs #1953 to compare, so performing full copy of artifacts
[JENKINS] Archiving <https://builds.apache.org/job/beam_PostCommit_Java_MavenInstall/ws/sdks/java/extensions/join-library/pom.xml> to org.apache.beam/beam-sdks-java-extensions-join-library/0.4.0-incubating-SNAPSHOT/beam-sdks-java-extensions-join-library-0.4.0-incubating-SNAPSHOT.pom
[JENKINS] Archiving <https://builds.apache.org/job/beam_PostCommit_Java_MavenInstall/ws/sdks/java/extensions/join-library/target/beam-sdks-java-extensions-join-library-0.4.0-incubating-SNAPSHOT.jar> to org.apache.beam/beam-sdks-java-extensions-join-library/0.4.0-incubating-SNAPSHOT/beam-sdks-java-extensions-join-library-0.4.0-incubating-SNAPSHOT.jar
[JENKINS] Archiving <https://builds.apache.org/job/beam_PostCommit_Java_MavenInstall/ws/sdks/java/extensions/join-library/target/beam-sdks-java-extensions-join-library-0.4.0-incubating-SNAPSHOT-javadoc.jar> to org.apache.beam/beam-sdks-java-extensions-join-library/0.4.0-incubating-SNAPSHOT/beam-sdks-java-extensions-join-library-0.4.0-incubating-SNAPSHOT-javadoc.jar
[JENKINS] Archiving <https://builds.apache.org/job/beam_PostCommit_Java_MavenInstall/ws/sdks/java/extensions/join-library/target/beam-sdks-java-extensions-join-library-0.4.0-incubating-SNAPSHOT-sources.jar> to org.apache.beam/beam-sdks-java-extensions-join-library/0.4.0-incubating-SNAPSHOT/beam-sdks-java-extensions-join-library-0.4.0-incubating-SNAPSHOT-sources.jar
[JENKINS] Archiving <https://builds.apache.org/job/beam_PostCommit_Java_MavenInstall/ws/sdks/java/extensions/join-library/target/beam-sdks-java-extensions-join-library-0.4.0-incubating-SNAPSHOT-test-sources.jar> to org.apache.beam/beam-sdks-java-extensions-join-library/0.4.0-incubating-SNAPSHOT/beam-sdks-java-extensions-join-library-0.4.0-incubating-SNAPSHOT-test-sources.jar
[JENKINS] Archiving <https://builds.apache.org/job/beam_PostCommit_Java_MavenInstall/ws/sdks/java/extensions/join-library/target/beam-sdks-java-extensions-join-library-0.4.0-incubating-SNAPSHOT-tests.jar> to org.apache.beam/beam-sdks-java-extensions-join-library/0.4.0-incubating-SNAPSHOT/beam-sdks-java-extensions-join-library-0.4.0-incubating-SNAPSHOT-tests.jar
No artifacts from beam_PostCommit_Java_MavenInstall » Apache Beam :: SDKs :: Java :: Extensions :: Join library #1953 to compare, so performing full copy of artifacts
[JENKINS] Archiving <https://builds.apache.org/job/beam_PostCommit_Java_MavenInstall/ws/runners/pom.xml> to org.apache.beam/beam-runners-parent/0.4.0-incubating-SNAPSHOT/beam-runners-parent-0.4.0-incubating-SNAPSHOT.pom
No artifacts from beam_PostCommit_Java_MavenInstall » Apache Beam :: Runners #1953 to compare, so performing full copy of artifacts
[JENKINS] Archiving <https://builds.apache.org/job/beam_PostCommit_Java_MavenInstall/ws/sdks/java/io/jdbc/pom.xml> to org.apache.beam/beam-sdks-java-io-jdbc/0.4.0-incubating-SNAPSHOT/beam-sdks-java-io-jdbc-0.4.0-incubating-SNAPSHOT.pom
[JENKINS] Archiving <https://builds.apache.org/job/beam_PostCommit_Java_MavenInstall/ws/sdks/java/io/jdbc/target/beam-sdks-java-io-jdbc-0.4.0-incubating-SNAPSHOT.jar> to org.apache.beam/beam-sdks-java-io-jdbc/0.4.0-incubating-SNAPSHOT/beam-sdks-java-io-jdbc-0.4.0-incubating-SNAPSHOT.jar
[JENKINS] Archiving <https://builds.apache.org/job/beam_PostCommit_Java_MavenInstall/ws/sdks/java/io/jdbc/target/beam-sdks-java-io-jdbc-0.4.0-incubating-SNAPSHOT-javadoc.jar> to org.apache.beam/beam-sdks-java-io-jdbc/0.4.0-incubating-SNAPSHOT/beam-sdks-java-io-jdbc-0.4.0-incubating-SNAPSHOT-javadoc.jar
[JENKINS] Archiving <https://builds.apache.org/job/beam_PostCommit_Java_MavenInstall/ws/sdks/java/io/jdbc/target/beam-sdks-java-io-jdbc-0.4.0-incubating-SNAPSHOT-sources.jar> to org.apache.beam/beam-sdks-java-io-jdbc/0.4.0-incubating-SNAPSHOT/beam-sdks-java-io-jdbc-0.4.0-incubating-SNAPSHOT-sources.jar
[JENKINS] Archiving <https://builds.apache.org/job/beam_PostCommit_Java_MavenInstall/ws/sdks/java/io/jdbc/target/beam-sdks-java-io-jdbc-0.4.0-incubating-SNAPSHOT-test-sources.jar> to org.apache.beam/beam-sdks-java-io-jdbc/0.4.0-incubating-SNAPSHOT/beam-sdks-java-io-jdbc-0.4.0-incubating-SNAPSHOT-test-sources.jar
[JENKINS] Archiving <https://builds.apache.org/job/beam_PostCommit_Java_MavenInstall/ws/sdks/java/io/jdbc/target/beam-sdks-java-io-jdbc-0.4.0-incubating-SNAPSHOT-tests.jar> to org.apache.beam/beam-sdks-java-io-jdbc/0.4.0-incubating-SNAPSHOT/beam-sdks-java-io-jdbc-0.4.0-incubating-SNAPSHOT-tests.jar
No artifacts from beam_PostCommit_Java_MavenInstall » Apache Beam :: SDKs :: Java :: IO :: JDBC #1953 to compare, so performing full copy of artifacts
[JENKINS] Archiving <https://builds.apache.org/job/beam_PostCommit_Java_MavenInstall/ws/sdks/java/extensions/pom.xml> to org.apache.beam/beam-sdks-java-extensions-parent/0.4.0-incubating-SNAPSHOT/beam-sdks-java-extensions-parent-0.4.0-incubating-SNAPSHOT.pom
No artifacts from beam_PostCommit_Java_MavenInstall » Apache Beam :: SDKs :: Java :: Extensions #1953 to compare, so performing full copy of artifacts
[JENKINS] Archiving <https://builds.apache.org/job/beam_PostCommit_Java_MavenInstall/ws/examples/pom.xml> to org.apache.beam/beam-examples-parent/0.4.0-incubating-SNAPSHOT/beam-examples-parent-0.4.0-incubating-SNAPSHOT.pom
No artifacts from beam_PostCommit_Java_MavenInstall » Apache Beam :: Examples #1953 to compare, so performing full copy of artifacts
channel stopped

Mime
View raw message