beam-commits mailing list archives

Site index · List index
Message view « Date » · « Thread »
Top « Date » · « Thread »
From Apache Jenkins Server <jenk...@builds.apache.org>
Subject Build failed in Jenkins: beam_PostCommit_Java_MavenInstall #2174
Date Tue, 20 Dec 2016 00:18:09 GMT
See <https://builds.apache.org/job/beam_PostCommit_Java_MavenInstall/2174/>

------------------------------------------
[...truncated 9041 lines...]
     [java] 	at com.sun.org.apache.xerces.internal.parsers.XML11Configuration.parse(XML11Configuration.java:841)
     [java] 	at com.sun.org.apache.xerces.internal.parsers.XML11Configuration.parse(XML11Configuration.java:770)
     [java] 	at com.sun.org.apache.xerces.internal.parsers.XMLParser.parse(XMLParser.java:141)
     [java] 	at com.sun.org.apache.xerces.internal.parsers.AbstractSAXParser.parse(AbstractSAXParser.java:1213)
     [java] 	at edu.umd.cs.findbugs.filter.Filter.parse(Filter.java:226)
     [java] 	at edu.umd.cs.findbugs.filter.Filter.parse(Filter.java:207)
     [java] 	at edu.umd.cs.findbugs.filter.Filter.<init>(Filter.java:132)
     [java] 	at edu.umd.cs.findbugs.FindBugs.configureFilter(FindBugs.java:516)
     [java] 	at edu.umd.cs.findbugs.FindBugs2.addFilter(FindBugs2.java:374)
     [java] 	at edu.umd.cs.findbugs.FindBugs2.configureFilters(FindBugs2.java:521)
     [java] 	at edu.umd.cs.findbugs.FindBugs2.setUserPreferences(FindBugs2.java:475)
     [java] 	at edu.umd.cs.findbugs.TextUICommandLine.configureEngine(TextUICommandLine.java:685)
     [java] 	at edu.umd.cs.findbugs.FindBugs.processCommandLine(FindBugs.java:361)
     [java] 	at edu.umd.cs.findbugs.FindBugs2.main(FindBugs2.java:1188)
     [java] Caused by: java.lang.ClassNotFoundException: org.apache.commons.lang.StringEscapeUtils
     [java] 	at java.net.URLClassLoader.findClass(URLClassLoader.java:381)
     [java] 	at java.lang.ClassLoader.loadClass(ClassLoader.java:424)
     [java] 	at sun.misc.Launcher$AppClassLoader.loadClass(Launcher.java:331)
     [java] 	at java.lang.ClassLoader.loadClass(ClassLoader.java:357)
     [java] 	... 25 more
[WARNING] Cannot calculate digest of mojo class, because mojo wasn't loaded from a jar, but
from: <https://builds.apache.org/job/beam_PostCommit_Java_MavenInstall/ws/.repository/org/codehaus/mojo/findbugs-maven-plugin/3.0.1/findbugs-maven-plugin-3.0.1.jar>
[WARNING] Cannot calculate digest of mojo class, because mojo wasn't loaded from a jar, but
from: <https://builds.apache.org/job/beam_PostCommit_Java_MavenInstall/ws/.repository/org/codehaus/mojo/findbugs-maven-plugin/3.0.1/findbugs-maven-plugin-3.0.1.jar>
[WARNING] Cannot calculate digest of mojo class, because mojo wasn't loaded from a jar, but
from: <https://builds.apache.org/job/beam_PostCommit_Java_MavenInstall/ws/.repository/org/codehaus/mojo/findbugs-maven-plugin/3.0.1/findbugs-maven-plugin-3.0.1.jar>
2016-12-20T00:17:50.333 [INFO] ------------------------------------------------------------------------
2016-12-20T00:17:50.333 [INFO] Reactor Summary:
2016-12-20T00:17:50.333 [INFO] 
2016-12-20T00:17:50.333 [INFO] Apache Beam :: Parent .............................. SUCCESS
[ 23.778 s]
2016-12-20T00:17:50.333 [INFO] Apache Beam :: SDKs :: Java :: Build Tools ......... SUCCESS
[  3.756 s]
2016-12-20T00:17:50.333 [INFO] Apache Beam :: SDKs ................................ SUCCESS
[  6.421 s]
2016-12-20T00:17:50.333 [INFO] Apache Beam :: SDKs :: Java ........................ SUCCESS
[  1.432 s]
2016-12-20T00:17:50.333 [INFO] Apache Beam :: SDKs :: Java :: Core ................ SUCCESS
[02:48 min]
2016-12-20T00:17:50.333 [INFO] Apache Beam :: Runners ............................. SUCCESS
[  1.666 s]
2016-12-20T00:17:50.333 [INFO] Apache Beam :: Runners :: Core Java ................ SUCCESS
[ 34.695 s]
2016-12-20T00:17:50.333 [INFO] Apache Beam :: Runners :: Direct Java .............. SUCCESS
[01:58 min]
2016-12-20T00:17:50.333 [INFO] Apache Beam :: Runners :: Google Cloud Dataflow .... SUCCESS
[ 23.420 s]
2016-12-20T00:17:50.333 [INFO] Apache Beam :: SDKs :: Java :: IO .................. SUCCESS
[  1.265 s]
2016-12-20T00:17:50.333 [INFO] Apache Beam :: SDKs :: Java :: IO :: Google Cloud Platform
SUCCESS [05:54 min]
2016-12-20T00:17:50.333 [INFO] Apache Beam :: SDKs :: Java :: IO :: HDFS .......... SUCCESS
[ 35.459 s]
2016-12-20T00:17:50.333 [INFO] Apache Beam :: SDKs :: Java :: IO :: JMS ........... SUCCESS
[ 15.818 s]
2016-12-20T00:17:50.333 [INFO] Apache Beam :: SDKs :: Java :: IO :: Kafka ......... SUCCESS
[ 15.160 s]
2016-12-20T00:17:50.333 [INFO] Apache Beam :: SDKs :: Java :: IO :: Kinesis ....... SUCCESS
[ 18.293 s]
2016-12-20T00:17:50.333 [INFO] Apache Beam :: SDKs :: Java :: IO :: MongoDB ....... SUCCESS
[ 28.662 s]
2016-12-20T00:17:50.333 [INFO] Apache Beam :: SDKs :: Java :: IO :: JDBC .......... SUCCESS
[ 19.756 s]
2016-12-20T00:17:50.333 [INFO] Apache Beam :: SDKs :: Java :: Maven Archetypes .... SUCCESS
[  1.650 s]
2016-12-20T00:17:50.333 [INFO] Apache Beam :: SDKs :: Java :: Maven Archetypes :: Starter
SUCCESS [ 15.322 s]
2016-12-20T00:17:50.333 [INFO] Apache Beam :: SDKs :: Java :: Maven Archetypes :: Examples
SUCCESS [ 12.919 s]
2016-12-20T00:17:50.333 [INFO] Apache Beam :: SDKs :: Java :: Maven Archetypes :: Examples
- Java 8 SUCCESS [ 17.166 s]
2016-12-20T00:17:50.333 [INFO] Apache Beam :: SDKs :: Java :: Extensions .......... SUCCESS
[  1.271 s]
2016-12-20T00:17:50.333 [INFO] Apache Beam :: SDKs :: Java :: Extensions :: Join library SUCCESS
[ 11.194 s]
2016-12-20T00:17:50.334 [INFO] Apache Beam :: SDKs :: Java :: Extensions :: Sorter  FAILURE
[  4.071 s]
2016-12-20T00:17:50.334 [INFO] Apache Beam :: SDKs :: Java :: Java 8 Tests ........ SKIPPED
2016-12-20T00:17:50.334 [INFO] Apache Beam :: Runners :: Flink .................... SKIPPED
2016-12-20T00:17:50.334 [INFO] Apache Beam :: Runners :: Flink :: Core ............ SKIPPED
2016-12-20T00:17:50.334 [INFO] Apache Beam :: Runners :: Flink :: Examples ........ SKIPPED
2016-12-20T00:17:50.334 [INFO] Apache Beam :: Runners :: Spark .................... SKIPPED
2016-12-20T00:17:50.334 [INFO] Apache Beam :: Runners :: Apex ..................... SKIPPED
2016-12-20T00:17:50.334 [INFO] Apache Beam :: Examples ............................ SKIPPED
2016-12-20T00:17:50.334 [INFO] Apache Beam :: Examples :: Java .................... SKIPPED
2016-12-20T00:17:50.334 [INFO] Apache Beam :: Examples :: Java 8 .................. SKIPPED
2016-12-20T00:17:50.334 [INFO] ------------------------------------------------------------------------
2016-12-20T00:17:50.334 [INFO] BUILD FAILURE
2016-12-20T00:17:50.334 [INFO] ------------------------------------------------------------------------
2016-12-20T00:17:50.334 [INFO] Total time: 16:12 min
2016-12-20T00:17:50.334 [INFO] Finished at: 2016-12-20T00:17:50+00:00
2016-12-20T00:17:51.007 [INFO] Final Memory: 161M/1374M
2016-12-20T00:17:51.007 [INFO] ------------------------------------------------------------------------
2016-12-20T00:17:51.012 [ERROR] Failed to execute goal org.codehaus.mojo:findbugs-maven-plugin:3.0.1:findbugs
(findbugs) on project beam-sdks-java-extensions-sorter: Execution findbugs of goal org.codehaus.mojo:findbugs-maven-plugin:3.0.1:findbugs
failed: Java returned: 1 -> [Help 1]
org.apache.maven.lifecycle.LifecycleExecutionException: Failed to execute goal org.codehaus.mojo:findbugs-maven-plugin:3.0.1:findbugs
(findbugs) on project beam-sdks-java-extensions-sorter: Execution findbugs of goal org.codehaus.mojo:findbugs-maven-plugin:3.0.1:findbugs
failed: Java returned: 1
	at org.apache.maven.lifecycle.internal.MojoExecutor.execute(MojoExecutor.java:224)
	at org.apache.maven.lifecycle.internal.MojoExecutor.execute(MojoExecutor.java:153)
	at org.apache.maven.lifecycle.internal.MojoExecutor.execute(MojoExecutor.java:145)
	at org.apache.maven.lifecycle.internal.MojoExecutor.executeForkedExecutions(MojoExecutor.java:364)
	at org.apache.maven.lifecycle.internal.MojoExecutor.execute(MojoExecutor.java:198)
	at org.apache.maven.lifecycle.internal.MojoExecutor.execute(MojoExecutor.java:153)
	at org.apache.maven.lifecycle.internal.MojoExecutor.execute(MojoExecutor.java:145)
	at org.apache.maven.lifecycle.internal.LifecycleModuleBuilder.buildProject(LifecycleModuleBuilder.java:116)
	at org.apache.maven.lifecycle.internal.LifecycleModuleBuilder.buildProject(LifecycleModuleBuilder.java:80)
	at org.apache.maven.lifecycle.internal.builder.singlethreaded.SingleThreadedBuilder.build(SingleThreadedBuilder.java:51)
	at org.apache.maven.lifecycle.internal.LifecycleStarter.execute(LifecycleStarter.java:128)
	at org.apache.maven.DefaultMaven.doExecute(DefaultMaven.java:307)
	at org.apache.maven.DefaultMaven.doExecute(DefaultMaven.java:193)
	at org.apache.maven.DefaultMaven.execute(DefaultMaven.java:106)
	at org.jvnet.hudson.maven3.launcher.Maven32Launcher.main(Maven32Launcher.java:132)
	at sun.reflect.NativeMethodAccessorImpl.invoke0(Native Method)
	at sun.reflect.NativeMethodAccessorImpl.invoke(NativeMethodAccessorImpl.java:62)
	at sun.reflect.DelegatingMethodAccessorImpl.invoke(DelegatingMethodAccessorImpl.java:43)
	at java.lang.reflect.Method.invoke(Method.java:498)
	at org.codehaus.plexus.classworlds.launcher.Launcher.launchStandard(Launcher.java:330)
	at org.codehaus.plexus.classworlds.launcher.Launcher.launch(Launcher.java:238)
	at jenkins.maven3.agent.Maven32Main.launch(Maven32Main.java:186)
	at sun.reflect.NativeMethodAccessorImpl.invoke0(Native Method)
	at sun.reflect.NativeMethodAccessorImpl.invoke(NativeMethodAccessorImpl.java:62)
	at sun.reflect.DelegatingMethodAccessorImpl.invoke(DelegatingMethodAccessorImpl.java:43)
	at java.lang.reflect.Method.invoke(Method.java:498)
	at hudson.maven.Maven3Builder.call(Maven3Builder.java:136)
	at hudson.maven.Maven3Builder.call(Maven3Builder.java:71)
	at hudson.remoting.UserRequest.perform(UserRequest.java:153)
	at hudson.remoting.UserRequest.perform(UserRequest.java:50)
	at hudson.remoting.Request$2.run(Request.java:332)
	at hudson.remoting.InterceptingExecutorService$1.call(InterceptingExecutorService.java:68)
	at java.util.concurrent.FutureTask.run(FutureTask.java:266)
	at java.util.concurrent.ThreadPoolExecutor.runWorker(ThreadPoolExecutor.java:1142)
	at java.util.concurrent.ThreadPoolExecutor$Worker.run(ThreadPoolExecutor.java:617)
	at java.lang.Thread.run(Thread.java:745)
Caused by: org.apache.maven.plugin.PluginExecutionException: Execution findbugs of goal org.codehaus.mojo:findbugs-maven-plugin:3.0.1:findbugs
failed: Java returned: 1
	at org.apache.maven.plugin.DefaultBuildPluginManager.executeMojo(DefaultBuildPluginManager.java:145)
	at org.apache.maven.lifecycle.internal.MojoExecutor.execute(MojoExecutor.java:208)
	... 35 more
Caused by: : Java returned: 1
	at org.apache.tools.ant.taskdefs.Java.execute(Java.java:111)
	at org.apache.tools.ant.UnknownElement.execute(UnknownElement.java:292)
	at sun.reflect.NativeMethodAccessorImpl.invoke0(Native Method)
	at sun.reflect.NativeMethodAccessorImpl.invoke(NativeMethodAccessorImpl.java:62)
	at sun.reflect.DelegatingMethodAccessorImpl.invoke(DelegatingMethodAccessorImpl.java:43)
	at java.lang.reflect.Method.invoke(Method.java:498)
	at org.apache.tools.ant.dispatch.DispatchUtils.execute(DispatchUtils.java:106)
	at groovy.util.AntBuilder.performTask(AntBuilder.java:324)
	at groovy.util.AntBuilder.nodeCompleted(AntBuilder.java:269)
	at groovy.util.BuilderSupport.doInvokeMethod(BuilderSupport.java:147)
	at groovy.util.AntBuilder.doInvokeMethod(AntBuilder.java:204)
	at groovy.util.BuilderSupport.invokeMethod(BuilderSupport.java:64)
	at org.codehaus.groovy.runtime.callsite.PogoMetaClassSite.call(PogoMetaClassSite.java:45)
	at org.codehaus.groovy.runtime.callsite.AbstractCallSite.call(AbstractCallSite.java:128)
	at org.codehaus.mojo.findbugs.FindBugsMojo.executeFindbugs(FindBugsMojo.groovy:1010)
	at sun.reflect.NativeMethodAccessorImpl.invoke0(Native Method)
	at sun.reflect.NativeMethodAccessorImpl.invoke(NativeMethodAccessorImpl.java:62)
	at sun.reflect.DelegatingMethodAccessorImpl.invoke(DelegatingMethodAccessorImpl.java:43)
	at java.lang.reflect.Method.invoke(Method.java:498)
	at org.codehaus.groovy.runtime.callsite.PogoMetaMethodSite$PogoCachedMethodSiteNoUnwrapNoCoerce.invoke(PogoMetaMethodSite.java:207)
	at org.codehaus.groovy.runtime.callsite.PogoMetaMethodSite.callCurrent(PogoMetaMethodSite.java:56)
	at org.codehaus.groovy.runtime.callsite.AbstractCallSite.callCurrent(AbstractCallSite.java:161)
	at org.codehaus.mojo.findbugs.FindBugsMojo.canGenerateReport(FindBugsMojo.groovy:547)
	at org.codehaus.mojo.findbugs.FindBugsMojo.execute(FindBugsMojo.groovy:686)
	at org.apache.maven.plugin.DefaultBuildPluginManager.executeMojo(DefaultBuildPluginManager.java:134)
	... 36 more
2016-12-20T00:17:51.014 [ERROR] 
2016-12-20T00:17:51.014 [ERROR] Re-run Maven using the -X switch to enable full debug logging.
2016-12-20T00:17:51.014 [ERROR] 
2016-12-20T00:17:51.014 [ERROR] For more information about the errors and possible solutions,
please read the following articles:
2016-12-20T00:17:51.014 [ERROR] [Help 1] http://cwiki.apache.org/confluence/display/MAVEN/PluginExecutionException
2016-12-20T00:17:51.014 [ERROR] 
2016-12-20T00:17:51.014 [ERROR] After correcting the problems, you can resume the build with
the command
2016-12-20T00:17:51.014 [ERROR]   mvn <goals> -rf :beam-sdks-java-extensions-sorter
[JENKINS] Archiving <https://builds.apache.org/job/beam_PostCommit_Java_MavenInstall/ws/sdks/java/io/pom.xml>
to org.apache.beam/beam-sdks-java-io-parent/0.5.0-incubating-SNAPSHOT/beam-sdks-java-io-parent-0.5.0-incubating-SNAPSHOT.pom
[JENKINS] Archiving <https://builds.apache.org/job/beam_PostCommit_Java_MavenInstall/ws/sdks/java/maven-archetypes/starter/pom.xml>
to org.apache.beam/beam-sdks-java-maven-archetypes-starter/0.5.0-incubating-SNAPSHOT/beam-sdks-java-maven-archetypes-starter-0.5.0-incubating-SNAPSHOT.pom
[JENKINS] Archiving <https://builds.apache.org/job/beam_PostCommit_Java_MavenInstall/ws/sdks/java/maven-archetypes/starter/target/beam-sdks-java-maven-archetypes-starter-0.5.0-incubating-SNAPSHOT.jar>
to org.apache.beam/beam-sdks-java-maven-archetypes-starter/0.5.0-incubating-SNAPSHOT/beam-sdks-java-maven-archetypes-starter-0.5.0-incubating-SNAPSHOT.jar
[JENKINS] Archiving <https://builds.apache.org/job/beam_PostCommit_Java_MavenInstall/ws/sdks/java/maven-archetypes/starter/target/beam-sdks-java-maven-archetypes-starter-0.5.0-incubating-SNAPSHOT-sources.jar>
to org.apache.beam/beam-sdks-java-maven-archetypes-starter/0.5.0-incubating-SNAPSHOT/beam-sdks-java-maven-archetypes-starter-0.5.0-incubating-SNAPSHOT-sources.jar
[JENKINS] Archiving <https://builds.apache.org/job/beam_PostCommit_Java_MavenInstall/ws/sdks/java/maven-archetypes/starter/target/beam-sdks-java-maven-archetypes-starter-0.5.0-incubating-SNAPSHOT-test-sources.jar>
to org.apache.beam/beam-sdks-java-maven-archetypes-starter/0.5.0-incubating-SNAPSHOT/beam-sdks-java-maven-archetypes-starter-0.5.0-incubating-SNAPSHOT-test-sources.jar
[JENKINS] Archiving <https://builds.apache.org/job/beam_PostCommit_Java_MavenInstall/ws/runners/direct-java/dependency-reduced-pom.xml>
to org.apache.beam/beam-runners-direct-java/0.5.0-incubating-SNAPSHOT/beam-runners-direct-java-0.5.0-incubating-SNAPSHOT.pom
[JENKINS] Archiving <https://builds.apache.org/job/beam_PostCommit_Java_MavenInstall/ws/runners/direct-java/target/beam-runners-direct-java-0.5.0-incubating-SNAPSHOT.jar>
to org.apache.beam/beam-runners-direct-java/0.5.0-incubating-SNAPSHOT/beam-runners-direct-java-0.5.0-incubating-SNAPSHOT.jar
[JENKINS] Archiving <https://builds.apache.org/job/beam_PostCommit_Java_MavenInstall/ws/runners/direct-java/target/beam-runners-direct-java-0.5.0-incubating-SNAPSHOT-javadoc.jar>
to org.apache.beam/beam-runners-direct-java/0.5.0-incubating-SNAPSHOT/beam-runners-direct-java-0.5.0-incubating-SNAPSHOT-javadoc.jar
[JENKINS] Archiving <https://builds.apache.org/job/beam_PostCommit_Java_MavenInstall/ws/runners/direct-java/target/beam-runners-direct-java-0.5.0-incubating-SNAPSHOT-sources.jar>
to org.apache.beam/beam-runners-direct-java/0.5.0-incubating-SNAPSHOT/beam-runners-direct-java-0.5.0-incubating-SNAPSHOT-sources.jar
[JENKINS] Archiving <https://builds.apache.org/job/beam_PostCommit_Java_MavenInstall/ws/runners/direct-java/target/beam-runners-direct-java-0.5.0-incubating-SNAPSHOT-test-sources.jar>
to org.apache.beam/beam-runners-direct-java/0.5.0-incubating-SNAPSHOT/beam-runners-direct-java-0.5.0-incubating-SNAPSHOT-test-sources.jar
[JENKINS] Archiving <https://builds.apache.org/job/beam_PostCommit_Java_MavenInstall/ws/runners/direct-java/target/beam-runners-direct-java-0.5.0-incubating-SNAPSHOT-tests.jar>
to org.apache.beam/beam-runners-direct-java/0.5.0-incubating-SNAPSHOT/beam-runners-direct-java-0.5.0-incubating-SNAPSHOT-tests.jar
[JENKINS] Archiving <https://builds.apache.org/job/beam_PostCommit_Java_MavenInstall/ws/examples/java/pom.xml>
to org.apache.beam/beam-examples-java/0.5.0-incubating-SNAPSHOT/beam-examples-java-0.5.0-incubating-SNAPSHOT.pom
[JENKINS] Archiving <https://builds.apache.org/job/beam_PostCommit_Java_MavenInstall/ws/sdks/java/build-tools/pom.xml>
to org.apache.beam/beam-sdks-java-build-tools/0.5.0-incubating-SNAPSHOT/beam-sdks-java-build-tools-0.5.0-incubating-SNAPSHOT.pom
[JENKINS] Archiving <https://builds.apache.org/job/beam_PostCommit_Java_MavenInstall/ws/sdks/java/build-tools/target/beam-sdks-java-build-tools-0.5.0-incubating-SNAPSHOT.jar>
to org.apache.beam/beam-sdks-java-build-tools/0.5.0-incubating-SNAPSHOT/beam-sdks-java-build-tools-0.5.0-incubating-SNAPSHOT.jar
[JENKINS] Archiving <https://builds.apache.org/job/beam_PostCommit_Java_MavenInstall/ws/sdks/java/build-tools/target/beam-sdks-java-build-tools-0.5.0-incubating-SNAPSHOT-sources.jar>
to org.apache.beam/beam-sdks-java-build-tools/0.5.0-incubating-SNAPSHOT/beam-sdks-java-build-tools-0.5.0-incubating-SNAPSHOT-sources.jar
[JENKINS] Archiving <https://builds.apache.org/job/beam_PostCommit_Java_MavenInstall/ws/sdks/java/build-tools/target/beam-sdks-java-build-tools-0.5.0-incubating-SNAPSHOT-test-sources.jar>
to org.apache.beam/beam-sdks-java-build-tools/0.5.0-incubating-SNAPSHOT/beam-sdks-java-build-tools-0.5.0-incubating-SNAPSHOT-test-sources.jar
[JENKINS] Archiving <https://builds.apache.org/job/beam_PostCommit_Java_MavenInstall/ws/sdks/java/build-tools/target/beam-sdks-java-build-tools-0.5.0-incubating-SNAPSHOT-tests.jar>
to org.apache.beam/beam-sdks-java-build-tools/0.5.0-incubating-SNAPSHOT/beam-sdks-java-build-tools-0.5.0-incubating-SNAPSHOT-tests.jar
[JENKINS] Archiving <https://builds.apache.org/job/beam_PostCommit_Java_MavenInstall/ws/sdks/java/core/dependency-reduced-pom.xml>
to org.apache.beam/beam-sdks-java-core/0.5.0-incubating-SNAPSHOT/beam-sdks-java-core-0.5.0-incubating-SNAPSHOT.pom
[JENKINS] Archiving <https://builds.apache.org/job/beam_PostCommit_Java_MavenInstall/ws/sdks/java/core/target/beam-sdks-java-core-0.5.0-incubating-SNAPSHOT.jar>
to org.apache.beam/beam-sdks-java-core/0.5.0-incubating-SNAPSHOT/beam-sdks-java-core-0.5.0-incubating-SNAPSHOT.jar
[JENKINS] Archiving <https://builds.apache.org/job/beam_PostCommit_Java_MavenInstall/ws/sdks/java/core/target/beam-sdks-java-core-0.5.0-incubating-SNAPSHOT-javadoc.jar>
to org.apache.beam/beam-sdks-java-core/0.5.0-incubating-SNAPSHOT/beam-sdks-java-core-0.5.0-incubating-SNAPSHOT-javadoc.jar
[JENKINS] Archiving <https://builds.apache.org/job/beam_PostCommit_Java_MavenInstall/ws/sdks/java/core/target/beam-sdks-java-core-0.5.0-incubating-SNAPSHOT-sources.jar>
to org.apache.beam/beam-sdks-java-core/0.5.0-incubating-SNAPSHOT/beam-sdks-java-core-0.5.0-incubating-SNAPSHOT-sources.jar
[JENKINS] Archiving <https://builds.apache.org/job/beam_PostCommit_Java_MavenInstall/ws/sdks/java/core/target/beam-sdks-java-core-0.5.0-incubating-SNAPSHOT-test-sources.jar>
to org.apache.beam/beam-sdks-java-core/0.5.0-incubating-SNAPSHOT/beam-sdks-java-core-0.5.0-incubating-SNAPSHOT-test-sources.jar
[JENKINS] Archiving <https://builds.apache.org/job/beam_PostCommit_Java_MavenInstall/ws/sdks/java/core/target/beam-sdks-java-core-0.5.0-incubating-SNAPSHOT-tests.jar>
to org.apache.beam/beam-sdks-java-core/0.5.0-incubating-SNAPSHOT/beam-sdks-java-core-0.5.0-incubating-SNAPSHOT-tests.jar
[JENKINS] Archiving <https://builds.apache.org/job/beam_PostCommit_Java_MavenInstall/ws/runners/flink/examples/pom.xml>
to org.apache.beam/beam-runners-flink_2.10-examples/0.5.0-incubating-SNAPSHOT/beam-runners-flink_2.10-examples-0.5.0-incubating-SNAPSHOT.pom
[JENKINS] Archiving <https://builds.apache.org/job/beam_PostCommit_Java_MavenInstall/ws/runners/core-java/dependency-reduced-pom.xml>
to org.apache.beam/beam-runners-core-java/0.5.0-incubating-SNAPSHOT/beam-runners-core-java-0.5.0-incubating-SNAPSHOT.pom
[JENKINS] Archiving <https://builds.apache.org/job/beam_PostCommit_Java_MavenInstall/ws/runners/core-java/target/beam-runners-core-java-0.5.0-incubating-SNAPSHOT.jar>
to org.apache.beam/beam-runners-core-java/0.5.0-incubating-SNAPSHOT/beam-runners-core-java-0.5.0-incubating-SNAPSHOT.jar
[JENKINS] Archiving <https://builds.apache.org/job/beam_PostCommit_Java_MavenInstall/ws/runners/core-java/target/beam-runners-core-java-0.5.0-incubating-SNAPSHOT-javadoc.jar>
to org.apache.beam/beam-runners-core-java/0.5.0-incubating-SNAPSHOT/beam-runners-core-java-0.5.0-incubating-SNAPSHOT-javadoc.jar
[JENKINS] Archiving <https://builds.apache.org/job/beam_PostCommit_Java_MavenInstall/ws/runners/core-java/target/beam-runners-core-java-0.5.0-incubating-SNAPSHOT-sources.jar>
to org.apache.beam/beam-runners-core-java/0.5.0-incubating-SNAPSHOT/beam-runners-core-java-0.5.0-incubating-SNAPSHOT-sources.jar
[JENKINS] Archiving <https://builds.apache.org/job/beam_PostCommit_Java_MavenInstall/ws/runners/core-java/target/beam-runners-core-java-0.5.0-incubating-SNAPSHOT-test-sources.jar>
to org.apache.beam/beam-runners-core-java/0.5.0-incubating-SNAPSHOT/beam-runners-core-java-0.5.0-incubating-SNAPSHOT-test-sources.jar
[JENKINS] Archiving <https://builds.apache.org/job/beam_PostCommit_Java_MavenInstall/ws/runners/core-java/target/beam-runners-core-java-0.5.0-incubating-SNAPSHOT-tests.jar>
to org.apache.beam/beam-runners-core-java/0.5.0-incubating-SNAPSHOT/beam-runners-core-java-0.5.0-incubating-SNAPSHOT-tests.jar
[JENKINS] Archiving <https://builds.apache.org/job/beam_PostCommit_Java_MavenInstall/ws/sdks/java/io/kinesis/pom.xml>
to org.apache.beam/beam-sdks-java-io-kinesis/0.5.0-incubating-SNAPSHOT/beam-sdks-java-io-kinesis-0.5.0-incubating-SNAPSHOT.pom
[JENKINS] Archiving <https://builds.apache.org/job/beam_PostCommit_Java_MavenInstall/ws/sdks/java/io/kinesis/target/beam-sdks-java-io-kinesis-0.5.0-incubating-SNAPSHOT.jar>
to org.apache.beam/beam-sdks-java-io-kinesis/0.5.0-incubating-SNAPSHOT/beam-sdks-java-io-kinesis-0.5.0-incubating-SNAPSHOT.jar
[JENKINS] Archiving <https://builds.apache.org/job/beam_PostCommit_Java_MavenInstall/ws/sdks/java/io/kinesis/target/beam-sdks-java-io-kinesis-0.5.0-incubating-SNAPSHOT-javadoc.jar>
to org.apache.beam/beam-sdks-java-io-kinesis/0.5.0-incubating-SNAPSHOT/beam-sdks-java-io-kinesis-0.5.0-incubating-SNAPSHOT-javadoc.jar
[JENKINS] Archiving <https://builds.apache.org/job/beam_PostCommit_Java_MavenInstall/ws/sdks/java/io/kinesis/target/beam-sdks-java-io-kinesis-0.5.0-incubating-SNAPSHOT-sources.jar>
to org.apache.beam/beam-sdks-java-io-kinesis/0.5.0-incubating-SNAPSHOT/beam-sdks-java-io-kinesis-0.5.0-incubating-SNAPSHOT-sources.jar
[JENKINS] Archiving <https://builds.apache.org/job/beam_PostCommit_Java_MavenInstall/ws/sdks/java/io/kinesis/target/beam-sdks-java-io-kinesis-0.5.0-incubating-SNAPSHOT-test-sources.jar>
to org.apache.beam/beam-sdks-java-io-kinesis/0.5.0-incubating-SNAPSHOT/beam-sdks-java-io-kinesis-0.5.0-incubating-SNAPSHOT-test-sources.jar
[JENKINS] Archiving <https://builds.apache.org/job/beam_PostCommit_Java_MavenInstall/ws/sdks/java/io/kinesis/target/beam-sdks-java-io-kinesis-0.5.0-incubating-SNAPSHOT-tests.jar>
to org.apache.beam/beam-sdks-java-io-kinesis/0.5.0-incubating-SNAPSHOT/beam-sdks-java-io-kinesis-0.5.0-incubating-SNAPSHOT-tests.jar
[JENKINS] Archiving <https://builds.apache.org/job/beam_PostCommit_Java_MavenInstall/ws/sdks/java/io/kafka/pom.xml>
to org.apache.beam/beam-sdks-java-io-kafka/0.5.0-incubating-SNAPSHOT/beam-sdks-java-io-kafka-0.5.0-incubating-SNAPSHOT.pom
[JENKINS] Archiving <https://builds.apache.org/job/beam_PostCommit_Java_MavenInstall/ws/sdks/java/io/kafka/target/beam-sdks-java-io-kafka-0.5.0-incubating-SNAPSHOT.jar>
to org.apache.beam/beam-sdks-java-io-kafka/0.5.0-incubating-SNAPSHOT/beam-sdks-java-io-kafka-0.5.0-incubating-SNAPSHOT.jar
[JENKINS] Archiving <https://builds.apache.org/job/beam_PostCommit_Java_MavenInstall/ws/sdks/java/io/kafka/target/beam-sdks-java-io-kafka-0.5.0-incubating-SNAPSHOT-javadoc.jar>
to org.apache.beam/beam-sdks-java-io-kafka/0.5.0-incubating-SNAPSHOT/beam-sdks-java-io-kafka-0.5.0-incubating-SNAPSHOT-javadoc.jar
[JENKINS] Archiving <https://builds.apache.org/job/beam_PostCommit_Java_MavenInstall/ws/sdks/java/io/kafka/target/beam-sdks-java-io-kafka-0.5.0-incubating-SNAPSHOT-sources.jar>
to org.apache.beam/beam-sdks-java-io-kafka/0.5.0-incubating-SNAPSHOT/beam-sdks-java-io-kafka-0.5.0-incubating-SNAPSHOT-sources.jar
[JENKINS] Archiving <https://builds.apache.org/job/beam_PostCommit_Java_MavenInstall/ws/sdks/java/io/kafka/target/beam-sdks-java-io-kafka-0.5.0-incubating-SNAPSHOT-test-sources.jar>
to org.apache.beam/beam-sdks-java-io-kafka/0.5.0-incubating-SNAPSHOT/beam-sdks-java-io-kafka-0.5.0-incubating-SNAPSHOT-test-sources.jar
[JENKINS] Archiving <https://builds.apache.org/job/beam_PostCommit_Java_MavenInstall/ws/sdks/java/io/kafka/target/beam-sdks-java-io-kafka-0.5.0-incubating-SNAPSHOT-tests.jar>
to org.apache.beam/beam-sdks-java-io-kafka/0.5.0-incubating-SNAPSHOT/beam-sdks-java-io-kafka-0.5.0-incubating-SNAPSHOT-tests.jar
[JENKINS] Archiving <https://builds.apache.org/job/beam_PostCommit_Java_MavenInstall/ws/runners/flink/runner/pom.xml>
to org.apache.beam/beam-runners-flink_2.10/0.5.0-incubating-SNAPSHOT/beam-runners-flink_2.10-0.5.0-incubating-SNAPSHOT.pom
[JENKINS] Archiving <https://builds.apache.org/job/beam_PostCommit_Java_MavenInstall/ws/sdks/java/io/google-cloud-platform/pom.xml>
to org.apache.beam/beam-sdks-java-io-google-cloud-platform/0.5.0-incubating-SNAPSHOT/beam-sdks-java-io-google-cloud-platform-0.5.0-incubating-SNAPSHOT.pom
[JENKINS] Archiving <https://builds.apache.org/job/beam_PostCommit_Java_MavenInstall/ws/sdks/java/io/google-cloud-platform/target/beam-sdks-java-io-google-cloud-platform-0.5.0-incubating-SNAPSHOT.jar>
to org.apache.beam/beam-sdks-java-io-google-cloud-platform/0.5.0-incubating-SNAPSHOT/beam-sdks-java-io-google-cloud-platform-0.5.0-incubating-SNAPSHOT.jar
[JENKINS] Archiving <https://builds.apache.org/job/beam_PostCommit_Java_MavenInstall/ws/sdks/java/io/google-cloud-platform/target/beam-sdks-java-io-google-cloud-platform-0.5.0-incubating-SNAPSHOT-javadoc.jar>
to org.apache.beam/beam-sdks-java-io-google-cloud-platform/0.5.0-incubating-SNAPSHOT/beam-sdks-java-io-google-cloud-platform-0.5.0-incubating-SNAPSHOT-javadoc.jar
[JENKINS] Archiving <https://builds.apache.org/job/beam_PostCommit_Java_MavenInstall/ws/sdks/java/io/google-cloud-platform/target/beam-sdks-java-io-google-cloud-platform-0.5.0-incubating-SNAPSHOT-sources.jar>
to org.apache.beam/beam-sdks-java-io-google-cloud-platform/0.5.0-incubating-SNAPSHOT/beam-sdks-java-io-google-cloud-platform-0.5.0-incubating-SNAPSHOT-sources.jar
[JENKINS] Archiving <https://builds.apache.org/job/beam_PostCommit_Java_MavenInstall/ws/sdks/java/io/google-cloud-platform/target/beam-sdks-java-io-google-cloud-platform-0.5.0-incubating-SNAPSHOT-test-sources.jar>
to org.apache.beam/beam-sdks-java-io-google-cloud-platform/0.5.0-incubating-SNAPSHOT/beam-sdks-java-io-google-cloud-platform-0.5.0-incubating-SNAPSHOT-test-sources.jar
[JENKINS] Archiving <https://builds.apache.org/job/beam_PostCommit_Java_MavenInstall/ws/sdks/java/io/google-cloud-platform/target/beam-sdks-java-io-google-cloud-platform-0.5.0-incubating-SNAPSHOT-tests.jar>
to org.apache.beam/beam-sdks-java-io-google-cloud-platform/0.5.0-incubating-SNAPSHOT/beam-sdks-java-io-google-cloud-platform-0.5.0-incubating-SNAPSHOT-tests.jar
[JENKINS] Archiving <https://builds.apache.org/job/beam_PostCommit_Java_MavenInstall/ws/sdks/java/pom.xml>
to org.apache.beam/beam-sdks-java-parent/0.5.0-incubating-SNAPSHOT/beam-sdks-java-parent-0.5.0-incubating-SNAPSHOT.pom
[JENKINS] Archiving <https://builds.apache.org/job/beam_PostCommit_Java_MavenInstall/ws/pom.xml>
to org.apache.beam/beam-parent/0.5.0-incubating-SNAPSHOT/beam-parent-0.5.0-incubating-SNAPSHOT.pom
Compressed 42.38 KB of artifacts by 75.5% relative to #2173
[JENKINS] Archiving <https://builds.apache.org/job/beam_PostCommit_Java_MavenInstall/ws/sdks/java/maven-archetypes/examples-java8/pom.xml>
to org.apache.beam/beam-sdks-java-maven-archetypes-examples-java8/0.5.0-incubating-SNAPSHOT/beam-sdks-java-maven-archetypes-examples-java8-0.5.0-incubating-SNAPSHOT.pom
[JENKINS] Archiving <https://builds.apache.org/job/beam_PostCommit_Java_MavenInstall/ws/sdks/java/maven-archetypes/examples-java8/target/beam-sdks-java-maven-archetypes-examples-java8-0.5.0-incubating-SNAPSHOT.jar>
to org.apache.beam/beam-sdks-java-maven-archetypes-examples-java8/0.5.0-incubating-SNAPSHOT/beam-sdks-java-maven-archetypes-examples-java8-0.5.0-incubating-SNAPSHOT.jar
[JENKINS] Archiving <https://builds.apache.org/job/beam_PostCommit_Java_MavenInstall/ws/sdks/java/maven-archetypes/examples-java8/target/beam-sdks-java-maven-archetypes-examples-java8-0.5.0-incubating-SNAPSHOT-sources.jar>
to org.apache.beam/beam-sdks-java-maven-archetypes-examples-java8/0.5.0-incubating-SNAPSHOT/beam-sdks-java-maven-archetypes-examples-java8-0.5.0-incubating-SNAPSHOT-sources.jar
[JENKINS] Archiving <https://builds.apache.org/job/beam_PostCommit_Java_MavenInstall/ws/sdks/java/maven-archetypes/examples-java8/target/beam-sdks-java-maven-archetypes-examples-java8-0.5.0-incubating-SNAPSHOT-test-sources.jar>
to org.apache.beam/beam-sdks-java-maven-archetypes-examples-java8/0.5.0-incubating-SNAPSHOT/beam-sdks-java-maven-archetypes-examples-java8-0.5.0-incubating-SNAPSHOT-test-sources.jar
[JENKINS] Archiving <https://builds.apache.org/job/beam_PostCommit_Java_MavenInstall/ws/sdks/java/maven-archetypes/examples/pom.xml>
to org.apache.beam/beam-sdks-java-maven-archetypes-examples/0.5.0-incubating-SNAPSHOT/beam-sdks-java-maven-archetypes-examples-0.5.0-incubating-SNAPSHOT.pom
[JENKINS] Archiving <https://builds.apache.org/job/beam_PostCommit_Java_MavenInstall/ws/sdks/java/maven-archetypes/examples/target/beam-sdks-java-maven-archetypes-examples-0.5.0-incubating-SNAPSHOT.jar>
to org.apache.beam/beam-sdks-java-maven-archetypes-examples/0.5.0-incubating-SNAPSHOT/beam-sdks-java-maven-archetypes-examples-0.5.0-incubating-SNAPSHOT.jar
[JENKINS] Archiving <https://builds.apache.org/job/beam_PostCommit_Java_MavenInstall/ws/sdks/java/maven-archetypes/examples/target/beam-sdks-java-maven-archetypes-examples-0.5.0-incubating-SNAPSHOT-sources.jar>
to org.apache.beam/beam-sdks-java-maven-archetypes-examples/0.5.0-incubating-SNAPSHOT/beam-sdks-java-maven-archetypes-examples-0.5.0-incubating-SNAPSHOT-sources.jar
[JENKINS] Archiving <https://builds.apache.org/job/beam_PostCommit_Java_MavenInstall/ws/sdks/java/maven-archetypes/examples/target/beam-sdks-java-maven-archetypes-examples-0.5.0-incubating-SNAPSHOT-test-sources.jar>
to org.apache.beam/beam-sdks-java-maven-archetypes-examples/0.5.0-incubating-SNAPSHOT/beam-sdks-java-maven-archetypes-examples-0.5.0-incubating-SNAPSHOT-test-sources.jar
[JENKINS] Archiving <https://builds.apache.org/job/beam_PostCommit_Java_MavenInstall/ws/runners/spark/pom.xml>
to org.apache.beam/beam-runners-spark/0.5.0-incubating-SNAPSHOT/beam-runners-spark-0.5.0-incubating-SNAPSHOT.pom
[JENKINS] Archiving <https://builds.apache.org/job/beam_PostCommit_Java_MavenInstall/ws/sdks/java/io/hdfs/pom.xml>
to org.apache.beam/beam-sdks-java-io-hdfs/0.5.0-incubating-SNAPSHOT/beam-sdks-java-io-hdfs-0.5.0-incubating-SNAPSHOT.pom
[JENKINS] Archiving <https://builds.apache.org/job/beam_PostCommit_Java_MavenInstall/ws/sdks/java/io/hdfs/target/beam-sdks-java-io-hdfs-0.5.0-incubating-SNAPSHOT.jar>
to org.apache.beam/beam-sdks-java-io-hdfs/0.5.0-incubating-SNAPSHOT/beam-sdks-java-io-hdfs-0.5.0-incubating-SNAPSHOT.jar
[JENKINS] Archiving <https://builds.apache.org/job/beam_PostCommit_Java_MavenInstall/ws/sdks/java/io/hdfs/target/beam-sdks-java-io-hdfs-0.5.0-incubating-SNAPSHOT-javadoc.jar>
to org.apache.beam/beam-sdks-java-io-hdfs/0.5.0-incubating-SNAPSHOT/beam-sdks-java-io-hdfs-0.5.0-incubating-SNAPSHOT-javadoc.jar
[JENKINS] Archiving <https://builds.apache.org/job/beam_PostCommit_Java_MavenInstall/ws/sdks/java/io/hdfs/target/beam-sdks-java-io-hdfs-0.5.0-incubating-SNAPSHOT-sources.jar>
to org.apache.beam/beam-sdks-java-io-hdfs/0.5.0-incubating-SNAPSHOT/beam-sdks-java-io-hdfs-0.5.0-incubating-SNAPSHOT-sources.jar
[JENKINS] Archiving <https://builds.apache.org/job/beam_PostCommit_Java_MavenInstall/ws/sdks/java/io/hdfs/target/beam-sdks-java-io-hdfs-0.5.0-incubating-SNAPSHOT-test-sources.jar>
to org.apache.beam/beam-sdks-java-io-hdfs/0.5.0-incubating-SNAPSHOT/beam-sdks-java-io-hdfs-0.5.0-incubating-SNAPSHOT-test-sources.jar
[JENKINS] Archiving <https://builds.apache.org/job/beam_PostCommit_Java_MavenInstall/ws/sdks/java/io/hdfs/target/beam-sdks-java-io-hdfs-0.5.0-incubating-SNAPSHOT-tests.jar>
to org.apache.beam/beam-sdks-java-io-hdfs/0.5.0-incubating-SNAPSHOT/beam-sdks-java-io-hdfs-0.5.0-incubating-SNAPSHOT-tests.jar
[JENKINS] Archiving <https://builds.apache.org/job/beam_PostCommit_Java_MavenInstall/ws/sdks/java/maven-archetypes/pom.xml>
to org.apache.beam/beam-sdks-java-maven-archetypes-parent/0.5.0-incubating-SNAPSHOT/beam-sdks-java-maven-archetypes-parent-0.5.0-incubating-SNAPSHOT.pom
[JENKINS] Archiving <https://builds.apache.org/job/beam_PostCommit_Java_MavenInstall/ws/runners/google-cloud-dataflow-java/dependency-reduced-pom.xml>
to org.apache.beam/beam-runners-google-cloud-dataflow-java/0.5.0-incubating-SNAPSHOT/beam-runners-google-cloud-dataflow-java-0.5.0-incubating-SNAPSHOT.pom
[JENKINS] Archiving <https://builds.apache.org/job/beam_PostCommit_Java_MavenInstall/ws/runners/google-cloud-dataflow-java/target/beam-runners-google-cloud-dataflow-java-0.5.0-incubating-SNAPSHOT.jar>
to org.apache.beam/beam-runners-google-cloud-dataflow-java/0.5.0-incubating-SNAPSHOT/beam-runners-google-cloud-dataflow-java-0.5.0-incubating-SNAPSHOT.jar
[JENKINS] Archiving <https://builds.apache.org/job/beam_PostCommit_Java_MavenInstall/ws/runners/google-cloud-dataflow-java/target/beam-runners-google-cloud-dataflow-java-0.5.0-incubating-SNAPSHOT-javadoc.jar>
to org.apache.beam/beam-runners-google-cloud-dataflow-java/0.5.0-incubating-SNAPSHOT/beam-runners-google-cloud-dataflow-java-0.5.0-incubating-SNAPSHOT-javadoc.jar
[JENKINS] Archiving <https://builds.apache.org/job/beam_PostCommit_Java_MavenInstall/ws/runners/google-cloud-dataflow-java/target/beam-runners-google-cloud-dataflow-java-0.5.0-incubating-SNAPSHOT-sources.jar>
to org.apache.beam/beam-runners-google-cloud-dataflow-java/0.5.0-incubating-SNAPSHOT/beam-runners-google-cloud-dataflow-java-0.5.0-incubating-SNAPSHOT-sources.jar
[JENKINS] Archiving <https://builds.apache.org/job/beam_PostCommit_Java_MavenInstall/ws/runners/google-cloud-dataflow-java/target/beam-runners-google-cloud-dataflow-java-0.5.0-incubating-SNAPSHOT-test-sources.jar>
to org.apache.beam/beam-runners-google-cloud-dataflow-java/0.5.0-incubating-SNAPSHOT/beam-runners-google-cloud-dataflow-java-0.5.0-incubating-SNAPSHOT-test-sources.jar
[JENKINS] Archiving <https://builds.apache.org/job/beam_PostCommit_Java_MavenInstall/ws/runners/google-cloud-dataflow-java/target/beam-runners-google-cloud-dataflow-java-0.5.0-incubating-SNAPSHOT-tests.jar>
to org.apache.beam/beam-runners-google-cloud-dataflow-java/0.5.0-incubating-SNAPSHOT/beam-runners-google-cloud-dataflow-java-0.5.0-incubating-SNAPSHOT-tests.jar
[JENKINS] Archiving <https://builds.apache.org/job/beam_PostCommit_Java_MavenInstall/ws/runners/apex/pom.xml>
to org.apache.beam/beam-runners-apex/0.5.0-incubating-SNAPSHOT/beam-runners-apex-0.5.0-incubating-SNAPSHOT.pom
[JENKINS] Archiving <https://builds.apache.org/job/beam_PostCommit_Java_MavenInstall/ws/sdks/java/io/jms/pom.xml>
to org.apache.beam/beam-sdks-java-io-jms/0.5.0-incubating-SNAPSHOT/beam-sdks-java-io-jms-0.5.0-incubating-SNAPSHOT.pom
[JENKINS] Archiving <https://builds.apache.org/job/beam_PostCommit_Java_MavenInstall/ws/sdks/java/io/jms/target/beam-sdks-java-io-jms-0.5.0-incubating-SNAPSHOT.jar>
to org.apache.beam/beam-sdks-java-io-jms/0.5.0-incubating-SNAPSHOT/beam-sdks-java-io-jms-0.5.0-incubating-SNAPSHOT.jar
[JENKINS] Archiving <https://builds.apache.org/job/beam_PostCommit_Java_MavenInstall/ws/sdks/java/io/jms/target/beam-sdks-java-io-jms-0.5.0-incubating-SNAPSHOT-javadoc.jar>
to org.apache.beam/beam-sdks-java-io-jms/0.5.0-incubating-SNAPSHOT/beam-sdks-java-io-jms-0.5.0-incubating-SNAPSHOT-javadoc.jar
[JENKINS] Archiving <https://builds.apache.org/job/beam_PostCommit_Java_MavenInstall/ws/sdks/java/io/jms/target/beam-sdks-java-io-jms-0.5.0-incubating-SNAPSHOT-sources.jar>
to org.apache.beam/beam-sdks-java-io-jms/0.5.0-incubating-SNAPSHOT/beam-sdks-java-io-jms-0.5.0-incubating-SNAPSHOT-sources.jar
[JENKINS] Archiving <https://builds.apache.org/job/beam_PostCommit_Java_MavenInstall/ws/sdks/java/io/jms/target/beam-sdks-java-io-jms-0.5.0-incubating-SNAPSHOT-test-sources.jar>
to org.apache.beam/beam-sdks-java-io-jms/0.5.0-incubating-SNAPSHOT/beam-sdks-java-io-jms-0.5.0-incubating-SNAPSHOT-test-sources.jar
[JENKINS] Archiving <https://builds.apache.org/job/beam_PostCommit_Java_MavenInstall/ws/sdks/java/io/jms/target/beam-sdks-java-io-jms-0.5.0-incubating-SNAPSHOT-tests.jar>
to org.apache.beam/beam-sdks-java-io-jms/0.5.0-incubating-SNAPSHOT/beam-sdks-java-io-jms-0.5.0-incubating-SNAPSHOT-tests.jar
[JENKINS] Archiving <https://builds.apache.org/job/beam_PostCommit_Java_MavenInstall/ws/runners/flink/pom.xml>
to org.apache.beam/beam-runners-flink-parent/0.5.0-incubating-SNAPSHOT/beam-runners-flink-parent-0.5.0-incubating-SNAPSHOT.pom
[JENKINS] Archiving <https://builds.apache.org/job/beam_PostCommit_Java_MavenInstall/ws/sdks/java/io/mongodb/pom.xml>
to org.apache.beam/beam-sdks-java-io-mongodb/0.5.0-incubating-SNAPSHOT/beam-sdks-java-io-mongodb-0.5.0-incubating-SNAPSHOT.pom
[JENKINS] Archiving <https://builds.apache.org/job/beam_PostCommit_Java_MavenInstall/ws/sdks/java/io/mongodb/target/beam-sdks-java-io-mongodb-0.5.0-incubating-SNAPSHOT.jar>
to org.apache.beam/beam-sdks-java-io-mongodb/0.5.0-incubating-SNAPSHOT/beam-sdks-java-io-mongodb-0.5.0-incubating-SNAPSHOT.jar
[JENKINS] Archiving <https://builds.apache.org/job/beam_PostCommit_Java_MavenInstall/ws/sdks/java/io/mongodb/target/beam-sdks-java-io-mongodb-0.5.0-incubating-SNAPSHOT-javadoc.jar>
to org.apache.beam/beam-sdks-java-io-mongodb/0.5.0-incubating-SNAPSHOT/beam-sdks-java-io-mongodb-0.5.0-incubating-SNAPSHOT-javadoc.jar
[JENKINS] Archiving <https://builds.apache.org/job/beam_PostCommit_Java_MavenInstall/ws/sdks/java/io/mongodb/target/beam-sdks-java-io-mongodb-0.5.0-incubating-SNAPSHOT-sources.jar>
to org.apache.beam/beam-sdks-java-io-mongodb/0.5.0-incubating-SNAPSHOT/beam-sdks-java-io-mongodb-0.5.0-incubating-SNAPSHOT-sources.jar
[JENKINS] Archiving <https://builds.apache.org/job/beam_PostCommit_Java_MavenInstall/ws/sdks/java/io/mongodb/target/beam-sdks-java-io-mongodb-0.5.0-incubating-SNAPSHOT-test-sources.jar>
to org.apache.beam/beam-sdks-java-io-mongodb/0.5.0-incubating-SNAPSHOT/beam-sdks-java-io-mongodb-0.5.0-incubating-SNAPSHOT-test-sources.jar
[JENKINS] Archiving <https://builds.apache.org/job/beam_PostCommit_Java_MavenInstall/ws/sdks/java/io/mongodb/target/beam-sdks-java-io-mongodb-0.5.0-incubating-SNAPSHOT-tests.jar>
to org.apache.beam/beam-sdks-java-io-mongodb/0.5.0-incubating-SNAPSHOT/beam-sdks-java-io-mongodb-0.5.0-incubating-SNAPSHOT-tests.jar
[JENKINS] Archiving <https://builds.apache.org/job/beam_PostCommit_Java_MavenInstall/ws/sdks/java/extensions/sorter/pom.xml>
to org.apache.beam/beam-sdks-java-extensions-sorter/0.5.0-incubating-SNAPSHOT/beam-sdks-java-extensions-sorter-0.5.0-incubating-SNAPSHOT.pom
[JENKINS] Archiving <https://builds.apache.org/job/beam_PostCommit_Java_MavenInstall/ws/sdks/pom.xml>
to org.apache.beam/beam-sdks-parent/0.5.0-incubating-SNAPSHOT/beam-sdks-parent-0.5.0-incubating-SNAPSHOT.pom
[JENKINS] Archiving <https://builds.apache.org/job/beam_PostCommit_Java_MavenInstall/ws/sdks/java/extensions/join-library/pom.xml>
to org.apache.beam/beam-sdks-java-extensions-join-library/0.5.0-incubating-SNAPSHOT/beam-sdks-java-extensions-join-library-0.5.0-incubating-SNAPSHOT.pom
[JENKINS] Archiving <https://builds.apache.org/job/beam_PostCommit_Java_MavenInstall/ws/sdks/java/extensions/join-library/target/beam-sdks-java-extensions-join-library-0.5.0-incubating-SNAPSHOT.jar>
to org.apache.beam/beam-sdks-java-extensions-join-library/0.5.0-incubating-SNAPSHOT/beam-sdks-java-extensions-join-library-0.5.0-incubating-SNAPSHOT.jar
[JENKINS] Archiving <https://builds.apache.org/job/beam_PostCommit_Java_MavenInstall/ws/sdks/java/extensions/join-library/target/beam-sdks-java-extensions-join-library-0.5.0-incubating-SNAPSHOT-javadoc.jar>
to org.apache.beam/beam-sdks-java-extensions-join-library/0.5.0-incubating-SNAPSHOT/beam-sdks-java-extensions-join-library-0.5.0-incubating-SNAPSHOT-javadoc.jar
[JENKINS] Archiving <https://builds.apache.org/job/beam_PostCommit_Java_MavenInstall/ws/sdks/java/extensions/join-library/target/beam-sdks-java-extensions-join-library-0.5.0-incubating-SNAPSHOT-sources.jar>
to org.apache.beam/beam-sdks-java-extensions-join-library/0.5.0-incubating-SNAPSHOT/beam-sdks-java-extensions-join-library-0.5.0-incubating-SNAPSHOT-sources.jar
[JENKINS] Archiving <https://builds.apache.org/job/beam_PostCommit_Java_MavenInstall/ws/sdks/java/extensions/join-library/target/beam-sdks-java-extensions-join-library-0.5.0-incubating-SNAPSHOT-test-sources.jar>
to org.apache.beam/beam-sdks-java-extensions-join-library/0.5.0-incubating-SNAPSHOT/beam-sdks-java-extensions-join-library-0.5.0-incubating-SNAPSHOT-test-sources.jar
[JENKINS] Archiving <https://builds.apache.org/job/beam_PostCommit_Java_MavenInstall/ws/sdks/java/extensions/join-library/target/beam-sdks-java-extensions-join-library-0.5.0-incubating-SNAPSHOT-tests.jar>
to org.apache.beam/beam-sdks-java-extensions-join-library/0.5.0-incubating-SNAPSHOT/beam-sdks-java-extensions-join-library-0.5.0-incubating-SNAPSHOT-tests.jar
[JENKINS] Archiving <https://builds.apache.org/job/beam_PostCommit_Java_MavenInstall/ws/runners/pom.xml>
to org.apache.beam/beam-runners-parent/0.5.0-incubating-SNAPSHOT/beam-runners-parent-0.5.0-incubating-SNAPSHOT.pom
[JENKINS] Archiving <https://builds.apache.org/job/beam_PostCommit_Java_MavenInstall/ws/sdks/java/io/jdbc/pom.xml>
to org.apache.beam/beam-sdks-java-io-jdbc/0.5.0-incubating-SNAPSHOT/beam-sdks-java-io-jdbc-0.5.0-incubating-SNAPSHOT.pom
[JENKINS] Archiving <https://builds.apache.org/job/beam_PostCommit_Java_MavenInstall/ws/sdks/java/io/jdbc/target/beam-sdks-java-io-jdbc-0.5.0-incubating-SNAPSHOT.jar>
to org.apache.beam/beam-sdks-java-io-jdbc/0.5.0-incubating-SNAPSHOT/beam-sdks-java-io-jdbc-0.5.0-incubating-SNAPSHOT.jar
[JENKINS] Archiving <https://builds.apache.org/job/beam_PostCommit_Java_MavenInstall/ws/sdks/java/io/jdbc/target/beam-sdks-java-io-jdbc-0.5.0-incubating-SNAPSHOT-javadoc.jar>
to org.apache.beam/beam-sdks-java-io-jdbc/0.5.0-incubating-SNAPSHOT/beam-sdks-java-io-jdbc-0.5.0-incubating-SNAPSHOT-javadoc.jar
[JENKINS] Archiving <https://builds.apache.org/job/beam_PostCommit_Java_MavenInstall/ws/sdks/java/io/jdbc/target/beam-sdks-java-io-jdbc-0.5.0-incubating-SNAPSHOT-sources.jar>
to org.apache.beam/beam-sdks-java-io-jdbc/0.5.0-incubating-SNAPSHOT/beam-sdks-java-io-jdbc-0.5.0-incubating-SNAPSHOT-sources.jar
[JENKINS] Archiving <https://builds.apache.org/job/beam_PostCommit_Java_MavenInstall/ws/sdks/java/io/jdbc/target/beam-sdks-java-io-jdbc-0.5.0-incubating-SNAPSHOT-test-sources.jar>
to org.apache.beam/beam-sdks-java-io-jdbc/0.5.0-incubating-SNAPSHOT/beam-sdks-java-io-jdbc-0.5.0-incubating-SNAPSHOT-test-sources.jar
[JENKINS] Archiving <https://builds.apache.org/job/beam_PostCommit_Java_MavenInstall/ws/sdks/java/io/jdbc/target/beam-sdks-java-io-jdbc-0.5.0-incubating-SNAPSHOT-tests.jar>
to org.apache.beam/beam-sdks-java-io-jdbc/0.5.0-incubating-SNAPSHOT/beam-sdks-java-io-jdbc-0.5.0-incubating-SNAPSHOT-tests.jar
[JENKINS] Archiving <https://builds.apache.org/job/beam_PostCommit_Java_MavenInstall/ws/sdks/java/extensions/pom.xml>
to org.apache.beam/beam-sdks-java-extensions-parent/0.5.0-incubating-SNAPSHOT/beam-sdks-java-extensions-parent-0.5.0-incubating-SNAPSHOT.pom
[JENKINS] Archiving <https://builds.apache.org/job/beam_PostCommit_Java_MavenInstall/ws/examples/pom.xml>
to org.apache.beam/beam-examples-parent/0.5.0-incubating-SNAPSHOT/beam-examples-parent-0.5.0-incubating-SNAPSHOT.pom
channel stopped


Mime
View raw message