beam-commits mailing list archives

Site index · List index
Message view « Date » · « Thread »
Top « Date » · « Thread »
From Apache Jenkins Server <jenk...@builds.apache.org>
Subject Build failed in Jenkins: beam_PostCommit_Python_Verify #841
Date Thu, 08 Dec 2016 02:37:46 GMT
See <https://builds.apache.org/job/beam_PostCommit_Python_Verify/841/>

------------------------------------------
[...truncated 3137 lines...]
  File "<https://builds.apache.org/job/beam_PostCommit_Python_Verify/ws/sdks/python/lib/python2.7/site-packages/dill-0.2.5-py2.7.egg/dill/dill.py",>
line 243, in dumps
    dump(obj, file, protocol, byref, fmode, recurse)#, strictio)
  File "<https://builds.apache.org/job/beam_PostCommit_Python_Verify/ws/sdks/python/lib/python2.7/site-packages/dill-0.2.5-py2.7.egg/dill/dill.py",>
line 236, in dump
    pik.dump(obj)
  File "/usr/lib/python2.7/pickle.py", line 224, in dump
    self.save(obj)
  File "/usr/lib/python2.7/pickle.py", line 286, in save
    f(self, obj) # Call unbound method with explicit self
  File "/usr/lib/python2.7/pickle.py", line 562, in save_tuple
    save(element)
  File "/usr/lib/python2.7/pickle.py", line 331, in save
    self.save_reduce(obj=obj, *rv)
  File "/usr/lib/python2.7/pickle.py", line 419, in save_reduce
    save(state)
  File "/usr/lib/python2.7/pickle.py", line 286, in save
    f(self, obj) # Call unbound method with explicit self
  File "<https://builds.apache.org/job/beam_PostCommit_Python_Verify/ws/sdks/python/apache_beam/internal/pickler.py",>
line 160, in new_save_module_dict
    return old_save_module_dict(pickler, obj)
  File "<https://builds.apache.org/job/beam_PostCommit_Python_Verify/ws/sdks/python/lib/python2.7/site-packages/dill-0.2.5-py2.7.egg/dill/dill.py",>
line 835, in save_module_dict
    StockPickler.save_dict(pickler, obj)
  File "/usr/lib/python2.7/pickle.py", line 649, in save_dict
    self._batch_setitems(obj.iteritems())
  File "/usr/lib/python2.7/pickle.py", line 681, in _batch_setitems
    save(v)
  File "/usr/lib/python2.7/pickle.py", line 286, in save
    f(self, obj) # Call unbound method with explicit self
  File "<https://builds.apache.org/job/beam_PostCommit_Python_Verify/ws/sdks/python/lib/python2.7/site-packages/dill-0.2.5-py2.7.egg/dill/dill.py",>
line 798, in save_function
    obj.__dict__), obj=obj)
  File "/usr/lib/python2.7/pickle.py", line 401, in save_reduce
    save(args)
  File "/usr/lib/python2.7/pickle.py", line 286, in save
    f(self, obj) # Call unbound method with explicit self
  File "/usr/lib/python2.7/pickle.py", line 562, in save_tuple
    save(element)
  File "/usr/lib/python2.7/pickle.py", line 286, in save
    f(self, obj) # Call unbound method with explicit self
  File "/usr/lib/python2.7/pickle.py", line 548, in save_tuple
    save(element)
  File "/usr/lib/python2.7/pickle.py", line 286, in save
    f(self, obj) # Call unbound method with explicit self
  File "<https://builds.apache.org/job/beam_PostCommit_Python_Verify/ws/sdks/python/lib/python2.7/site-packages/dill-0.2.5-py2.7.egg/dill/dill.py",>
line 1039, in save_cell
    pickler.save_reduce(_create_cell, (obj.cell_contents,), obj=obj)
  File "/usr/lib/python2.7/pickle.py", line 401, in save_reduce
    save(args)
  File "/usr/lib/python2.7/pickle.py", line 286, in save
    f(self, obj) # Call unbound method with explicit self
  File "/usr/lib/python2.7/pickle.py", line 548, in save_tuple
    save(element)
  File "/usr/lib/python2.7/pickle.py", line 286, in save
    f(self, obj) # Call unbound method with explicit self
  File "<https://builds.apache.org/job/beam_PostCommit_Python_Verify/ws/sdks/python/lib/python2.7/site-packages/dill-0.2.5-py2.7.egg/dill/dill.py",>
line 798, in save_function
    obj.__dict__), obj=obj)
  File "/usr/lib/python2.7/pickle.py", line 401, in save_reduce
    save(args)
  File "/usr/lib/python2.7/pickle.py", line 286, in save
    f(self, obj) # Call unbound method with explicit self
  File "/usr/lib/python2.7/pickle.py", line 562, in save_tuple
    save(element)
  File "/usr/lib/python2.7/pickle.py", line 286, in save
    f(self, obj) # Call unbound method with explicit self
  File "/usr/lib/python2.7/pickle.py", line 548, in save_tuple
    save(element)
  File "/usr/lib/python2.7/pickle.py", line 286, in save
    f(self, obj) # Call unbound method with explicit self
  File "<https://builds.apache.org/job/beam_PostCommit_Python_Verify/ws/sdks/python/lib/python2.7/site-packages/dill-0.2.5-py2.7.egg/dill/dill.py",>
line 1039, in save_cell
    pickler.save_reduce(_create_cell, (obj.cell_contents,), obj=obj)
  File "/usr/lib/python2.7/pickle.py", line 401, in save_reduce
    save(args)
  File "/usr/lib/python2.7/pickle.py", line 286, in save
    f(self, obj) # Call unbound method with explicit self
  File "/usr/lib/python2.7/pickle.py", line 548, in save_tuple
    save(element)
  File "/usr/lib/python2.7/pickle.py", line 286, in save
    f(self, obj) # Call unbound method with explicit self
  File "<https://builds.apache.org/job/beam_PostCommit_Python_Verify/ws/sdks/python/lib/python2.7/site-packages/dill-0.2.5-py2.7.egg/dill/dill.py",>
line 798, in save_function
    obj.__dict__), obj=obj)
  File "/usr/lib/python2.7/pickle.py", line 401, in save_reduce
    save(args)
  File "/usr/lib/python2.7/pickle.py", line 286, in save
    f(self, obj) # Call unbound method with explicit self
  File "/usr/lib/python2.7/pickle.py", line 562, in save_tuple
    save(element)
  File "/usr/lib/python2.7/pickle.py", line 286, in save
    f(self, obj) # Call unbound method with explicit self
  File "/usr/lib/python2.7/pickle.py", line 548, in save_tuple
    save(element)
  File "/usr/lib/python2.7/pickle.py", line 286, in save
    f(self, obj) # Call unbound method with explicit self
  File "<https://builds.apache.org/job/beam_PostCommit_Python_Verify/ws/sdks/python/lib/python2.7/site-packages/dill-0.2.5-py2.7.egg/dill/dill.py",>
line 1039, in save_cell
    pickler.save_reduce(_create_cell, (obj.cell_contents,), obj=obj)
  File "/usr/lib/python2.7/pickle.py", line 401, in save_reduce
    save(args)
  File "/usr/lib/python2.7/pickle.py", line 286, in save
    f(self, obj) # Call unbound method with explicit self
  File "/usr/lib/python2.7/pickle.py", line 548, in save_tuple
    save(element)
  File "/usr/lib/python2.7/pickle.py", line 286, in save
    f(self, obj) # Call unbound method with explicit self
  File "<https://builds.apache.org/job/beam_PostCommit_Python_Verify/ws/sdks/python/lib/python2.7/site-packages/dill-0.2.5-py2.7.egg/dill/dill.py",>
line 772, in save_function
    if not _locate_function(obj): #, pickler._session):
  File "<https://builds.apache.org/job/beam_PostCommit_Python_Verify/ws/sdks/python/lib/python2.7/site-packages/dill-0.2.5-py2.7.egg/dill/dill.py",>
line 735, in _locate_function
    found = _import_module(obj.__module__ + '.' + obj.__name__, safe=True)
  File "<https://builds.apache.org/job/beam_PostCommit_Python_Verify/ws/sdks/python/lib/python2.7/site-packages/dill-0.2.5-py2.7.egg/dill/dill.py",>
line 726, in _import_module
    return getattr(__import__(module, None, None, [obj]), obj)
  File "<https://builds.apache.org/job/beam_PostCommit_Python_Verify/ws/sdks/python/nose-1.3.7-py2.7.egg/nose/plugins/multiprocess.py",>
line 276, in signalhandler
    raise TimedOutException()
TimedOutException: 'test_undeclared_side_outputs (apache_beam.dataflow_test.DataflowTest)'

======================================================================
ERROR: test_window_transform (apache_beam.dataflow_test.DataflowTest)
----------------------------------------------------------------------
Traceback (most recent call last):
  File "<https://builds.apache.org/job/beam_PostCommit_Python_Verify/ws/sdks/python/nose-1.3.7-py2.7.egg/nose/plugins/multiprocess.py",>
line 812, in run
    test(orig)
  File "<https://builds.apache.org/job/beam_PostCommit_Python_Verify/ws/sdks/python/nose-1.3.7-py2.7.egg/nose/case.py",>
line 45, in __call__
    return self.run(*arg, **kwarg)
  File "<https://builds.apache.org/job/beam_PostCommit_Python_Verify/ws/sdks/python/nose-1.3.7-py2.7.egg/nose/case.py",>
line 133, in run
    self.runTest(result)
  File "<https://builds.apache.org/job/beam_PostCommit_Python_Verify/ws/sdks/python/nose-1.3.7-py2.7.egg/nose/case.py",>
line 151, in runTest
    test(result)
  File "/usr/lib/python2.7/unittest/case.py", line 395, in __call__
    return self.run(*args, **kwds)
  File "/usr/lib/python2.7/unittest/case.py", line 331, in run
    testMethod()
  File "<https://builds.apache.org/job/beam_PostCommit_Python_Verify/ws/sdks/python/apache_beam/dataflow_test.py",>
line 411, in test_window_transform
    pipeline.run()
  File "<https://builds.apache.org/job/beam_PostCommit_Python_Verify/ws/sdks/python/apache_beam/pipeline.py",>
line 159, in run
    return self.runner.run(self)
  File "<https://builds.apache.org/job/beam_PostCommit_Python_Verify/ws/sdks/python/apache_beam/runners/dataflow_runner.py",>
line 175, in run
    pipeline.options, job_version)
  File "<https://builds.apache.org/job/beam_PostCommit_Python_Verify/ws/sdks/python/apache_beam/internal/apiclient.py",>
line 360, in __init__
    credentials = get_service_credentials()
  File "<https://builds.apache.org/job/beam_PostCommit_Python_Verify/ws/sdks/python/apache_beam/internal/auth.py",>
line 171, in get_service_credentials
    credentials.get_access_token()
  File "build/bdist.linux-x86_64/egg/oauth2client/client.py", line 677, in get_access_token
    self.refresh(http)
  File "build/bdist.linux-x86_64/egg/oauth2client/client.py", line 560, in refresh
    self._refresh(http.request)
  File "<https://builds.apache.org/job/beam_PostCommit_Python_Verify/ws/sdks/python/apache_beam/internal/auth.py",>
line 113, in _refresh
    output, _ = gcloud_process.communicate()
  File "/usr/lib/python2.7/subprocess.py", line 791, in communicate
    stdout = _eintr_retry_call(self.stdout.read)
  File "/usr/lib/python2.7/subprocess.py", line 476, in _eintr_retry_call
    return func(*args)
  File "<https://builds.apache.org/job/beam_PostCommit_Python_Verify/ws/sdks/python/nose-1.3.7-py2.7.egg/nose/plugins/multiprocess.py",>
line 276, in signalhandler
    raise TimedOutException()
TimedOutException: 'test_window_transform (apache_beam.dataflow_test.DataflowTest)'

======================================================================
ERROR: test_word_count (apache_beam.dataflow_test.DataflowTest)
----------------------------------------------------------------------
Traceback (most recent call last):
  File "<https://builds.apache.org/job/beam_PostCommit_Python_Verify/ws/sdks/python/nose-1.3.7-py2.7.egg/nose/plugins/multiprocess.py",>
line 812, in run
    test(orig)
  File "<https://builds.apache.org/job/beam_PostCommit_Python_Verify/ws/sdks/python/nose-1.3.7-py2.7.egg/nose/case.py",>
line 45, in __call__
    return self.run(*arg, **kwarg)
  File "<https://builds.apache.org/job/beam_PostCommit_Python_Verify/ws/sdks/python/nose-1.3.7-py2.7.egg/nose/case.py",>
line 133, in run
    self.runTest(result)
  File "<https://builds.apache.org/job/beam_PostCommit_Python_Verify/ws/sdks/python/nose-1.3.7-py2.7.egg/nose/case.py",>
line 151, in runTest
    test(result)
  File "/usr/lib/python2.7/unittest/case.py", line 395, in __call__
    return self.run(*args, **kwds)
  File "/usr/lib/python2.7/unittest/case.py", line 331, in run
    testMethod()
  File "<https://builds.apache.org/job/beam_PostCommit_Python_Verify/ws/sdks/python/apache_beam/dataflow_test.py",>
line 70, in test_word_count
    pipeline.run()
  File "<https://builds.apache.org/job/beam_PostCommit_Python_Verify/ws/sdks/python/apache_beam/pipeline.py",>
line 159, in run
    return self.runner.run(self)
  File "<https://builds.apache.org/job/beam_PostCommit_Python_Verify/ws/sdks/python/apache_beam/runners/dataflow_runner.py",>
line 165, in run
    super(DataflowPipelineRunner, self).run(pipeline)
  File "<https://builds.apache.org/job/beam_PostCommit_Python_Verify/ws/sdks/python/apache_beam/runners/runner.py",>
line 97, in run
    pipeline.visit(RunVisitor(self))
  File "<https://builds.apache.org/job/beam_PostCommit_Python_Verify/ws/sdks/python/apache_beam/pipeline.py",>
line 182, in visit
    self._root_transform().visit(visitor, self, visited)
  File "<https://builds.apache.org/job/beam_PostCommit_Python_Verify/ws/sdks/python/apache_beam/pipeline.py",>
line 419, in visit
    part.visit(visitor, pipeline, visited)
  File "<https://builds.apache.org/job/beam_PostCommit_Python_Verify/ws/sdks/python/apache_beam/pipeline.py",>
line 419, in visit
    part.visit(visitor, pipeline, visited)
  File "<https://builds.apache.org/job/beam_PostCommit_Python_Verify/ws/sdks/python/apache_beam/pipeline.py",>
line 422, in visit
    visitor.visit_transform(self)
  File "<https://builds.apache.org/job/beam_PostCommit_Python_Verify/ws/sdks/python/apache_beam/runners/runner.py",>
line 92, in visit_transform
    self.runner.run_transform(transform_node)
  File "<https://builds.apache.org/job/beam_PostCommit_Python_Verify/ws/sdks/python/apache_beam/runners/runner.py",>
line 167, in run_transform
    return m(transform_node)
  File "<https://builds.apache.org/job/beam_PostCommit_Python_Verify/ws/sdks/python/apache_beam/runners/dataflow_runner.py",>
line 408, in run_ParDo
    step.add_property(PropertyNames.SERIALIZED_FN, pickler.dumps(fn_data))
  File "<https://builds.apache.org/job/beam_PostCommit_Python_Verify/ws/sdks/python/apache_beam/internal/pickler.py",>
line 186, in dumps
    s = dill.dumps(o)
  File "<https://builds.apache.org/job/beam_PostCommit_Python_Verify/ws/sdks/python/lib/python2.7/site-packages/dill-0.2.5-py2.7.egg/dill/dill.py",>
line 243, in dumps
    dump(obj, file, protocol, byref, fmode, recurse)#, strictio)
  File "<https://builds.apache.org/job/beam_PostCommit_Python_Verify/ws/sdks/python/lib/python2.7/site-packages/dill-0.2.5-py2.7.egg/dill/dill.py",>
line 236, in dump
    pik.dump(obj)
  File "/usr/lib/python2.7/pickle.py", line 224, in dump
    self.save(obj)
  File "/usr/lib/python2.7/pickle.py", line 286, in save
    f(self, obj) # Call unbound method with explicit self
  File "/usr/lib/python2.7/pickle.py", line 562, in save_tuple
    save(element)
  File "/usr/lib/python2.7/pickle.py", line 331, in save
    self.save_reduce(obj=obj, *rv)
  File "/usr/lib/python2.7/pickle.py", line 419, in save_reduce
    save(state)
  File "/usr/lib/python2.7/pickle.py", line 286, in save
    f(self, obj) # Call unbound method with explicit self
  File "<https://builds.apache.org/job/beam_PostCommit_Python_Verify/ws/sdks/python/apache_beam/internal/pickler.py",>
line 160, in new_save_module_dict
    return old_save_module_dict(pickler, obj)
  File "<https://builds.apache.org/job/beam_PostCommit_Python_Verify/ws/sdks/python/lib/python2.7/site-packages/dill-0.2.5-py2.7.egg/dill/dill.py",>
line 835, in save_module_dict
    StockPickler.save_dict(pickler, obj)
  File "/usr/lib/python2.7/pickle.py", line 649, in save_dict
    self._batch_setitems(obj.iteritems())
  File "/usr/lib/python2.7/pickle.py", line 681, in _batch_setitems
    save(v)
  File "/usr/lib/python2.7/pickle.py", line 286, in save
    f(self, obj) # Call unbound method with explicit self
  File "<https://builds.apache.org/job/beam_PostCommit_Python_Verify/ws/sdks/python/lib/python2.7/site-packages/dill-0.2.5-py2.7.egg/dill/dill.py",>
line 798, in save_function
    obj.__dict__), obj=obj)
  File "/usr/lib/python2.7/pickle.py", line 401, in save_reduce
    save(args)
  File "/usr/lib/python2.7/pickle.py", line 286, in save
    f(self, obj) # Call unbound method with explicit self
  File "/usr/lib/python2.7/pickle.py", line 562, in save_tuple
    save(element)
  File "/usr/lib/python2.7/pickle.py", line 286, in save
    f(self, obj) # Call unbound method with explicit self
  File "<https://builds.apache.org/job/beam_PostCommit_Python_Verify/ws/sdks/python/lib/python2.7/site-packages/dill-0.2.5-py2.7.egg/dill/dill.py",>
line 766, in save_code
    pickler.save_reduce(CodeType, args, obj=obj)
  File "/usr/lib/python2.7/pickle.py", line 401, in save_reduce
    save(args)
  File "/usr/lib/python2.7/pickle.py", line 286, in save
    f(self, obj) # Call unbound method with explicit self
  File "/usr/lib/python2.7/pickle.py", line 562, in save_tuple
    save(element)
  File "/usr/lib/python2.7/pickle.py", line 286, in save
    f(self, obj) # Call unbound method with explicit self
  File "/usr/lib/python2.7/pickle.py", line 489, in save_string
    self.memoize(obj)
  File "/usr/lib/python2.7/pickle.py", line 246, in memoize
    self.write(self.put(memo_len))
  File "/usr/lib/python2.7/pickle.py", line 253, in put
    return BINPUT + chr(i)
  File "<https://builds.apache.org/job/beam_PostCommit_Python_Verify/ws/sdks/python/nose-1.3.7-py2.7.egg/nose/plugins/multiprocess.py",>
line 276, in signalhandler
    raise TimedOutException()
TimedOutException: 'test_word_count (apache_beam.dataflow_test.DataflowTest)'

----------------------------------------------------------------------
Ran 21 tests in 362.814s

FAILED (errors=19)
Build step 'Execute shell' marked build as failure

Mime
View raw message