beam-commits mailing list archives

Site index · List index
Message view « Date » · « Thread »
Top « Date » · « Thread »
From Apache Jenkins Server <jenk...@builds.apache.org>
Subject Build failed in Jenkins: beam_PostCommit_Java_RunnableOnService_Gearpump #157
Date Wed, 28 Dec 2016 00:51:11 GMT
See <https://builds.apache.org/job/beam_PostCommit_Java_RunnableOnService_Gearpump/157/>

------------------------------------------
[...truncated 29644 lines...]
  ApproximateUniqueTest.testApproximateUniqueWithSmallInput:70 » Runtime Failed ...
  CombineFnsTest.testComposedCombine:126 » Runtime Failed to construct instance ...
  CombineFnsTest.testComposedCombineNullValues:243 » Runtime Failed to construct...
  CombineFnsTest.testComposedCombineWithContext:181 » Runtime Failed to construc...
  CombineTest.testAccumulatingCombine:477->runTestAccumulatingCombine:236 » Runtime
  CombineTest.testAccumulatingCombineEmpty:483->runTestAccumulatingCombine:236 » Runtime
  CombineTest.testBasicCombine:221->runTestBasicCombine:200 » Runtime Failed to ...
  CombineTest.testBasicCombineEmpty:229->runTestBasicCombine:200 » Runtime Faile...
  CombineTest.testCombineGloballyAsSingletonView:635 » Runtime Failed to constru...
  CombineTest.testCombinePerKeyPrimitiveDisplayData:712 » Runtime Failed to cons...
  CombineTest.testCombinePerKeyWithHotKeyFanoutPrimitiveDisplayData:729 » Runtime
  CombineTest.testFixedWindowsCombine:256 » Runtime Failed to construct instance...
  CombineTest.testFixedWindowsCombineWithContext:282 » Runtime Failed to constru...
  CombineTest.testGlobalCombineWithDefaultsAndTriggers:368 » Runtime Failed to c...
  CombineTest.testHotKeyCombining:520 » Runtime Failed to construct instance fro...
  CombineTest.testHotKeyCombiningWithAccumulationMode:555 » Runtime Failed to co...
  CombineTest.testSessionsCombine:395 » Runtime Failed to construct instance fro...
  CombineTest.testSessionsCombineWithContext:420 » Runtime Failed to construct i...
  CombineTest.testSimpleCombine:171->runTestSimpleCombine:120 » Runtime Failed t...
  CombineTest.testSimpleCombineEmpty:193->runTestSimpleCombine:120 » Runtime Fai...
  CombineTest.testSimpleCombineWithContext:178->runTestSimpleCombineWithContext:141 »
Runtime
  CombineTest.testSimpleCombineWithContextEmpty:186->runTestSimpleCombineWithContext:141
» Runtime
  CombineTest.testSlidingWindowsCombineWithContext:319 » Runtime Failed to const...
  CombineTest.testWindowedCombineEmpty:462 » Runtime Failed to construct instanc...
  CountTest.testCountGloballyBasic:88 » Runtime Failed to construct instance fro...
  CountTest.testCountGloballyEmpty:103 » Runtime Failed to construct instance fr...
  CountTest.testCountPerElementBasic:52 » Runtime Failed to construct instance f...
  CountTest.testCountPerElementEmpty:74 » Runtime Failed to construct instance f...
  CreateTest.testCreate:83 » Runtime Failed to construct instance from factory m...
  CreateTest.testCreateEmpty:96 » Runtime Failed to construct instance from fact...
  CreateTest.testCreateTimestamped:238 » Runtime Failed to construct instance fr...
  CreateTest.testCreateTimestampedEmpty:257 » Runtime Failed to construct instan...
  CreateTest.testCreateWithKVVoidType:307 » Runtime Failed to construct instance...
  CreateTest.testCreateWithNullsAndValues:140 » Runtime Failed to construct inst...
  CreateTest.testCreateWithUnserializableElements:219 » Runtime Failed to constr...
  CreateTest.testCreateWithVoidType:298 » Runtime Failed to construct instance f...
  DistinctTest.testDistinct:56 » Runtime Failed to construct instance from facto...
  DistinctTest.testDistinctEmpty:75 » Runtime Failed to construct instance from ...
  DistinctTest.testDistinctWithRepresentativeValue:118 » Runtime Failed to const...
  FilterTest.testFilterByPredicate:89 » Runtime Failed to construct instance fro...
  FilterTest.testFilterGreaterThan:115 » Runtime Failed to construct instance fr...
  FilterTest.testFilterGreaterThanEq:141 » Runtime Failed to construct instance ...
  FilterTest.testFilterLessThan:102 » Runtime Failed to construct instance from ...
  FilterTest.testFilterLessThanEq:128 » Runtime Failed to construct instance fro...
  FilterTest.testIdentityFilterByPredicate:63 » Runtime Failed to construct inst...
  FilterTest.testNoFilterByPredicate:76 » Runtime Failed to construct instance f...
  FlattenTest.testEmptyFlattenAsSideInput:157 » Runtime Failed to construct inst...
  FlattenTest.testFlattenInputMultipleCopies:123 » Runtime Failed to construct i...
  FlattenTest.testFlattenIterables:214 » Runtime Failed to construct instance fr...
  FlattenTest.testFlattenIterablesCollections:265 » Runtime Failed to construct ...
  FlattenTest.testFlattenIterablesEmpty:283 » Runtime Failed to construct instan...
  FlattenTest.testFlattenIterablesLists:232 » Runtime Failed to construct instan...
  FlattenTest.testFlattenIterablesSets:247 » Runtime Failed to construct instanc...
  FlattenTest.testFlattenPCollectionList:77 » Runtime Failed to construct instan...
  FlattenTest.testFlattenPCollectionListEmpty:110 » Runtime Failed to construct ...
  FlattenTest.testFlattenPCollectionListEmptyThenParDo:183 » Runtime Failed to c...
  FlattenTest.testFlattenPCollectionListThenParDo:93 » Runtime Failed to constru...
  GroupByKeyTest.testGroupByKey:98 » Runtime Failed to construct instance from f...
  GroupByKeyTest.testGroupByKeyAndWindows:140 » Runtime Failed to construct inst...
  GroupByKeyTest.testGroupByKeyEmpty:177 » Runtime Failed to construct instance ...
  GroupByKeyTest.testGroupByKeyWithBadEqualsHashCode:411 » Runtime Failed to con...
  GroupByKeyTest.testOutputTimeFnEarliest:334 » Runtime Failed to construct inst...
  GroupByKeyTest.testOutputTimeFnLatest:356 » Runtime Failed to construct instan...
  KeysTest.testKeys:56 » Runtime Failed to construct instance from factory metho...
  KeysTest.testKeysEmpty:72 » Runtime Failed to construct instance from factory ...
  KvSwapTest.testKvSwap:56 » Runtime Failed to construct instance from factory m...
  KvSwapTest.testKvSwapEmpty:78 » Runtime Failed to construct instance from fact...
  MapElementsTest.testPrimitiveDisplayData:265 » Runtime Failed to construct ins...
  ParDoLifecycleTest.testFnCallSequence:130 » Runtime Failed to construct instan...
  ParDoLifecycleTest.testFnCallSequenceMulti:142 » Runtime Failed to construct i...
  ParDoLifecycleTest.testOldFnCallSequence:49 » Runtime Failed to construct inst...
  ParDoLifecycleTest.testOldFnCallSequenceMulti:61 » Runtime Failed to construct...
  ParDoTest.testBagState:1565 » Runtime Failed to construct instance from factor...
  ParDoTest.testBagStateSideInput:1579 » Runtime Failed to construct instance fr...
  ParDoTest.testMultiOutputParDoWithSideInputs:635 » Runtime Failed to construct...
  ParDoTest.testMultiOutputParDoWithSideInputsIsCumulative:673 » Runtime Failed ...
  ParDoTest.testParDo:305 » Runtime Failed to construct instance from factory me...
  ParDoTest.testParDo2:322 » Runtime Failed to construct instance from factory m...
  ParDoTest.testParDoEmpty:339 » Runtime Failed to construct instance from facto...
  ParDoTest.testParDoEmptyOutputs:357 » Runtime Failed to construct instance fro...
  ParDoTest.testParDoEmptyWithSideOutputs:416 » Runtime Failed to construct inst...
  ParDoTest.testParDoInCustomTransform:883 » Runtime Failed to construct instanc...
  ParDoTest.testParDoWithEmptySideOutputs:457 » Runtime Failed to construct inst...
  ParDoTest.testParDoWithOnlySideOutputs:485 » Runtime Failed to construct insta...
  ParDoTest.testParDoWithSideInputs:569 » Runtime Failed to construct instance f...
  ParDoTest.testParDoWithSideInputsIsCumulative:601 » Runtime Failed to construc...
  ParDoTest.testParDoWithSideOutputs:373 » Runtime Failed to construct instance ...
  ParDoTest.testSideInputsWithMultipleWindows:749 » Runtime Failed to construct ...
  ParDoTest.testSimpleEventTimeTimer:1661 » Runtime Failed to construct instance...
  ParDoTest.testValueStateSideOutput:1517 » Runtime Failed to construct instance...
  ParDoTest.testValueStateSimple:1480 » Runtime Failed to construct instance fro...
  ParDoTest.testWindowingInStartAndFinishBundle:1356 » Runtime Failed to constru...
  PartitionTest.testEvenOddPartition:69 » Runtime Failed to construct instance f...
  SampleTest.testPickAny:238->runPickAnyTest:220 » Runtime Failed to construct i...
  SampleTest.testPickAnyWhenEmpty:255->runPickAnyTest:220 » Runtime Failed to co...
  SampleTest.testSample:108 » Runtime Failed to construct instance from factory ...
  SampleTest.testSampleEmpty:123 » Runtime Failed to construct instance from fac...
  SampleTest.testSampleInsufficientElements:153 » Runtime Failed to construct in...
  SampleTest.testSampleMultiplicity:177 » Runtime Failed to construct instance f...
  SampleTest.testSampleZero:138 » Runtime Failed to construct instance from fact...
  SplittableDoFnTest.testLateData:347 » Runtime Failed to construct instance fro...
  SplittableDoFnTest.testLifecycleMethods:442 » Runtime Failed to construct inst...
  SplittableDoFnTest.testOutputAfterCheckpoint:280 » Runtime Failed to construct...
  SplittableDoFnTest.testPairWithIndexBasic:157 » Runtime Failed to construct in...
  SplittableDoFnTest.testPairWithIndexWindowedTimestamped:183 » Runtime Failed t...
  SplittableDoFnTest.testSideInputsAndOutputs:320 » Runtime Failed to construct ...
  ValuesTest.testValues:58 » Runtime Failed to construct instance from factory m...
  ValuesTest.testValuesEmpty:75 » Runtime Failed to construct instance from fact...
  ViewTest.testCombinedMapSideInput:1148 » Runtime Failed to construct instance ...
  ViewTest.testEmptyIterableSideInput:404 » Runtime Failed to construct instance...
  ViewTest.testEmptyListSideInput:265 » Runtime Failed to construct instance fro...
  ViewTest.testEmptyMapSideInput:1007 » Runtime Failed to construct instance fro...
  ViewTest.testEmptyMapSideInputWithNonDeterministicKeyCoder:1036 » Runtime Fail...
  ViewTest.testEmptyMultimapSideInput:694 » Runtime Failed to construct instance...
  ViewTest.testEmptyMultimapSideInputWithNonDeterministicKeyCoder:723 » Runtime ...
  ViewTest.testIterableSideInput:338 » Runtime Failed to construct instance from...
  ViewTest.testIterableSideInputIsImmutable:430 » Runtime Failed to construct in...
  ViewTest.testListSideInput:197 » Runtime Failed to construct instance from fac...
  ViewTest.testListSideInputIsImmutable:292 » Runtime Failed to construct instan...
  ViewTest.testMapAsEntrySetSideInput:828 » Runtime Failed to construct instance...
  ViewTest.testMapSideInput:801 » Runtime Failed to construct instance from fact...
  ViewTest.testMapSideInputIsImmutable:1101 » Runtime Failed to construct instan...
  ViewTest.testMapSideInputWithNonDeterministicKeyCoder:858 » Runtime Failed to ...
  ViewTest.testMultimapAsEntrySetSideInput:490 » Runtime Failed to construct ins...
  ViewTest.testMultimapSideInput:462 » Runtime Failed to construct instance from...
  ViewTest.testMultimapSideInputIsImmutable:753 » Runtime Failed to construct in...
  ViewTest.testMultimapSideInputWithNonDeterministicKeyCoder:542 » Runtime Faile...
  ViewTest.testSideInputWithNestedIterables:1302 » Runtime Failed to construct i...
  ViewTest.testSideInputWithNullDefault:1272 » Runtime Failed to construct insta...
  ViewTest.testSingletonSideInput:92 » Runtime Failed to construct instance from...
  ViewTest.testWindowedIterableSideInput:364 » Runtime Failed to construct insta...
  ViewTest.testWindowedListSideInput:224 » Runtime Failed to construct instance ...
  ViewTest.testWindowedMapAsEntrySetSideInput:925 » Runtime Failed to construct ...
  ViewTest.testWindowedMapSideInput:887 » Runtime Failed to construct instance f...
  ViewTest.testWindowedMapSideInputWithNonDeterministicKeyCoder:967 » Runtime Fa...
  ViewTest.testWindowedMultimapAsEntrySetSideInput:611 » Runtime Failed to const...
  ViewTest.testWindowedMultimapSideInput:572 » Runtime Failed to construct insta...
  ViewTest.testWindowedMultimapSideInputWithNonDeterministicKeyCoder:654 » Runtime
  ViewTest.testWindowedSideInputFixedToFixed:1175 » Runtime Failed to construct ...
  ViewTest.testWindowedSideInputFixedToFixedWithDefault:1241 » Runtime Failed to...
  ViewTest.testWindowedSideInputFixedToGlobal:1208 » Runtime Failed to construct...
  ViewTest.testWindowedSingletonSideInput:115 » Runtime Failed to construct inst...
  WithTimestampsTest.withTimestampsBackwardsInTimeAndWithAllowedTimestampSkewShouldSucceed:123
» Runtime
  WithTimestampsTest.withTimestampsShouldApplyTimestamps:50 » Runtime Failed to ...
  WithTimestampsTest.withTimestampsWithNullFnShouldThrowOnConstruction:200 » Runtime
  CoGroupByKeyTest.testCoGroupByKey:267 » Runtime Failed to construct instance f...
  CoGroupByKeyTest.testCoGroupByKeyGetOnly:127 » Runtime Failed to construct ins...
  CoGroupByKeyTest.testCoGroupByKeyHandleResults:459 » Runtime Failed to constru...
  CoGroupByKeyTest.testCoGroupByKeyWithWindowing:489 » Runtime Failed to constru...
  WindowTest.testOutputTimeFnDefault:188 » Runtime Failed to construct instance ...
  WindowTest.testOutputTimeFnEndOfWindow:222 » Runtime Failed to construct insta...
  WindowingTest.testMergingWindowing:143 » Runtime Failed to construct instance ...
  WindowingTest.testNonPartitioningWindowing:117 » Runtime Failed to construct i...
  WindowingTest.testPartitioningWindowing:91 » Runtime Failed to construct insta...
  WindowingTest.testWindowPreservation:165 » Runtime Failed to construct instanc...
  ReshuffleTest.testJustReshuffle:71 » Runtime Failed to construct instance from...
  ReshuffleTest.testReshuffleAfterFixedWindows:164 » Runtime Failed to construct...
  ReshuffleTest.testReshuffleAfterFixedWindowsAndGroupByKey:116 » Runtime Failed...
  ReshuffleTest.testReshuffleAfterSessionsAndGroupByKey:92 » Runtime Failed to c...
  ReshuffleTest.testReshuffleAfterSlidingWindows:188 » Runtime Failed to constru...
  ReshuffleTest.testReshuffleAfterSlidingWindowsAndGroupByKey:140 » Runtime Fail...
  PCollectionTupleTest.testComposePCollectionTuple:64 » Runtime Failed to constr...

Tests run: 203, Failures: 0, Errors: 200, Skipped: 3

[JENKINS] Archiving disabled
[JENKINS] Archiving disabled
[JENKINS] Archiving disabled
[JENKINS] Archiving disabled
[JENKINS] Archiving disabled
[JENKINS] Archiving disabled
[JENKINS] Archiving disabled
2016-12-28T00:51:10.688 [INFO] ------------------------------------------------------------------------
2016-12-28T00:51:10.688 [INFO] Reactor Summary:
2016-12-28T00:51:10.688 [INFO] 
2016-12-28T00:51:10.688 [INFO] Apache Beam :: Parent .............................. SUCCESS
[ 20.740 s]
2016-12-28T00:51:10.688 [INFO] Apache Beam :: SDKs :: Java :: Build Tools ......... SUCCESS
[  4.257 s]
2016-12-28T00:51:10.688 [INFO] Apache Beam :: SDKs ................................ SUCCESS
[  0.421 s]
2016-12-28T00:51:10.688 [INFO] Apache Beam :: SDKs :: Java ........................ SUCCESS
[  0.408 s]
2016-12-28T00:51:10.688 [INFO] Apache Beam :: SDKs :: Java :: Core ................ SUCCESS
[02:19 min]
2016-12-28T00:51:10.688 [INFO] Apache Beam :: Runners ............................. SUCCESS
[  0.495 s]
2016-12-28T00:51:10.688 [INFO] Apache Beam :: Runners :: Core Java ................ SUCCESS
[ 13.404 s]
2016-12-28T00:51:10.688 [INFO] Apache Beam :: Runners :: Gearpump ................. FAILURE
[ 26.247 s]
2016-12-28T00:51:10.688 [INFO] ------------------------------------------------------------------------
2016-12-28T00:51:10.688 [INFO] BUILD FAILURE
2016-12-28T00:51:10.688 [INFO] ------------------------------------------------------------------------
2016-12-28T00:51:10.688 [INFO] Total time: 03:44 min
2016-12-28T00:51:10.689 [INFO] Finished at: 2016-12-28T00:51:10+00:00
2016-12-28T00:51:12.014 [INFO] Final Memory: 222M/1458M
2016-12-28T00:51:12.014 [INFO] ------------------------------------------------------------------------
2016-12-28T00:51:12.068 [ERROR] Failed to execute goal org.apache.maven.plugins:maven-surefire-plugin:2.19.1:test
(runnable-on-service-tests) on project beam-runners-gearpump: There are test failures.
2016-12-28T00:51:12.068 [ERROR] 
2016-12-28T00:51:12.068 [ERROR] Please refer to <https://builds.apache.org/job/beam_PostCommit_Java_RunnableOnService_Gearpump/ws/runners/gearpump/target/surefire-reports>
for the individual test results.
2016-12-28T00:51:12.068 [ERROR] -> [Help 1]
org.apache.maven.lifecycle.LifecycleExecutionException: Failed to execute goal org.apache.maven.plugins:maven-surefire-plugin:2.19.1:test
(runnable-on-service-tests) on project beam-runners-gearpump: There are test failures.

Please refer to <https://builds.apache.org/job/beam_PostCommit_Java_RunnableOnService_Gearpump/ws/runners/gearpump/target/surefire-reports>
for the individual test results.
	at org.apache.maven.lifecycle.internal.MojoExecutor.execute(MojoExecutor.java:212)
	at org.apache.maven.lifecycle.internal.MojoExecutor.execute(MojoExecutor.java:153)
	at org.apache.maven.lifecycle.internal.MojoExecutor.execute(MojoExecutor.java:145)
	at org.apache.maven.lifecycle.internal.LifecycleModuleBuilder.buildProject(LifecycleModuleBuilder.java:116)
	at org.apache.maven.lifecycle.internal.LifecycleModuleBuilder.buildProject(LifecycleModuleBuilder.java:80)
	at org.apache.maven.lifecycle.internal.builder.singlethreaded.SingleThreadedBuilder.build(SingleThreadedBuilder.java:51)
	at org.apache.maven.lifecycle.internal.LifecycleStarter.execute(LifecycleStarter.java:128)
	at org.apache.maven.DefaultMaven.doExecute(DefaultMaven.java:307)
	at org.apache.maven.DefaultMaven.doExecute(DefaultMaven.java:193)
	at org.apache.maven.DefaultMaven.execute(DefaultMaven.java:106)
	at org.jvnet.hudson.maven3.launcher.Maven32Launcher.main(Maven32Launcher.java:132)
	at sun.reflect.NativeMethodAccessorImpl.invoke0(Native Method)
	at sun.reflect.NativeMethodAccessorImpl.invoke(NativeMethodAccessorImpl.java:62)
	at sun.reflect.DelegatingMethodAccessorImpl.invoke(DelegatingMethodAccessorImpl.java:43)
	at java.lang.reflect.Method.invoke(Method.java:498)
	at org.codehaus.plexus.classworlds.launcher.Launcher.launchStandard(Launcher.java:330)
	at org.codehaus.plexus.classworlds.launcher.Launcher.launch(Launcher.java:238)
	at jenkins.maven3.agent.Maven32Main.launch(Maven32Main.java:186)
	at sun.reflect.NativeMethodAccessorImpl.invoke0(Native Method)
	at sun.reflect.NativeMethodAccessorImpl.invoke(NativeMethodAccessorImpl.java:62)
	at sun.reflect.DelegatingMethodAccessorImpl.invoke(DelegatingMethodAccessorImpl.java:43)
	at java.lang.reflect.Method.invoke(Method.java:498)
	at hudson.maven.Maven3Builder.call(Maven3Builder.java:136)
	at hudson.maven.Maven3Builder.call(Maven3Builder.java:71)
	at hudson.remoting.UserRequest.perform(UserRequest.java:153)
	at hudson.remoting.UserRequest.perform(UserRequest.java:50)
	at hudson.remoting.Request$2.run(Request.java:332)
	at hudson.remoting.InterceptingExecutorService$1.call(InterceptingExecutorService.java:68)
	at java.util.concurrent.FutureTask.run(FutureTask.java:266)
	at java.util.concurrent.ThreadPoolExecutor.runWorker(ThreadPoolExecutor.java:1142)
	at java.util.concurrent.ThreadPoolExecutor$Worker.run(ThreadPoolExecutor.java:617)
	at java.lang.Thread.run(Thread.java:745)
Caused by: org.apache.maven.plugin.MojoFailureException: There are test failures.

Please refer to <https://builds.apache.org/job/beam_PostCommit_Java_RunnableOnService_Gearpump/ws/runners/gearpump/target/surefire-reports>
for the individual test results.
	at org.apache.maven.plugin.surefire.SurefireHelper.reportExecution(SurefireHelper.java:91)
	at org.apache.maven.plugin.surefire.SurefirePlugin.handleSummary(SurefirePlugin.java:320)
	at org.apache.maven.plugin.surefire.AbstractSurefireMojo.executeAfterPreconditionsChecked(AbstractSurefireMojo.java:892)
	at org.apache.maven.plugin.surefire.AbstractSurefireMojo.execute(AbstractSurefireMojo.java:755)
	at org.apache.maven.plugin.DefaultBuildPluginManager.executeMojo(DefaultBuildPluginManager.java:134)
	at org.apache.maven.lifecycle.internal.MojoExecutor.execute(MojoExecutor.java:208)
	... 31 more
2016-12-28T00:51:12.070 [ERROR] 
2016-12-28T00:51:12.071 [ERROR] Re-run Maven using the -X switch to enable full debug logging.
2016-12-28T00:51:12.071 [ERROR] 
2016-12-28T00:51:12.071 [ERROR] For more information about the errors and possible solutions,
please read the following articles:
2016-12-28T00:51:12.071 [ERROR] [Help 1] http://cwiki.apache.org/confluence/display/MAVEN/MojoFailureException
2016-12-28T00:51:12.071 [ERROR] 
2016-12-28T00:51:12.071 [ERROR] After correcting the problems, you can resume the build with
the command
2016-12-28T00:51:12.071 [ERROR]   mvn <goals> -rf :beam-runners-gearpump
channel stopped
Sending e-mails to: commits@beam.apache.org davor@google.com fjp@google.com thw@apache.org
gaugupt3@cisco.com owenzhang1990@gmail.com klk@google.com jbonofre@apache.org jesse@smokinghand.com
dhalperi@google.com markliu@markliu0.mtv.corp.google.com github@nakomis.com diominay@gmail.com
swegner@google.com mxm@apache.org aljoscha.krettek@gmail.com bchambers@google.com joshualitt@joshualitt.mtv.corp.google.com
mariusz89016@gmail.com tgroh@google.com ansela@paypal.com peihe@google.com lcwik@google.com
amarouni@talend.com iemejia@gmail.com kirpichov@google.com

Mime
View raw message