beam-commits mailing list archives

Site index · List index
Message view « Date » · « Thread »
Top « Date » · « Thread »
From Apache Jenkins Server <jenk...@builds.apache.org>
Subject Build failed in Jenkins: beam_PostCommit_Java_RunnableOnService_Spark #518
Date Wed, 21 Dec 2016 06:07:26 GMT
See <https://builds.apache.org/job/beam_PostCommit_Java_RunnableOnService_Spark/518/>

------------------------------------------
[...truncated 3134 lines...]
Tests run: 3, Failures: 0, Errors: 0, Skipped: 0, Time elapsed: 0.071 sec - in org.apache.beam.sdk.transforms.WithKeysTest
Running org.apache.beam.sdk.transforms.CountTest
Tests run: 4, Failures: 0, Errors: 0, Skipped: 0, Time elapsed: 0.128 sec - in org.apache.beam.sdk.transforms.CountTest
Running org.apache.beam.sdk.transforms.FlattenTest
Tests run: 14, Failures: 0, Errors: 0, Skipped: 0, Time elapsed: 0.364 sec - in org.apache.beam.sdk.transforms.FlattenTest
Running org.apache.beam.sdk.transforms.KeysTest
Tests run: 2, Failures: 0, Errors: 0, Skipped: 0, Time elapsed: 0.036 sec - in org.apache.beam.sdk.transforms.KeysTest
Running org.apache.beam.sdk.transforms.LatestTest
Tests run: 4, Failures: 0, Errors: 0, Skipped: 0, Time elapsed: 0.192 sec - in org.apache.beam.sdk.transforms.LatestTest
Running org.apache.beam.sdk.transforms.MapElementsTest
Tests run: 5, Failures: 0, Errors: 0, Skipped: 0, Time elapsed: 0.147 sec - in org.apache.beam.sdk.transforms.MapElementsTest
Running org.apache.beam.sdk.transforms.WithTimestampsTest
Tests run: 5, Failures: 0, Errors: 0, Skipped: 0, Time elapsed: 0.206 sec - in org.apache.beam.sdk.transforms.WithTimestampsTest
Running org.apache.beam.sdk.transforms.TopTest
Tests run: 3, Failures: 0, Errors: 0, Skipped: 0, Time elapsed: 0.474 sec - in org.apache.beam.sdk.transforms.TopTest
Running org.apache.beam.sdk.transforms.FlatMapElementsTest
Tests run: 3, Failures: 0, Errors: 0, Skipped: 0, Time elapsed: 0.054 sec - in org.apache.beam.sdk.transforms.FlatMapElementsTest
Running org.apache.beam.sdk.transforms.ApproximateUniqueTest
Tests run: 6, Failures: 0, Errors: 0, Skipped: 0, Time elapsed: 3.867 sec - in org.apache.beam.sdk.transforms.ApproximateUniqueTest
Running org.apache.beam.sdk.transforms.ViewTest
Tests run: 37, Failures: 0, Errors: 0, Skipped: 0, Time elapsed: 2.922 sec - in org.apache.beam.sdk.transforms.ViewTest
Running org.apache.beam.sdk.transforms.CombineFnsTest
Tests run: 3, Failures: 0, Errors: 0, Skipped: 0, Time elapsed: 0.289 sec - in org.apache.beam.sdk.transforms.CombineFnsTest
Running org.apache.beam.sdk.transforms.GroupByKeyTest
Tests run: 9, Failures: 0, Errors: 0, Skipped: 0, Time elapsed: 0.544 sec - in org.apache.beam.sdk.transforms.GroupByKeyTest
Running org.apache.beam.sdk.transforms.FilterTest
Tests run: 7, Failures: 0, Errors: 0, Skipped: 0, Time elapsed: 0.765 sec - in org.apache.beam.sdk.transforms.FilterTest
Running org.apache.beam.sdk.transforms.ParDoLifecycleTest
Tests run: 12, Failures: 0, Errors: 0, Skipped: 0, Time elapsed: 0.514 sec - in org.apache.beam.sdk.transforms.ParDoLifecycleTest
Running org.apache.beam.sdk.transforms.ApproximateQuantilesTest
Tests run: 4, Failures: 0, Errors: 0, Skipped: 0, Time elapsed: 0.274 sec - in org.apache.beam.sdk.transforms.ApproximateQuantilesTest
Running org.apache.beam.sdk.transforms.join.CoGroupByKeyTest
Tests run: 4, Failures: 0, Errors: 0, Skipped: 0, Time elapsed: 0.288 sec - in org.apache.beam.sdk.transforms.join.CoGroupByKeyTest
Running org.apache.beam.sdk.transforms.DoFnTest
Tests run: 3, Failures: 0, Errors: 0, Skipped: 0, Time elapsed: 0.084 sec - in org.apache.beam.sdk.transforms.DoFnTest
Running org.apache.beam.sdk.transforms.windowing.WindowTest
Tests run: 2, Failures: 0, Errors: 0, Skipped: 0, Time elapsed: 0.044 sec - in org.apache.beam.sdk.transforms.windowing.WindowTest
Running org.apache.beam.sdk.transforms.windowing.WindowingTest
Tests run: 6, Failures: 0, Errors: 0, Skipped: 0, Time elapsed: 0.367 sec - in org.apache.beam.sdk.transforms.windowing.WindowingTest
Running org.apache.beam.sdk.transforms.ValuesTest
Tests run: 2, Failures: 0, Errors: 0, Skipped: 0, Time elapsed: 0.074 sec - in org.apache.beam.sdk.transforms.ValuesTest
Running org.apache.beam.sdk.transforms.SplittableDoFnTest
Tests run: 6, Failures: 0, Errors: 0, Skipped: 0, Time elapsed: 2.354 sec - in org.apache.beam.sdk.transforms.SplittableDoFnTest
Running org.apache.beam.sdk.transforms.RegexTest
Tests run: 17, Failures: 0, Errors: 0, Skipped: 0, Time elapsed: 1.363 sec - in org.apache.beam.sdk.transforms.RegexTest
Running org.apache.beam.sdk.transforms.PartitionTest
Tests run: 4, Failures: 0, Errors: 0, Skipped: 0, Time elapsed: 0.348 sec - in org.apache.beam.sdk.transforms.PartitionTest
Running org.apache.beam.sdk.transforms.ParDoTest
Tests run: 35, Failures: 0, Errors: 0, Skipped: 0, Time elapsed: 2.105 sec - in org.apache.beam.sdk.transforms.ParDoTest
Running org.apache.beam.sdk.transforms.CreateTest
Tests run: 9, Failures: 0, Errors: 0, Skipped: 0, Time elapsed: 0.249 sec - in org.apache.beam.sdk.transforms.CreateTest
Running org.apache.beam.sdk.transforms.DistinctTest
Tests run: 3, Failures: 0, Errors: 0, Skipped: 0, Time elapsed: 0.099 sec - in org.apache.beam.sdk.transforms.DistinctTest
Running org.apache.beam.sdk.transforms.CombineTest
Tests run: 21, Failures: 0, Errors: 0, Skipped: 0, Time elapsed: 1.535 sec - in org.apache.beam.sdk.transforms.CombineTest
Running org.apache.beam.sdk.transforms.KvSwapTest
Tests run: 2, Failures: 0, Errors: 0, Skipped: 0, Time elapsed: 0.076 sec - in org.apache.beam.sdk.transforms.KvSwapTest
Running org.apache.beam.sdk.util.ReshuffleTest
Tests run: 6, Failures: 0, Errors: 0, Skipped: 0, Time elapsed: 0.218 sec - in org.apache.beam.sdk.util.ReshuffleTest
Running org.apache.beam.runners.core.UnboundedReadFromBoundedSourceTest
Tests run: 1, Failures: 0, Errors: 0, Skipped: 0, Time elapsed: 0.228 sec - in org.apache.beam.runners.core.UnboundedReadFromBoundedSourceTest

Results :

Tests run: 379, Failures: 0, Errors: 0, Skipped: 3

[JENKINS] Recording test results
2016-12-21T06:07:10.610 [INFO] 
2016-12-21T06:07:10.610 [INFO] --- maven-dependency-plugin:2.10:analyze-only (default) @ beam-runners-direct-java
---
2016-12-21T06:07:10.808 [INFO] No dependency problems found
[JENKINS] Archiving disabled
2016-12-21T06:07:15.572 [INFO]                                                           
             
2016-12-21T06:07:15.572 [INFO] ------------------------------------------------------------------------
2016-12-21T06:07:15.572 [INFO] Building Apache Beam :: SDKs :: Java :: IO 0.5.0-incubating-SNAPSHOT
2016-12-21T06:07:15.572 [INFO] ------------------------------------------------------------------------
2016-12-21T06:07:15.574 [INFO] 
2016-12-21T06:07:15.574 [INFO] --- maven-clean-plugin:3.0.0:clean (default-clean) @ beam-sdks-java-io-parent
---
2016-12-21T06:07:15.670 [INFO] 
2016-12-21T06:07:15.671 [INFO] --- maven-enforcer-plugin:1.3.1:enforce (enforce) @ beam-sdks-java-io-parent
---
2016-12-21T06:07:15.725 [INFO] 
2016-12-21T06:07:15.725 [INFO] --- maven-remote-resources-plugin:1.5:process (process-resource-bundles)
@ beam-sdks-java-io-parent ---
2016-12-21T06:07:15.817 [INFO] 
2016-12-21T06:07:15.817 [INFO] --- maven-site-plugin:3.5.1:attach-descriptor (attach-descriptor)
@ beam-sdks-java-io-parent ---
2016-12-21T06:07:15.870 [INFO] 
2016-12-21T06:07:15.870 [INFO] --- maven-dependency-plugin:2.10:analyze-only (default) @ beam-sdks-java-io-parent
---
2016-12-21T06:07:15.871 [INFO] Skipping pom project
[JENKINS] Archiving disabled
2016-12-21T06:07:17.891 [INFO]                                                           
             
2016-12-21T06:07:17.891 [INFO] ------------------------------------------------------------------------
2016-12-21T06:07:17.891 [INFO] Building Apache Beam :: SDKs :: Java :: IO :: Kafka 0.5.0-incubating-SNAPSHOT
2016-12-21T06:07:17.891 [INFO] ------------------------------------------------------------------------
2016-12-21T06:07:17.900 [INFO] Downloading: https://repo.maven.apache.org/maven2/org/apache/kafka/kafka-clients/0.9.0.1/kafka-clients-0.9.0.1.pom
[INFO] I/O exception (java.net.SocketException) caught when processing request to {s}->https://repo.maven.apache.org:443:
Connection reset
[INFO] Retrying request to {s}->https://repo.maven.apache.org:443
[INFO] I/O exception (java.net.SocketException) caught when processing request to {s}->https://repo.maven.apache.org:443:
Connection reset
[INFO] Retrying request to {s}->https://repo.maven.apache.org:443
[INFO] I/O exception (java.net.SocketException) caught when processing request to {s}->https://repo.maven.apache.org:443:
Connection reset
[INFO] Retrying request to {s}->https://repo.maven.apache.org:443
[JENKINS] Archiving disabled
[JENKINS] Archiving disabled
[JENKINS] Archiving disabled
[JENKINS] Archiving disabled
[JENKINS] Archiving disabled
[JENKINS] Archiving disabled
[JENKINS] Archiving disabled
[JENKINS] Archiving disabled
[JENKINS] Archiving disabled
[JENKINS] Archiving disabled
[JENKINS] Archiving disabled
2016-12-21T06:07:22.345 [INFO] ------------------------------------------------------------------------
2016-12-21T06:07:22.345 [INFO] Reactor Summary:
2016-12-21T06:07:22.345 [INFO] 
2016-12-21T06:07:22.345 [INFO] Apache Beam :: Parent .............................. SUCCESS
[ 17.968 s]
2016-12-21T06:07:22.345 [INFO] Apache Beam :: SDKs ................................ SUCCESS
[  0.454 s]
2016-12-21T06:07:22.345 [INFO] Apache Beam :: SDKs :: Java ........................ SUCCESS
[  0.397 s]
2016-12-21T06:07:22.345 [INFO] Apache Beam :: SDKs :: Java :: Core ................ SUCCESS
[02:25 min]
2016-12-21T06:07:22.345 [INFO] Apache Beam :: Runners ............................. SUCCESS
[  0.655 s]
2016-12-21T06:07:22.345 [INFO] Apache Beam :: Runners :: Core Java ................ SUCCESS
[ 35.832 s]
2016-12-21T06:07:22.345 [INFO] Apache Beam :: Runners :: Direct Java .............. SUCCESS
[02:30 min]
2016-12-21T06:07:22.345 [INFO] Apache Beam :: SDKs :: Java :: IO .................. SUCCESS
[  2.084 s]
2016-12-21T06:07:22.345 [INFO] Apache Beam :: SDKs :: Java :: IO :: Kafka ......... FAILURE
[  0.410 s]
2016-12-21T06:07:22.345 [INFO] Apache Beam :: Runners :: Spark .................... SKIPPED
2016-12-21T06:07:22.346 [INFO] ------------------------------------------------------------------------
2016-12-21T06:07:22.346 [INFO] BUILD FAILURE
2016-12-21T06:07:22.346 [INFO] ------------------------------------------------------------------------
2016-12-21T06:07:22.346 [INFO] Total time: 06:18 min
2016-12-21T06:07:22.346 [INFO] Finished at: 2016-12-21T06:07:22+00:00
2016-12-21T06:07:23.005 [INFO] Final Memory: 92M/1466M
2016-12-21T06:07:23.005 [INFO] ------------------------------------------------------------------------
Waiting for Jenkins to finish collecting data
2016-12-21T06:07:27.454 [ERROR] Failed to execute goal on project beam-sdks-java-io-kafka:
Could not resolve dependencies for project org.apache.beam:beam-sdks-java-io-kafka:jar:0.5.0-incubating-SNAPSHOT:
Failed to collect dependencies at org.apache.kafka:kafka-clients:jar:0.9.0.1: Failed to read
artifact descriptor for org.apache.kafka:kafka-clients:jar:0.9.0.1: Could not transfer artifact
org.apache.kafka:kafka-clients:pom:0.9.0.1 from/to central (https://repo.maven.apache.org/maven2):
Connection reset -> [Help 1]
org.apache.maven.lifecycle.LifecycleExecutionException: Failed to execute goal on project
beam-sdks-java-io-kafka: Could not resolve dependencies for project org.apache.beam:beam-sdks-java-io-kafka:jar:0.5.0-incubating-SNAPSHOT:
Failed to collect dependencies at org.apache.kafka:kafka-clients:jar:0.9.0.1
	at org.apache.maven.lifecycle.internal.LifecycleDependencyResolver.getDependencies(LifecycleDependencyResolver.java:221)
	at org.apache.maven.lifecycle.internal.LifecycleDependencyResolver.resolveProjectDependencies(LifecycleDependencyResolver.java:127)
	at org.apache.maven.lifecycle.internal.MojoExecutor.ensureDependenciesAreResolved(MojoExecutor.java:257)
	at org.apache.maven.lifecycle.internal.MojoExecutor.execute(MojoExecutor.java:200)
	at org.apache.maven.lifecycle.internal.MojoExecutor.execute(MojoExecutor.java:153)
	at org.apache.maven.lifecycle.internal.MojoExecutor.execute(MojoExecutor.java:145)
	at org.apache.maven.lifecycle.internal.LifecycleModuleBuilder.buildProject(LifecycleModuleBuilder.java:116)
	at org.apache.maven.lifecycle.internal.LifecycleModuleBuilder.buildProject(LifecycleModuleBuilder.java:80)
	at org.apache.maven.lifecycle.internal.builder.singlethreaded.SingleThreadedBuilder.build(SingleThreadedBuilder.java:51)
	at org.apache.maven.lifecycle.internal.LifecycleStarter.execute(LifecycleStarter.java:128)
	at org.apache.maven.DefaultMaven.doExecute(DefaultMaven.java:307)
	at org.apache.maven.DefaultMaven.doExecute(DefaultMaven.java:193)
	at org.apache.maven.DefaultMaven.execute(DefaultMaven.java:106)
	at org.jvnet.hudson.maven3.launcher.Maven32Launcher.main(Maven32Launcher.java:132)
	at sun.reflect.NativeMethodAccessorImpl.invoke0(Native Method)
	at sun.reflect.NativeMethodAccessorImpl.invoke(NativeMethodAccessorImpl.java:62)
	at sun.reflect.DelegatingMethodAccessorImpl.invoke(DelegatingMethodAccessorImpl.java:43)
	at java.lang.reflect.Method.invoke(Method.java:498)
	at org.codehaus.plexus.classworlds.launcher.Launcher.launchStandard(Launcher.java:330)
	at org.codehaus.plexus.classworlds.launcher.Launcher.launch(Launcher.java:238)
	at jenkins.maven3.agent.Maven32Main.launch(Maven32Main.java:186)
	at sun.reflect.NativeMethodAccessorImpl.invoke0(Native Method)
	at sun.reflect.NativeMethodAccessorImpl.invoke(NativeMethodAccessorImpl.java:62)
	at sun.reflect.DelegatingMethodAccessorImpl.invoke(DelegatingMethodAccessorImpl.java:43)
	at java.lang.reflect.Method.invoke(Method.java:498)
	at hudson.maven.Maven3Builder.call(Maven3Builder.java:136)
	at hudson.maven.Maven3Builder.call(Maven3Builder.java:71)
	at hudson.remoting.UserRequest.perform(UserRequest.java:153)
	at hudson.remoting.UserRequest.perform(UserRequest.java:50)
	at hudson.remoting.Request$2.run(Request.java:332)
	at hudson.remoting.InterceptingExecutorService$1.call(InterceptingExecutorService.java:68)
	at java.util.concurrent.FutureTask.run(FutureTask.java:266)
	at java.util.concurrent.ThreadPoolExecutor.runWorker(ThreadPoolExecutor.java:1142)
	at java.util.concurrent.ThreadPoolExecutor$Worker.run(ThreadPoolExecutor.java:617)
	at java.lang.Thread.run(Thread.java:745)
Caused by: org.apache.maven.project.DependencyResolutionException: Could not resolve dependencies
for project org.apache.beam:beam-sdks-java-io-kafka:jar:0.5.0-incubating-SNAPSHOT: Failed
to collect dependencies at org.apache.kafka:kafka-clients:jar:0.9.0.1
	at org.apache.maven.project.DefaultProjectDependenciesResolver.resolve(DefaultProjectDependenciesResolver.java:180)
	at org.apache.maven.lifecycle.internal.LifecycleDependencyResolver.getDependencies(LifecycleDependencyResolver.java:195)
	... 34 more
Caused by: org.eclipse.aether.collection.DependencyCollectionException: Failed to collect
dependencies at org.apache.kafka:kafka-clients:jar:0.9.0.1
	at org.eclipse.aether.internal.impl.DefaultDependencyCollector.collectDependencies(DefaultDependencyCollector.java:291)
	at org.eclipse.aether.internal.impl.DefaultRepositorySystem.collectDependencies(DefaultRepositorySystem.java:316)
	at org.apache.maven.project.DefaultProjectDependenciesResolver.resolve(DefaultProjectDependenciesResolver.java:172)
	... 35 more
Caused by: org.eclipse.aether.resolution.ArtifactDescriptorException: Failed to read artifact
descriptor for org.apache.kafka:kafka-clients:jar:0.9.0.1
	at org.apache.maven.repository.internal.DefaultArtifactDescriptorReader.loadPom(DefaultArtifactDescriptorReader.java:302)
	at org.apache.maven.repository.internal.DefaultArtifactDescriptorReader.readArtifactDescriptor(DefaultArtifactDescriptorReader.java:218)
	at org.eclipse.aether.internal.impl.DefaultDependencyCollector.resolveCachedArtifactDescriptor(DefaultDependencyCollector.java:535)
	at org.eclipse.aether.internal.impl.DefaultDependencyCollector.getArtifactDescriptorResult(DefaultDependencyCollector.java:519)
	at org.eclipse.aether.internal.impl.DefaultDependencyCollector.processDependency(DefaultDependencyCollector.java:409)
	at org.eclipse.aether.internal.impl.DefaultDependencyCollector.processDependency(DefaultDependencyCollector.java:363)
	at org.eclipse.aether.internal.impl.DefaultDependencyCollector.process(DefaultDependencyCollector.java:351)
	at org.eclipse.aether.internal.impl.DefaultDependencyCollector.collectDependencies(DefaultDependencyCollector.java:254)
	... 37 more
Caused by: org.eclipse.aether.resolution.ArtifactResolutionException: Could not transfer artifact
org.apache.kafka:kafka-clients:pom:0.9.0.1 from/to central (https://repo.maven.apache.org/maven2):
Connection reset
	at org.eclipse.aether.internal.impl.DefaultArtifactResolver.resolve(DefaultArtifactResolver.java:444)
	at org.eclipse.aether.internal.impl.DefaultArtifactResolver.resolveArtifacts(DefaultArtifactResolver.java:246)
	at org.eclipse.aether.internal.impl.DefaultArtifactResolver.resolveArtifact(DefaultArtifactResolver.java:223)
	at org.apache.maven.repository.internal.DefaultArtifactDescriptorReader.loadPom(DefaultArtifactDescriptorReader.java:287)
	... 44 more
Caused by: org.eclipse.aether.transfer.ArtifactTransferException: Could not transfer artifact
org.apache.kafka:kafka-clients:pom:0.9.0.1 from/to central (https://repo.maven.apache.org/maven2):
Connection reset
	at org.eclipse.aether.connector.basic.ArtifactTransportListener.transferFailed(ArtifactTransportListener.java:43)
	at org.eclipse.aether.connector.basic.BasicRepositoryConnector$TaskRunner.run(BasicRepositoryConnector.java:355)
	at org.eclipse.aether.util.concurrency.RunnableErrorForwarder$1.run(RunnableErrorForwarder.java:67)
	at org.eclipse.aether.connector.basic.BasicRepositoryConnector$DirectExecutor.execute(BasicRepositoryConnector.java:581)
	at org.eclipse.aether.connector.basic.BasicRepositoryConnector.get(BasicRepositoryConnector.java:249)
	at org.eclipse.aether.internal.impl.DefaultArtifactResolver.performDownloads(DefaultArtifactResolver.java:520)
	at org.eclipse.aether.internal.impl.DefaultArtifactResolver.resolve(DefaultArtifactResolver.java:421)
	... 47 more
Caused by: org.apache.maven.wagon.TransferFailedException: Connection reset
	at org.apache.maven.wagon.providers.http.AbstractHttpClientWagon.fillInputData(AbstractHttpClientWagon.java:1066)
	at org.apache.maven.wagon.providers.http.AbstractHttpClientWagon.fillInputData(AbstractHttpClientWagon.java:960)
	at org.apache.maven.wagon.StreamWagon.getInputStream(StreamWagon.java:116)
	at org.apache.maven.wagon.StreamWagon.getIfNewer(StreamWagon.java:88)
	at org.apache.maven.wagon.StreamWagon.get(StreamWagon.java:61)
	at org.eclipse.aether.transport.wagon.WagonTransporter$GetTaskRunner.run(WagonTransporter.java:560)
	at org.eclipse.aether.transport.wagon.WagonTransporter.execute(WagonTransporter.java:427)
	at org.eclipse.aether.transport.wagon.WagonTransporter.get(WagonTransporter.java:404)
	at org.eclipse.aether.connector.basic.BasicRepositoryConnector$GetTaskRunner.runTask(BasicRepositoryConnector.java:447)
	at org.eclipse.aether.connector.basic.BasicRepositoryConnector$TaskRunner.run(BasicRepositoryConnector.java:350)
	... 52 more
Caused by: java.net.SocketException: Connection reset
	at java.net.SocketInputStream.read(SocketInputStream.java:209)
	at java.net.SocketInputStream.read(SocketInputStream.java:141)
	at sun.security.ssl.InputRecord.readFully(InputRecord.java:465)
	at sun.security.ssl.InputRecord.read(InputRecord.java:503)
	at sun.security.ssl.SSLSocketImpl.readRecord(SSLSocketImpl.java:973)
	at sun.security.ssl.SSLSocketImpl.readDataRecord(SSLSocketImpl.java:930)
	at sun.security.ssl.AppInputStream.read(AppInputStream.java:105)
	at org.apache.maven.wagon.providers.http.httpclient.impl.io.SessionInputBufferImpl.streamRead(SessionInputBufferImpl.java:136)
	at org.apache.maven.wagon.providers.http.httpclient.impl.io.SessionInputBufferImpl.fillBuffer(SessionInputBufferImpl.java:152)
	at org.apache.maven.wagon.providers.http.httpclient.impl.io.SessionInputBufferImpl.readLine(SessionInputBufferImpl.java:270)
	at org.apache.maven.wagon.providers.http.httpclient.impl.conn.DefaultHttpResponseParser.parseHead(DefaultHttpResponseParser.java:140)
	at org.apache.maven.wagon.providers.http.httpclient.impl.conn.DefaultHttpResponseParser.parseHead(DefaultHttpResponseParser.java:57)
	at org.apache.maven.wagon.providers.http.httpclient.impl.io.AbstractMessageParser.parse(AbstractMessageParser.java:260)
	at org.apache.maven.wagon.providers.http.httpclient.impl.DefaultBHttpClientConnection.receiveResponseHeader(DefaultBHttpClientConnection.java:161)
	at org.apache.maven.wagon.providers.http.httpclient.impl.conn.CPoolProxy.receiveResponseHeader(CPoolProxy.java:153)
	at org.apache.maven.wagon.providers.http.httpclient.protocol.HttpRequestExecutor.doReceiveResponse(HttpRequestExecutor.java:271)
	at org.apache.maven.wagon.providers.http.httpclient.protocol.HttpRequestExecutor.execute(HttpRequestExecutor.java:123)
	at org.apache.maven.wagon.providers.http.httpclient.impl.execchain.MainClientExec.execute(MainClientExec.java:254)
	at org.apache.maven.wagon.providers.http.httpclient.impl.execchain.ProtocolExec.execute(ProtocolExec.java:195)
	at org.apache.maven.wagon.providers.http.httpclient.impl.execchain.RetryExec.execute(RetryExec.java:86)
	at org.apache.maven.wagon.providers.http.httpclient.impl.execchain.RedirectExec.execute(RedirectExec.java:108)
	at org.apache.maven.wagon.providers.http.httpclient.impl.client.InternalHttpClient.doExecute(InternalHttpClient.java:184)
	at org.apache.maven.wagon.providers.http.httpclient.impl.client.CloseableHttpClient.execute(CloseableHttpClient.java:82)
	at org.apache.maven.wagon.providers.http.AbstractHttpClientWagon.execute(AbstractHttpClientWagon.java:832)
	at org.apache.maven.wagon.providers.http.AbstractHttpClientWagon.fillInputData(AbstractHttpClientWagon.java:983)
	... 61 more
2016-12-21T06:07:27.461 [ERROR] 
2016-12-21T06:07:27.461 [ERROR] Re-run Maven using the -X switch to enable full debug logging.
2016-12-21T06:07:27.461 [ERROR] 
2016-12-21T06:07:27.462 [ERROR] For more information about the errors and possible solutions,
please read the following articles:
2016-12-21T06:07:27.462 [ERROR] [Help 1] http://cwiki.apache.org/confluence/display/MAVEN/DependencyResolutionException
2016-12-21T06:07:27.462 [ERROR] 
2016-12-21T06:07:27.462 [ERROR] After correcting the problems, you can resume the build with
the command
2016-12-21T06:07:27.462 [ERROR]   mvn <goals> -rf :beam-sdks-java-io-kafka
channel stopped

Mime
View raw message