beam-commits mailing list archives

Site index · List index
Message view « Date » · « Thread »
Top « Date » · « Thread »
From Dan Halperin <dhalp...@google.com>
Subject Re: Build failed in Jenkins: beam_PostCommit_MavenVerify #1823
Date Tue, 15 Nov 2016 14:27:32 GMT
Hmm, looks like heck that https://github.com/apache/incubator-beam/pull/1356
broke this despite green precommit. Rolling back and investigating.

On Tue, Nov 15, 2016 at 1:50 PM, Apache Jenkins Server <
jenkins@builds.apache.org> wrote:

> See <https://builds.apache.org/job/beam_PostCommit_MavenVerify/
> 1823/changes>
>
> Changes:
>
> [ansela] [BEAM-762] Unify spark-runner EvaluationContext and
>
> [dhalperi] [BEAM-930] Fix findbugs and re-enable Maven plugin in MongoDbIO
>
> ------------------------------------------
> [...truncated 4741 lines...]
> [INFO]
> [INFO] --- maven-enforcer-plugin:1.3.1:enforce (enforce) @
> beam-sdks-java-io-mongodb ---
> [INFO]
> [INFO] --- maven-remote-resources-plugin:1.5:process
> (process-resource-bundles) @ beam-sdks-java-io-mongodb ---
> [INFO]
> [INFO] --- maven-resources-plugin:2.7:resources (default-resources) @
> beam-sdks-java-io-mongodb ---
> [INFO] Using 'UTF-8' encoding to copy filtered resources.
> [INFO] skip non existing resourceDirectory <https://builds.apache.org/job
> /beam_PostCommit_MavenVerify/ws/sdks/java/io/mongodb/src/main/resources>
> [INFO] Copying 3 resources
> [INFO]
> [INFO] --- maven-compiler-plugin:3.5.1:compile (default-compile) @
> beam-sdks-java-io-mongodb ---
> [INFO] Changes detected - recompiling the module!
> [INFO] Compiling 3 source files to <https://builds.apache.org/job
> /beam_PostCommit_MavenVerify/ws/sdks/java/io/mongodb/target/classes>
> [WARNING] bootstrap class path not set in conjunction with -source 1.7
> [INFO] <https://builds.apache.org/job/beam_PostCommit_MavenVerify/
> ws/sdks/java/io/mongodb/src/main/java/org/apache/beam/sdk/
> io/mongodb/MongoDbGridFSIO.java>: <https://builds.apache.org/job
> /beam_PostCommit_MavenVerify/ws/sdks/java/io/mongodb/src/
> main/java/org/apache/beam/sdk/io/mongodb/MongoDbGridFSIO.java> uses or
> overrides a deprecated API.
> [INFO] <https://builds.apache.org/job/beam_PostCommit_MavenVerify/
> ws/sdks/java/io/mongodb/src/main/java/org/apache/beam/sdk/
> io/mongodb/MongoDbGridFSIO.java>: Recompile with -Xlint:deprecation for
> details.
> [INFO] <https://builds.apache.org/job/beam_PostCommit_MavenVerify/
> ws/sdks/java/io/mongodb/src/main/java/org/apache/beam/sdk/
> io/mongodb/MongoDbGridFSIO.java>: Some input files use unchecked or
> unsafe operations.
> [INFO] <https://builds.apache.org/job/beam_PostCommit_MavenVerify/
> ws/sdks/java/io/mongodb/src/main/java/org/apache/beam/sdk/
> io/mongodb/MongoDbGridFSIO.java>: Recompile with -Xlint:unchecked for
> details.
> [INFO]
> [INFO] --- maven-resources-plugin:2.7:testResources
> (default-testResources) @ beam-sdks-java-io-mongodb ---
> [INFO] Using 'UTF-8' encoding to copy filtered resources.
> [INFO] skip non existing resourceDirectory <https://builds.apache.org/job
> /beam_PostCommit_MavenVerify/ws/sdks/java/io/mongodb/src/test/resources>
> [INFO] Copying 3 resources
> [INFO]
> [INFO] --- maven-compiler-plugin:3.5.1:testCompile (default-testCompile)
> @ beam-sdks-java-io-mongodb ---
> [INFO] Changes detected - recompiling the module!
> [INFO] Compiling 2 source files to <https://builds.apache.org/job
> /beam_PostCommit_MavenVerify/ws/sdks/java/io/mongodb/target/test-classes>
> [INFO] <https://builds.apache.org/job/beam_PostCommit_MavenVerify/
> ws/sdks/java/io/mongodb/src/test/java/org/apache/beam/sdk/
> io/mongodb/MongoDBGridFSIOTest.java>: <https://builds.apache.org/job
> /beam_PostCommit_MavenVerify/ws/sdks/java/io/mongodb/src/
> test/java/org/apache/beam/sdk/io/mongodb/MongoDBGridFSIOTest.java> uses
> or overrides a deprecated API.
> [INFO] <https://builds.apache.org/job/beam_PostCommit_MavenVerify/
> ws/sdks/java/io/mongodb/src/test/java/org/apache/beam/sdk/
> io/mongodb/MongoDBGridFSIOTest.java>: Recompile with -Xlint:deprecation
> for details.
> [INFO] <https://builds.apache.org/job/beam_PostCommit_MavenVerify/
> ws/sdks/java/io/mongodb/src/test/java/org/apache/beam/sdk/
> io/mongodb/MongoDbIOTest.java>: <https://builds.apache.org/job
> /beam_PostCommit_MavenVerify/ws/sdks/java/io/mongodb/src/
> test/java/org/apache/beam/sdk/io/mongodb/MongoDbIOTest.java> uses
> unchecked or unsafe operations.
> [INFO] <https://builds.apache.org/job/beam_PostCommit_MavenVerify/
> ws/sdks/java/io/mongodb/src/test/java/org/apache/beam/sdk/
> io/mongodb/MongoDbIOTest.java>: Recompile with -Xlint:unchecked for
> details.
> [INFO]
> [INFO] --- maven-checkstyle-plugin:2.17:check (default) @
> beam-sdks-java-io-mongodb ---
> [INFO] Starting audit...
> Audit done.
> [INFO]
> [INFO] >>> findbugs-maven-plugin:3.0.1:check (default) > :findbugs @
> beam-sdks-java-io-mongodb >>>
> [INFO]
> [INFO] --- findbugs-maven-plugin:3.0.1:findbugs (findbugs) @
> beam-sdks-java-io-mongodb ---
> [INFO] Fork Value is true
>      [java] Warnings generated: 3
> [INFO] Done FindBugs Analysis....
> [INFO]
> [INFO] <<< findbugs-maven-plugin:3.0.1:check (default) < :findbugs @
> beam-sdks-java-io-mongodb <<<
> [INFO]
> [INFO] --- findbugs-maven-plugin:3.0.1:check (default) @
> beam-sdks-java-io-mongodb ---
> [INFO] BugInstance size is 3
> [INFO] Error size is 0
> [INFO] Total bugs: 3
> [INFO] Class org.apache.beam.sdk.io.mongodb.MongoDbGridFSIO$GridFsWriteFn
> defines non-transient non-serializable instance field gridFsFile [
> org.apache.beam.sdk.io.mongodb.MongoDbGridFSIO$GridFsWriteFn] In
> MongoDbGridFSIO.java
> [INFO] Class org.apache.beam.sdk.io.mongodb.MongoDbGridFSIO$GridFsWriteFn
> defines non-transient non-serializable instance field gridfs [
> org.apache.beam.sdk.io.mongodb.MongoDbGridFSIO$GridFsWriteFn] In
> MongoDbGridFSIO.java
> [INFO] Class org.apache.beam.sdk.io.mongodb.MongoDbGridFSIO$GridFsWriteFn
> defines non-transient non-serializable instance field mongo [
> org.apache.beam.sdk.io.mongodb.MongoDbGridFSIO$GridFsWriteFn] In
> MongoDbGridFSIO.java
> [INFO]
>
>
> To see bug detail using the Findbugs GUI, use the following command "mvn
> findbugs:gui"
>
>
>
> [INFO]
> [INFO] ------------------------------------------------------------
> ------------
> [INFO] Skipping Apache Beam :: Parent
> [INFO] This project has been banned from the build due to previous
> failures.
> [INFO] ------------------------------------------------------------
> ------------
> [INFO] ------------------------------------------------------------
> ------------
> [INFO] Reactor Summary:
> [INFO]
> [INFO] Apache Beam :: Parent .............................. SUCCESS [
> 10.777 s]
> [INFO] Apache Beam :: SDKs :: Java :: Build Tools ......... SUCCESS [
> 8.852 s]
> [INFO] Apache Beam :: SDKs ................................ SUCCESS [
> 7.039 s]
> [INFO] Apache Beam :: SDKs :: Java ........................ SUCCESS [
> 6.828 s]
> [INFO] Apache Beam :: SDKs :: Java :: Core ................ SUCCESS [04:49
> min]
> [INFO] Apache Beam :: Runners ............................. SUCCESS [
> 9.442 s]
> [INFO] Apache Beam :: Runners :: Core Java ................ SUCCESS [01:02
> min]
> [INFO] Apache Beam :: Runners :: Direct Java .............. SUCCESS [02:38
> min]
> [INFO] Apache Beam :: Runners :: Google Cloud Dataflow .... SUCCESS [
> 37.789 s]
> [INFO] Apache Beam :: SDKs :: Java :: IO .................. SUCCESS [
> 5.510 s]
> [INFO] Apache Beam :: SDKs :: Java :: IO :: Google Cloud Platform SUCCESS
> [04:47 min]
> [INFO] Apache Beam :: SDKs :: Java :: IO :: HDFS .......... SUCCESS [
> 30.948 s]
> [INFO] Apache Beam :: SDKs :: Java :: IO :: JMS ........... SUCCESS [
> 27.803 s]
> [INFO] Apache Beam :: SDKs :: Java :: IO :: Kafka ......... SUCCESS [
> 22.877 s]
> [INFO] Apache Beam :: SDKs :: Java :: IO :: Kinesis ....... SUCCESS [
> 27.856 s]
> [INFO] Apache Beam :: SDKs :: Java :: IO :: MongoDB ....... FAILURE [
> 17.206 s]
> [INFO] Apache Beam :: SDKs :: Java :: IO :: JDBC .......... SKIPPED
> [INFO] Apache Beam :: SDKs :: Java :: Maven Archetypes .... SKIPPED
> [INFO] Apache Beam :: SDKs :: Java :: Maven Archetypes :: Starter SKIPPED
> [INFO] Apache Beam :: SDKs :: Java :: Maven Archetypes :: Examples SKIPPED
> [INFO] Apache Beam :: SDKs :: Java :: Extensions .......... SKIPPED
> [INFO] Apache Beam :: SDKs :: Java :: Extensions :: Join library SKIPPED
> [INFO] Apache Beam :: SDKs :: Java :: Extensions :: Sorter  SKIPPED
> [INFO] Apache Beam :: SDKs :: Java :: Microbenchmarks ..... SKIPPED
> [INFO] Apache Beam :: SDKs :: Java :: Java 8 Tests ........ SKIPPED
> [INFO] Apache Beam :: Runners :: Flink .................... SKIPPED
> [INFO] Apache Beam :: Runners :: Flink :: Core ............ SKIPPED
> [INFO] Apache Beam :: Runners :: Flink :: Examples ........ SKIPPED
> [INFO] Apache Beam :: Runners :: Spark .................... SKIPPED
> [INFO] Apache Beam :: Runners :: Apex ..................... SKIPPED
> [INFO] Apache Beam :: Examples ............................ SKIPPED
> [INFO] Apache Beam :: Examples :: Java .................... SKIPPED
> [INFO] Apache Beam :: Examples :: Java 8 .................. SKIPPED
> [INFO] ------------------------------------------------------------
> ------------
> [INFO] BUILD FAILURE
> [INFO] ------------------------------------------------------------
> ------------
> [INFO] Total time: 19:20 min
> [INFO] Finished at: 2016-11-15T12:45:27+00:00
> [INFO] Final Memory: 129M/827M
> [INFO] ------------------------------------------------------------
> ------------
> Waiting for Jenkins to finish collecting data
> [ERROR] Failed to execute goal org.codehaus.mojo:findbugs-maven-plugin:3.0.1:check
> (default) on project beam-sdks-java-io-mongodb: failed with 3 bugs and 0
> errors -> [Help 1]
> org.apache.maven.lifecycle.LifecycleExecutionException: Failed to execute
> goal org.codehaus.mojo:findbugs-maven-plugin:3.0.1:check (default) on
> project beam-sdks-java-io-mongodb: failed with 3 bugs and 0 errors
>         at org.apache.maven.lifecycle.internal.MojoExecutor.execute(Moj
> oExecutor.java:216)
>         at org.apache.maven.lifecycle.internal.MojoExecutor.execute(Moj
> oExecutor.java:153)
>         at org.apache.maven.lifecycle.internal.MojoExecutor.execute(Moj
> oExecutor.java:145)
>         at org.apache.maven.lifecycle.internal.LifecycleModuleBuilder.b
> uildProject(LifecycleModuleBuilder.java:116)
>         at org.apache.maven.lifecycle.internal.LifecycleModuleBuilder.b
> uildProject(LifecycleModuleBuilder.java:80)
>         at org.apache.maven.lifecycle.internal.builder.singlethreaded.S
> ingleThreadedBuilder.build(SingleThreadedBuilder.java:51)
>         at org.apache.maven.lifecycle.internal.LifecycleStarter.execute
> (LifecycleStarter.java:128)
>         at org.apache.maven.DefaultMaven.doExecute(DefaultMaven.java:307)
>         at org.apache.maven.DefaultMaven.doExecute(DefaultMaven.java:193)
>         at org.apache.maven.DefaultMaven.execute(DefaultMaven.java:106)
>         at org.jvnet.hudson.maven3.launcher.Maven32Launcher.main(Maven3
> 2Launcher.java:132)
>         at sun.reflect.NativeMethodAccessorImpl.invoke0(Native Method)
>         at sun.reflect.NativeMethodAccessorImpl.invoke(NativeMethodAcce
> ssorImpl.java:62)
>         at sun.reflect.DelegatingMethodAccessorImpl.invoke(DelegatingMe
> thodAccessorImpl.java:43)
>         at java.lang.reflect.Method.invoke(Method.java:498)
>         at org.codehaus.plexus.classworlds.launcher.Launcher.launchStan
> dard(Launcher.java:330)
>         at org.codehaus.plexus.classworlds.launcher.Launcher.launch(
> Launcher.java:238)
>         at jenkins.maven3.agent.Maven32Main.launch(Maven32Main.java:186)
>         at sun.reflect.NativeMethodAccessorImpl.invoke0(Native Method)
>         at sun.reflect.NativeMethodAccessorImpl.invoke(NativeMethodAcce
> ssorImpl.java:62)
>         at sun.reflect.DelegatingMethodAccessorImpl.invoke(DelegatingMe
> thodAccessorImpl.java:43)
>         at java.lang.reflect.Method.invoke(Method.java:498)
>         at hudson.maven.Maven3Builder.call(Maven3Builder.java:136)
>         at hudson.maven.Maven3Builder.call(Maven3Builder.java:71)
>         at hudson.remoting.UserRequest.perform(UserRequest.java:153)
>         at hudson.remoting.UserRequest.perform(UserRequest.java:50)
>         at hudson.remoting.Request$2.run(Request.java:332)
>         at hudson.remoting.InterceptingExecutorService$1.call(Intercept
> ingExecutorService.java:68)
>         at java.util.concurrent.FutureTask.run(FutureTask.java:266)
>         at java.util.concurrent.ThreadPoolExecutor.runWorker(ThreadPool
> Executor.java:1142)
>         at java.util.concurrent.ThreadPoolExecutor$Worker.run(ThreadPoo
> lExecutor.java:617)
>         at java.lang.Thread.run(Thread.java:745)
> Caused by: org.apache.maven.plugin.MojoExecutionException: failed with 3
> bugs and 0 errors
>         at sun.reflect.NativeConstructorAccessorImpl.newInstance0(Native
> Method)
>         at sun.reflect.NativeConstructorAccessorImpl.newInstance(Native
> ConstructorAccessorImpl.java:62)
>         at sun.reflect.DelegatingConstructorAccessorImpl.newInstance(De
> legatingConstructorAccessorImpl.java:45)
>         at java.lang.reflect.Constructor.newInstance(Constructor.java:423)
>         at org.codehaus.groovy.reflection.CachedConstructor.invoke(
> CachedConstructor.java:77)
>         at org.codehaus.groovy.reflection.CachedConstructor.doConstruct
> orInvoke(CachedConstructor.java:71)
>         at org.codehaus.groovy.runtime.callsite.ConstructorSite$Constru
> ctorSiteNoUnwrap.callConstructor(ConstructorSite.java:81)
>         at org.codehaus.groovy.runtime.callsite.CallSiteArray.defaultCa
> llConstructor(CallSiteArray.java:57)
>         at org.codehaus.groovy.runtime.callsite.AbstractCallSite.callCo
> nstructor(AbstractCallSite.java:230)
>         at org.codehaus.groovy.runtime.callsite.AbstractCallSite.callCo
> nstructor(AbstractCallSite.java:242)
>         at org.codehaus.mojo.findbugs.FindbugsViolationCheckMojo.execut
> e(FindbugsViolationCheckMojo.groovy:530)
>         at org.apache.maven.plugin.DefaultBuildPluginManager.executeMoj
> o(DefaultBuildPluginManager.java:134)
>         at org.apache.maven.lifecycle.internal.MojoExecutor.execute(Moj
> oExecutor.java:208)
>         ... 31 more
> [ERROR]
> [ERROR] Re-run Maven using the -X switch to enable full debug logging.
> [ERROR]
> [ERROR] For more information about the errors and possible solutions,
> please read the following articles:
> [ERROR] [Help 1] http://cwiki.apache.org/conflu
> ence/display/MAVEN/MojoExecutionException
> [ERROR]
> [ERROR] After correcting the problems, you can resume the build with the
> command
> [ERROR]   mvn <goals> -rf :beam-sdks-java-io-mongodb
> [JENKINS] Archiving <https://builds.apache.org/job
> /beam_PostCommit_MavenVerify/ws/sdks/java/io/pom.xml> to
> org.apache.beam/beam-sdks-java-io-parent/0.4.0-incubating-
> SNAPSHOT/beam-sdks-java-io-parent-0.4.0-incubating-SNAPSHOT.pom
> [JENKINS] Archiving <https://builds.apache.org/job
> /beam_PostCommit_MavenVerify/ws/sdks/java/maven-archetypes/starter/pom.xml>
> to org.apache.beam/beam-sdks-java-maven-archetypes-starter/0.4.
> 0-incubating-SNAPSHOT/beam-sdks-java-maven-archetypes-
> starter-0.4.0-incubating-SNAPSHOT.pom
> [JENKINS] Archiving <https://builds.apache.org/job
> /beam_PostCommit_MavenVerify/ws/sdks/java/microbenchmarks/pom.xml> to
> org.apache.beam/beam-sdks-java-microbenchmarks/0.4.0-incubat
> ing-SNAPSHOT/beam-sdks-java-microbenchmarks-0.4.0-incubating-SNAPSHOT.pom
> [JENKINS] Archiving <https://builds.apache.org/job
> /beam_PostCommit_MavenVerify/ws/runners/direct-java/
> dependency-reduced-pom.xml> to org.apache.beam/beam-runners-d
> irect-java/0.4.0-incubating-SNAPSHOT/beam-runners-direct-jav
> a-0.4.0-incubating-SNAPSHOT.pom
> [JENKINS] Archiving <https://builds.apache.org/job
> /beam_PostCommit_MavenVerify/ws/runners/direct-java/target/
> beam-runners-direct-java-0.4.0-incubating-SNAPSHOT.jar> to
> org.apache.beam/beam-runners-direct-java/0.4.0-incubating-SN
> APSHOT/beam-runners-direct-java-0.4.0-incubating-SNAPSHOT.jar
> [JENKINS] Archiving <https://builds.apache.org/job
> /beam_PostCommit_MavenVerify/ws/runners/direct-java/target/
> beam-runners-direct-java-0.4.0-incubating-SNAPSHOT-javadoc.jar> to
> org.apache.beam/beam-runners-direct-java/0.4.0-incubating-SN
> APSHOT/beam-runners-direct-java-0.4.0-incubating-SNAPSHOT-javadoc.jar
> [JENKINS] Archiving <https://builds.apache.org/job
> /beam_PostCommit_MavenVerify/ws/runners/direct-java/target/
> beam-runners-direct-java-0.4.0-incubating-SNAPSHOT-sources.jar> to
> org.apache.beam/beam-runners-direct-java/0.4.0-incubating-SN
> APSHOT/beam-runners-direct-java-0.4.0-incubating-SNAPSHOT-sources.jar
> [JENKINS] Archiving <https://builds.apache.org/job
> /beam_PostCommit_MavenVerify/ws/runners/direct-java/target/
> beam-runners-direct-java-0.4.0-incubating-SNAPSHOT-test-sources.jar> to
> org.apache.beam/beam-runners-direct-java/0.4.0-incubating-SN
> APSHOT/beam-runners-direct-java-0.4.0-incubating-SNAPSHOT-test-sources.jar
> [JENKINS] Archiving <https://builds.apache.org/job
> /beam_PostCommit_MavenVerify/ws/runners/direct-java/target/
> beam-runners-direct-java-0.4.0-incubating-SNAPSHOT-tests.jar> to
> org.apache.beam/beam-runners-direct-java/0.4.0-incubating-SN
> APSHOT/beam-runners-direct-java-0.4.0-incubating-SNAPSHOT-tests.jar
> [JENKINS] Archiving <https://builds.apache.org/job
> /beam_PostCommit_MavenVerify/ws/examples/java/pom.xml> to
> org.apache.beam/beam-examples-java/0.4.0-incubating-SNAPSHOT
> /beam-examples-java-0.4.0-incubating-SNAPSHOT.pom
> [JENKINS] Archiving <https://builds.apache.org/job
> /beam_PostCommit_MavenVerify/ws/sdks/java/build-tools/pom.xml> to
> org.apache.beam/beam-sdks-java-build-tools/0.4.0-incubating-
> SNAPSHOT/beam-sdks-java-build-tools-0.4.0-incubating-SNAPSHOT.pom
> [JENKINS] Archiving <https://builds.apache.org/job
> /beam_PostCommit_MavenVerify/ws/sdks/java/build-tools/
> target/beam-sdks-java-build-tools-0.4.0-incubating-SNAPSHOT.jar> to
> org.apache.beam/beam-sdks-java-build-tools/0.4.0-incubating-
> SNAPSHOT/beam-sdks-java-build-tools-0.4.0-incubating-SNAPSHOT.jar
> [JENKINS] Archiving <https://builds.apache.org/job
> /beam_PostCommit_MavenVerify/ws/sdks/java/build-tools/
> target/beam-sdks-java-build-tools-0.4.0-incubating-SNAPSHOT-sources.jar>
> to org.apache.beam/beam-sdks-java-build-tools/0.4.0-incubating-
> SNAPSHOT/beam-sdks-java-build-tools-0.4.0-incubating-SNAPSHOT-sources.jar
> [JENKINS] Archiving <https://builds.apache.org/job
> /beam_PostCommit_MavenVerify/ws/sdks/java/build-tools/
> target/beam-sdks-java-build-tools-0.4.0-incubating-
> SNAPSHOT-test-sources.jar> to org.apache.beam/beam-sdks-java
> -build-tools/0.4.0-incubating-SNAPSHOT/beam-sdks-java-build-
> tools-0.4.0-incubating-SNAPSHOT-test-sources.jar
> [JENKINS] Archiving <https://builds.apache.org/job
> /beam_PostCommit_MavenVerify/ws/sdks/java/build-tools/
> target/beam-sdks-java-build-tools-0.4.0-incubating-SNAPSHOT-tests.jar> to
> org.apache.beam/beam-sdks-java-build-tools/0.4.0-incubating-
> SNAPSHOT/beam-sdks-java-build-tools-0.4.0-incubating-SNAPSHOT-tests.jar
> [JENKINS] Archiving <https://builds.apache.org/job
> /beam_PostCommit_MavenVerify/ws/sdks/java/core/dependency-reduced-pom.xml>
> to org.apache.beam/beam-sdks-java-core/0.4.0-incubating-SNAPSHO
> T/beam-sdks-java-core-0.4.0-incubating-SNAPSHOT.pom
> [JENKINS] Archiving <https://builds.apache.org/job
> /beam_PostCommit_MavenVerify/ws/sdks/java/core/target/beam-
> sdks-java-core-0.4.0-incubating-SNAPSHOT.jar> to
> org.apache.beam/beam-sdks-java-core/0.4.0-incubating-SNAPSHO
> T/beam-sdks-java-core-0.4.0-incubating-SNAPSHOT.jar
> [JENKINS] Archiving <https://builds.apache.org/job
> /beam_PostCommit_MavenVerify/ws/sdks/java/core/target/beam-
> sdks-java-core-0.4.0-incubating-SNAPSHOT-javadoc.jar> to
> org.apache.beam/beam-sdks-java-core/0.4.0-incubating-SNAPSHO
> T/beam-sdks-java-core-0.4.0-incubating-SNAPSHOT-javadoc.jar
> [JENKINS] Archiving <https://builds.apache.org/job
> /beam_PostCommit_MavenVerify/ws/sdks/java/core/target/beam-
> sdks-java-core-0.4.0-incubating-SNAPSHOT-sources.jar> to
> org.apache.beam/beam-sdks-java-core/0.4.0-incubating-SNAPSHO
> T/beam-sdks-java-core-0.4.0-incubating-SNAPSHOT-sources.jar
> [JENKINS] Archiving <https://builds.apache.org/job
> /beam_PostCommit_MavenVerify/ws/sdks/java/core/target/beam-
> sdks-java-core-0.4.0-incubating-SNAPSHOT-test-sources.jar> to
> org.apache.beam/beam-sdks-java-core/0.4.0-incubating-SNAPSHO
> T/beam-sdks-java-core-0.4.0-incubating-SNAPSHOT-test-sources.jar
> [JENKINS] Archiving <https://builds.apache.org/job
> /beam_PostCommit_MavenVerify/ws/sdks/java/core/target/beam-
> sdks-java-core-0.4.0-incubating-SNAPSHOT-tests.jar> to
> org.apache.beam/beam-sdks-java-core/0.4.0-incubating-SNAPSHO
> T/beam-sdks-java-core-0.4.0-incubating-SNAPSHOT-tests.jar
> Compressed 11.23 MB of artifacts by 11.1% relative to #1822
> [JENKINS] Archiving <https://builds.apache.org/job
> /beam_PostCommit_MavenVerify/ws/runners/flink/examples/pom.xml> to
> org.apache.beam/beam-runners-flink_2.10-examples/0.4.0-incub
> ating-SNAPSHOT/beam-runners-flink_2.10-examples-0.4.0-
> incubating-SNAPSHOT.pom
> [JENKINS] Archiving <https://builds.apache.org/job
> /beam_PostCommit_MavenVerify/ws/runners/core-java/
> dependency-reduced-pom.xml> to org.apache.beam/beam-runners-c
> ore-java/0.4.0-incubating-SNAPSHOT/beam-runners-core-java-0.
> 4.0-incubating-SNAPSHOT.pom
> [JENKINS] Archiving <https://builds.apache.org/job
> /beam_PostCommit_MavenVerify/ws/runners/core-java/target/
> beam-runners-core-java-0.4.0-incubating-SNAPSHOT.jar> to
> org.apache.beam/beam-runners-core-java/0.4.0-incubating-SNAP
> SHOT/beam-runners-core-java-0.4.0-incubating-SNAPSHOT.jar
> [JENKINS] Archiving <https://builds.apache.org/job
> /beam_PostCommit_MavenVerify/ws/runners/core-java/target/
> beam-runners-core-java-0.4.0-incubating-SNAPSHOT-javadoc.jar> to
> org.apache.beam/beam-runners-core-java/0.4.0-incubating-SNAP
> SHOT/beam-runners-core-java-0.4.0-incubating-SNAPSHOT-javadoc.jar
> [JENKINS] Archiving <https://builds.apache.org/job
> /beam_PostCommit_MavenVerify/ws/runners/core-java/target/
> beam-runners-core-java-0.4.0-incubating-SNAPSHOT-sources.jar> to
> org.apache.beam/beam-runners-core-java/0.4.0-incubating-SNAP
> SHOT/beam-runners-core-java-0.4.0-incubating-SNAPSHOT-sources.jar
> [JENKINS] Archiving <https://builds.apache.org/job
> /beam_PostCommit_MavenVerify/ws/runners/core-java/target/
> beam-runners-core-java-0.4.0-incubating-SNAPSHOT-test-sources.jar> to
> org.apache.beam/beam-runners-core-java/0.4.0-incubating-SNAP
> SHOT/beam-runners-core-java-0.4.0-incubating-SNAPSHOT-test-sources.jar
> [JENKINS] Archiving <https://builds.apache.org/job
> /beam_PostCommit_MavenVerify/ws/runners/core-java/target/
> beam-runners-core-java-0.4.0-incubating-SNAPSHOT-tests.jar> to
> org.apache.beam/beam-runners-core-java/0.4.0-incubating-SNAP
> SHOT/beam-runners-core-java-0.4.0-incubating-SNAPSHOT-tests.jar
> [JENKINS] Archiving <https://builds.apache.org/job
> /beam_PostCommit_MavenVerify/ws/sdks/java/io/kinesis/pom.xml> to
> org.apache.beam/beam-sdks-java-io-kinesis/0.4.0-incubating-
> SNAPSHOT/beam-sdks-java-io-kinesis-0.4.0-incubating-SNAPSHOT.pom
> [JENKINS] Archiving <https://builds.apache.org/job
> /beam_PostCommit_MavenVerify/ws/sdks/java/io/kinesis/
> target/beam-sdks-java-io-kinesis-0.4.0-incubating-SNAPSHOT.jar> to
> org.apache.beam/beam-sdks-java-io-kinesis/0.4.0-incubating-
> SNAPSHOT/beam-sdks-java-io-kinesis-0.4.0-incubating-SNAPSHOT.jar
> [JENKINS] Archiving <https://builds.apache.org/job
> /beam_PostCommit_MavenVerify/ws/sdks/java/io/kinesis/
> target/beam-sdks-java-io-kinesis-0.4.0-incubating-SNAPSHOT-javadoc.jar>
> to org.apache.beam/beam-sdks-java-io-kinesis/0.4.0-incubating-
> SNAPSHOT/beam-sdks-java-io-kinesis-0.4.0-incubating-SNAPSHOT-javadoc.jar
> [JENKINS] Archiving <https://builds.apache.org/job
> /beam_PostCommit_MavenVerify/ws/sdks/java/io/kinesis/
> target/beam-sdks-java-io-kinesis-0.4.0-incubating-SNAPSHOT-sources.jar>
> to org.apache.beam/beam-sdks-java-io-kinesis/0.4.0-incubating-
> SNAPSHOT/beam-sdks-java-io-kinesis-0.4.0-incubating-SNAPSHOT-sources.jar
> [JENKINS] Archiving <https://builds.apache.org/job
> /beam_PostCommit_MavenVerify/ws/sdks/java/io/kinesis/
> target/beam-sdks-java-io-kinesis-0.4.0-incubating-SNAPS
> HOT-test-sources.jar> to org.apache.beam/beam-sdks-java
> -io-kinesis/0.4.0-incubating-SNAPSHOT/beam-sdks-java-io-
> kinesis-0.4.0-incubating-SNAPSHOT-test-sources.jar
> [JENKINS] Archiving <https://builds.apache.org/job
> /beam_PostCommit_MavenVerify/ws/sdks/java/io/kinesis/
> target/beam-sdks-java-io-kinesis-0.4.0-incubating-SNAPSHOT-tests.jar> to
> org.apache.beam/beam-sdks-java-io-kinesis/0.4.0-incubating-
> SNAPSHOT/beam-sdks-java-io-kinesis-0.4.0-incubating-SNAPSHOT-tests.jar
> [JENKINS] Archiving <https://builds.apache.org/job
> /beam_PostCommit_MavenVerify/ws/sdks/java/io/kafka/pom.xml> to
> org.apache.beam/beam-sdks-java-io-kafka/0.4.0-incubating-
> SNAPSHOT/beam-sdks-java-io-kafka-0.4.0-incubating-SNAPSHOT.pom
> [JENKINS] Archiving <https://builds.apache.org/job
> /beam_PostCommit_MavenVerify/ws/sdks/java/io/kafka/target/
> beam-sdks-java-io-kafka-0.4.0-incubating-SNAPSHOT.jar> to
> org.apache.beam/beam-sdks-java-io-kafka/0.4.0-incubating-
> SNAPSHOT/beam-sdks-java-io-kafka-0.4.0-incubating-SNAPSHOT.jar
> [JENKINS] Archiving <https://builds.apache.org/job
> /beam_PostCommit_MavenVerify/ws/sdks/java/io/kafka/target/
> beam-sdks-java-io-kafka-0.4.0-incubating-SNAPSHOT-javadoc.jar> to
> org.apache.beam/beam-sdks-java-io-kafka/0.4.0-incubating-
> SNAPSHOT/beam-sdks-java-io-kafka-0.4.0-incubating-SNAPSHOT-javadoc.jar
> [JENKINS] Archiving <https://builds.apache.org/job
> /beam_PostCommit_MavenVerify/ws/sdks/java/io/kafka/target/
> beam-sdks-java-io-kafka-0.4.0-incubating-SNAPSHOT-sources.jar> to
> org.apache.beam/beam-sdks-java-io-kafka/0.4.0-incubating-
> SNAPSHOT/beam-sdks-java-io-kafka-0.4.0-incubating-SNAPSHOT-sources.jar
> [JENKINS] Archiving <https://builds.apache.org/job
> /beam_PostCommit_MavenVerify/ws/sdks/java/io/kafka/target/
> beam-sdks-java-io-kafka-0.4.0-incubating-SNAPSHOT-test-sources.jar> to
> org.apache.beam/beam-sdks-java-io-kafka/0.4.0-incubating-
> SNAPSHOT/beam-sdks-java-io-kafka-0.4.0-incubating-
> SNAPSHOT-test-sources.jar
> [JENKINS] Archiving <https://builds.apache.org/job
> /beam_PostCommit_MavenVerify/ws/sdks/java/io/kafka/target/
> beam-sdks-java-io-kafka-0.4.0-incubating-SNAPSHOT-tests.jar> to
> org.apache.beam/beam-sdks-java-io-kafka/0.4.0-incubating-
> SNAPSHOT/beam-sdks-java-io-kafka-0.4.0-incubating-SNAPSHOT-tests.jar
> [JENKINS] Archiving <https://builds.apache.org/job
> /beam_PostCommit_MavenVerify/ws/runners/flink/runner/pom.xml> to
> org.apache.beam/beam-runners-flink_2.10/0.4.0-incubating-SNA
> PSHOT/beam-runners-flink_2.10-0.4.0-incubating-SNAPSHOT.pom
> [JENKINS] Archiving <https://builds.apache.org/job
> /beam_PostCommit_MavenVerify/ws/sdks/java/io/google-cloud-platform/pom.xml>
> to org.apache.beam/beam-sdks-java-io-google-cloud-platform/0.4.
> 0-incubating-SNAPSHOT/beam-sdks-java-io-google-cloud-
> platform-0.4.0-incubating-SNAPSHOT.pom
> [JENKINS] Archiving <https://builds.apache.org/job
> /beam_PostCommit_MavenVerify/ws/sdks/java/io/google-cloud-
> platform/target/beam-sdks-java-io-google-cloud-platform-
> 0.4.0-incubating-SNAPSHOT.jar> to org.apache.beam/beam-sdks-java
> -io-google-cloud-platform/0.4.0-incubating-SNAPSHOT/beam-
> sdks-java-io-google-cloud-platform-0.4.0-incubating-SNAPSHOT.jar
> [JENKINS] Archiving <https://builds.apache.org/job
> /beam_PostCommit_MavenVerify/ws/sdks/java/io/google-cloud-
> platform/target/beam-sdks-java-io-google-cloud-platform-
> 0.4.0-incubating-SNAPSHOT-javadoc.jar> to org.apache.beam/beam-sdks-java
> -io-google-cloud-platform/0.4.0-incubating-SNAPSHOT/beam-
> sdks-java-io-google-cloud-platform-0.4.0-incubating-SNAPSHOT-javadoc.jar
> [JENKINS] Archiving <https://builds.apache.org/job
> /beam_PostCommit_MavenVerify/ws/sdks/java/io/google-cloud-
> platform/target/beam-sdks-java-io-google-cloud-platform-
> 0.4.0-incubating-SNAPSHOT-sources.jar> to org.apache.beam/beam-sdks-java
> -io-google-cloud-platform/0.4.0-incubating-SNAPSHOT/beam-
> sdks-java-io-google-cloud-platform-0.4.0-incubating-SNAPSHOT-sources.jar
> [JENKINS] Archiving <https://builds.apache.org/job
> /beam_PostCommit_MavenVerify/ws/sdks/java/io/google-cloud-
> platform/target/beam-sdks-java-io-google-cloud-platform-
> 0.4.0-incubating-SNAPSHOT-test-sources.jar> to
> org.apache.beam/beam-sdks-java-io-google-cloud-platform/0.4.
> 0-incubating-SNAPSHOT/beam-sdks-java-io-google-cloud-
> platform-0.4.0-incubating-SNAPSHOT-test-sources.jar
> [JENKINS] Archiving <https://builds.apache.org/job
> /beam_PostCommit_MavenVerify/ws/sdks/java/io/google-cloud-
> platform/target/beam-sdks-java-io-google-cloud-platform-
> 0.4.0-incubating-SNAPSHOT-tests.jar> to org.apache.beam/beam-sdks-java
> -io-google-cloud-platform/0.4.0-incubating-SNAPSHOT/beam-
> sdks-java-io-google-cloud-platform-0.4.0-incubating-SNAPSHOT-tests.jar
> Compressed 639.77 KB of artifacts by 10.0% relative to #1822
> [JENKINS] Archiving <https://builds.apache.org/job
> /beam_PostCommit_MavenVerify/ws/sdks/java/pom.xml> to
> org.apache.beam/beam-sdks-java-parent/0.4.0-incubating-SNAPS
> HOT/beam-sdks-java-parent-0.4.0-incubating-SNAPSHOT.pom
> [JENKINS] Archiving <https://builds.apache.org/job
> /beam_PostCommit_MavenVerify/ws/pom.xml> to org.apache.beam/beam-parent/0.
> 4.0-incubating-SNAPSHOT/beam-parent-0.4.0-incubating-SNAPSHOT.pom
> Compressed 43.56 KB of artifacts by 73.5% relative to #1822
> [JENKINS] Archiving <https://builds.apache.org/job
> /beam_PostCommit_MavenVerify/ws/sdks/java/maven-archetypes/
> examples/pom.xml> to org.apache.beam/beam-sdks-java
> -maven-archetypes-examples/0.4.0-incubating-SNAPSHOT/beam-
> sdks-java-maven-archetypes-examples-0.4.0-incubating-SNAPSHOT.pom
> [JENKINS] Archiving <https://builds.apache.org/job
> /beam_PostCommit_MavenVerify/ws/runners/spark/pom.xml> to
> org.apache.beam/beam-runners-spark/0.4.0-incubating-SNAPSHOT
> /beam-runners-spark-0.4.0-incubating-SNAPSHOT.pom
> [JENKINS] Archiving <https://builds.apache.org/job
> /beam_PostCommit_MavenVerify/ws/sdks/java/io/hdfs/pom.xml> to
> org.apache.beam/beam-sdks-java-io-hdfs/0.4.0-incubating-SNAP
> SHOT/beam-sdks-java-io-hdfs-0.4.0-incubating-SNAPSHOT.pom
> [JENKINS] Archiving <https://builds.apache.org/job
> /beam_PostCommit_MavenVerify/ws/sdks/java/io/hdfs/target/
> beam-sdks-java-io-hdfs-0.4.0-incubating-SNAPSHOT.jar> to
> org.apache.beam/beam-sdks-java-io-hdfs/0.4.0-incubating-SNAP
> SHOT/beam-sdks-java-io-hdfs-0.4.0-incubating-SNAPSHOT.jar
> [JENKINS] Archiving <https://builds.apache.org/job
> /beam_PostCommit_MavenVerify/ws/sdks/java/io/hdfs/target/
> beam-sdks-java-io-hdfs-0.4.0-incubating-SNAPSHOT-javadoc.jar> to
> org.apache.beam/beam-sdks-java-io-hdfs/0.4.0-incubating-SNAP
> SHOT/beam-sdks-java-io-hdfs-0.4.0-incubating-SNAPSHOT-javadoc.jar
> [JENKINS] Archiving <https://builds.apache.org/job
> /beam_PostCommit_MavenVerify/ws/sdks/java/io/hdfs/target/
> beam-sdks-java-io-hdfs-0.4.0-incubating-SNAPSHOT-sources.jar> to
> org.apache.beam/beam-sdks-java-io-hdfs/0.4.0-incubating-SNAP
> SHOT/beam-sdks-java-io-hdfs-0.4.0-incubating-SNAPSHOT-sources.jar
> [JENKINS] Archiving <https://builds.apache.org/job
> /beam_PostCommit_MavenVerify/ws/sdks/java/io/hdfs/target/
> beam-sdks-java-io-hdfs-0.4.0-incubating-SNAPSHOT-test-sources.jar> to
> org.apache.beam/beam-sdks-java-io-hdfs/0.4.0-incubating-SNAP
> SHOT/beam-sdks-java-io-hdfs-0.4.0-incubating-SNAPSHOT-test-sources.jar
> [JENKINS] Archiving <https://builds.apache.org/job
> /beam_PostCommit_MavenVerify/ws/sdks/java/io/hdfs/target/
> beam-sdks-java-io-hdfs-0.4.0-incubating-SNAPSHOT-tests.jar> to
> org.apache.beam/beam-sdks-java-io-hdfs/0.4.0-incubating-SNAP
> SHOT/beam-sdks-java-io-hdfs-0.4.0-incubating-SNAPSHOT-tests.jar
> [JENKINS] Archiving <https://builds.apache.org/job
> /beam_PostCommit_MavenVerify/ws/sdks/java/maven-archetypes/pom.xml> to
> org.apache.beam/beam-sdks-java-maven-archetypes-parent/0.4.
> 0-incubating-SNAPSHOT/beam-sdks-java-maven-archetypes-
> parent-0.4.0-incubating-SNAPSHOT.pom
> [JENKINS] Archiving <https://builds.apache.org/job
> /beam_PostCommit_MavenVerify/ws/runners/google-cloud-
> dataflow-java/dependency-reduced-pom.xml> to
> org.apache.beam/beam-runners-google-cloud-dataflow-java/0.4.
> 0-incubating-SNAPSHOT/beam-runners-google-cloud-dataflow-jav
> a-0.4.0-incubating-SNAPSHOT.pom
> [JENKINS] Archiving <https://builds.apache.org/job
> /beam_PostCommit_MavenVerify/ws/runners/google-cloud-
> dataflow-java/target/beam-runners-google-cloud-dataflow-
> java-0.4.0-incubating-SNAPSHOT.jar> to org.apache.beam/beam-runners-g
> oogle-cloud-dataflow-java/0.4.0-incubating-SNAPSHOT/beam-run
> ners-google-cloud-dataflow-java-0.4.0-incubating-SNAPSHOT.jar
> [JENKINS] Archiving <https://builds.apache.org/job
> /beam_PostCommit_MavenVerify/ws/runners/google-cloud-
> dataflow-java/target/beam-runners-google-cloud-dataflow-
> java-0.4.0-incubating-SNAPSHOT-javadoc.jar> to
> org.apache.beam/beam-runners-google-cloud-dataflow-java/0.4.
> 0-incubating-SNAPSHOT/beam-runners-google-cloud-dataflow-jav
> a-0.4.0-incubating-SNAPSHOT-javadoc.jar
> [JENKINS] Archiving <https://builds.apache.org/job
> /beam_PostCommit_MavenVerify/ws/runners/google-cloud-
> dataflow-java/target/beam-runners-google-cloud-dataflow-
> java-0.4.0-incubating-SNAPSHOT-sources.jar> to
> org.apache.beam/beam-runners-google-cloud-dataflow-java/0.4.
> 0-incubating-SNAPSHOT/beam-runners-google-cloud-dataflow-jav
> a-0.4.0-incubating-SNAPSHOT-sources.jar
> [JENKINS] Archiving <https://builds.apache.org/job
> /beam_PostCommit_MavenVerify/ws/runners/google-cloud-
> dataflow-java/target/beam-runners-google-cloud-dataflow-
> java-0.4.0-incubating-SNAPSHOT-test-sources.jar> to
> org.apache.beam/beam-runners-google-cloud-dataflow-java/0.4.
> 0-incubating-SNAPSHOT/beam-runners-google-cloud-dataflow-jav
> a-0.4.0-incubating-SNAPSHOT-test-sources.jar
> [JENKINS] Archiving <https://builds.apache.org/job
> /beam_PostCommit_MavenVerify/ws/runners/google-cloud-
> dataflow-java/target/beam-runners-google-cloud-dataflow-
> java-0.4.0-incubating-SNAPSHOT-tests.jar> to
> org.apache.beam/beam-runners-google-cloud-dataflow-java/0.4.
> 0-incubating-SNAPSHOT/beam-runners-google-cloud-dataflow-jav
> a-0.4.0-incubating-SNAPSHOT-tests.jar
> [JENKINS] Archiving <https://builds.apache.org/job
> /beam_PostCommit_MavenVerify/ws/runners/apex/pom.xml> to
> org.apache.beam/beam-runners-apex/0.4.0-incubating-SNAPSHOT/
> beam-runners-apex-0.4.0-incubating-SNAPSHOT.pom
> [JENKINS] Archiving <https://builds.apache.org/job
> /beam_PostCommit_MavenVerify/ws/sdks/java/io/jms/pom.xml> to
> org.apache.beam/beam-sdks-java-io-jms/0.4.0-incubating-SNAPS
> HOT/beam-sdks-java-io-jms-0.4.0-incubating-SNAPSHOT.pom
> [JENKINS] Archiving <https://builds.apache.org/job
> /beam_PostCommit_MavenVerify/ws/sdks/java/io/jms/target/
> beam-sdks-java-io-jms-0.4.0-incubating-SNAPSHOT.jar> to
> org.apache.beam/beam-sdks-java-io-jms/0.4.0-incubating-SNAPS
> HOT/beam-sdks-java-io-jms-0.4.0-incubating-SNAPSHOT.jar
> [JENKINS] Archiving <https://builds.apache.org/job
> /beam_PostCommit_MavenVerify/ws/sdks/java/io/jms/target/
> beam-sdks-java-io-jms-0.4.0-incubating-SNAPSHOT-javadoc.jar> to
> org.apache.beam/beam-sdks-java-io-jms/0.4.0-incubating-SNAPS
> HOT/beam-sdks-java-io-jms-0.4.0-incubating-SNAPSHOT-javadoc.jar
> [JENKINS] Archiving <https://builds.apache.org/job
> /beam_PostCommit_MavenVerify/ws/sdks/java/io/jms/target/
> beam-sdks-java-io-jms-0.4.0-incubating-SNAPSHOT-sources.jar> to
> org.apache.beam/beam-sdks-java-io-jms/0.4.0-incubating-SNAPS
> HOT/beam-sdks-java-io-jms-0.4.0-incubating-SNAPSHOT-sources.jar
> [JENKINS] Archiving <https://builds.apache.org/job
> /beam_PostCommit_MavenVerify/ws/sdks/java/io/jms/target/
> beam-sdks-java-io-jms-0.4.0-incubating-SNAPSHOT-test-sources.jar> to
> org.apache.beam/beam-sdks-java-io-jms/0.4.0-incubating-SNAPS
> HOT/beam-sdks-java-io-jms-0.4.0-incubating-SNAPSHOT-test-sources.jar
> [JENKINS] Archiving <https://builds.apache.org/job
> /beam_PostCommit_MavenVerify/ws/sdks/java/io/jms/target/
> beam-sdks-java-io-jms-0.4.0-incubating-SNAPSHOT-tests.jar> to
> org.apache.beam/beam-sdks-java-io-jms/0.4.0-incubating-SNAPS
> HOT/beam-sdks-java-io-jms-0.4.0-incubating-SNAPSHOT-tests.jar
> [JENKINS] Archiving <https://builds.apache.org/job
> /beam_PostCommit_MavenVerify/ws/runners/flink/pom.xml> to
> org.apache.beam/beam-runners-flink-parent/0.4.0-incubating-S
> NAPSHOT/beam-runners-flink-parent-0.4.0-incubating-SNAPSHOT.pom
> [JENKINS] Archiving <https://builds.apache.org/job
> /beam_PostCommit_MavenVerify/ws/sdks/java/io/mongodb/pom.xml> to
> org.apache.beam/beam-sdks-java-io-mongodb/0.4.0-incubating-
> SNAPSHOT/beam-sdks-java-io-mongodb-0.4.0-incubating-SNAPSHOT.pom
> [JENKINS] Archiving <https://builds.apache.org/job
> /beam_PostCommit_MavenVerify/ws/sdks/java/extensions/sorter/pom.xml> to
> org.apache.beam/beam-sdks-java-extensions-sorter/0.4.0-incub
> ating-SNAPSHOT/beam-sdks-java-extensions-sorter-0.4.0-incuba
> ting-SNAPSHOT.pom
> [JENKINS] Archiving <https://builds.apache.org/job
> /beam_PostCommit_MavenVerify/ws/sdks/pom.xml> to
> org.apache.beam/beam-sdks-parent/0.4.0-incubating-SNAPSHOT/
> beam-sdks-parent-0.4.0-incubating-SNAPSHOT.pom
> [JENKINS] Archiving <https://builds.apache.org/job
> /beam_PostCommit_MavenVerify/ws/sdks/java/extensions/join-library/pom.xml>
> to org.apache.beam/beam-sdks-java-extensions-join-library/0.4.
> 0-incubating-SNAPSHOT/beam-sdks-java-extensions-join-
> library-0.4.0-incubating-SNAPSHOT.pom
> [JENKINS] Archiving <https://builds.apache.org/job
> /beam_PostCommit_MavenVerify/ws/runners/pom.xml> to
> org.apache.beam/beam-runners-parent/0.4.0-incubating-SNAPSHO
> T/beam-runners-parent-0.4.0-incubating-SNAPSHOT.pom
> [JENKINS] Archiving <https://builds.apache.org/job
> /beam_PostCommit_MavenVerify/ws/sdks/java/io/jdbc/pom.xml> to
> org.apache.beam/beam-sdks-java-io-jdbc/0.4.0-incubating-SNAP
> SHOT/beam-sdks-java-io-jdbc-0.4.0-incubating-SNAPSHOT.pom
> [JENKINS] Archiving <https://builds.apache.org/job
> /beam_PostCommit_MavenVerify/ws/sdks/java/extensions/pom.xml> to
> org.apache.beam/beam-sdks-java-extensions-parent/0.4.0-incub
> ating-SNAPSHOT/beam-sdks-java-extensions-parent-0.4.0-incuba
> ting-SNAPSHOT.pom
> [JENKINS] Archiving <https://builds.apache.org/job
> /beam_PostCommit_MavenVerify/ws/examples/pom.xml> to
> org.apache.beam/beam-examples-parent/0.4.0-incubating-SNAPSH
> OT/beam-examples-parent-0.4.0-incubating-SNAPSHOT.pom
> channel stopped
>

Mime
View raw message