beam-commits mailing list archives

Site index · List index
Message view « Date » · « Thread »
Top « Date » · « Thread »
From Apache Jenkins Server <jenk...@builds.apache.org>
Subject Build failed in Jenkins: beam_PostCommit_MavenVerify #1686
Date Tue, 01 Nov 2016 01:58:34 GMT
See <https://builds.apache.org/job/beam_PostCommit_MavenVerify/1686/changes>

Changes:

[dhalperi] Add NestedValueProvider

------------------------------------------
[...truncated 212 lines...]
[INFO] Using 'UTF-8' encoding to copy filtered resources.
[INFO] Copying 3 resources
[INFO] Copying 3 resources
[INFO] 
[INFO] --- maven-compiler-plugin:3.5.1:compile (default-compile) @ beam-sdks-java-build-tools
---
[INFO] No sources to compile
[INFO] 
[INFO] --- maven-compiler-plugin:3.5.1:compile (compile-package-info) @ beam-sdks-java-build-tools
---
[INFO] No sources to compile
[INFO] 
[INFO] --- maven-resources-plugin:2.7:testResources (default-testResources) @ beam-sdks-java-build-tools
---
[INFO] Using 'UTF-8' encoding to copy filtered resources.
[INFO] skip non existing resourceDirectory <https://builds.apache.org/job/beam_PostCommit_MavenVerify/ws/sdks/java/build-tools/src/test/resources>
[INFO] Copying 3 resources
[INFO] 
[INFO] --- maven-compiler-plugin:3.5.1:testCompile (default-testCompile) @ beam-sdks-java-build-tools
---
[INFO] No sources to compile
[INFO] 
[INFO] --- maven-surefire-plugin:2.19.1:test (default-test) @ beam-sdks-java-build-tools ---
[JENKINS] Recording test results
[INFO] 
[INFO] --- maven-jar-plugin:2.5:jar (default-jar) @ beam-sdks-java-build-tools ---
[INFO] Building jar: <https://builds.apache.org/job/beam_PostCommit_MavenVerify/ws/sdks/java/build-tools/target/beam-sdks-java-build-tools-0.4.0-incubating-SNAPSHOT.jar>
[INFO] 
[INFO] --- maven-site-plugin:3.4:attach-descriptor (attach-descriptor) @ beam-sdks-java-build-tools
---
[INFO] 
[INFO] --- maven-jar-plugin:2.5:test-jar (default-test-jar) @ beam-sdks-java-build-tools ---
[INFO] Building jar: <https://builds.apache.org/job/beam_PostCommit_MavenVerify/ws/sdks/java/build-tools/target/beam-sdks-java-build-tools-0.4.0-incubating-SNAPSHOT-tests.jar>
[INFO] 
[INFO] --- maven-dependency-plugin:2.10:analyze-only (default) @ beam-sdks-java-build-tools
---
[INFO] No dependency problems found
[INFO] 
[INFO] --- apache-rat-plugin:0.11:check (default) @ beam-sdks-java-build-tools ---
[INFO] 51 implicit excludes (use -debug for more details).
[INFO] Exclude: **/target/**/*
[INFO] Exclude: **/dependency-reduced-pom.xml
[INFO] Exclude: **/hs_err_pid*.log
[INFO] Exclude: .github/**/*
[INFO] Exclude: **/*.iml
[INFO] Exclude: **/package-list
[INFO] Exclude: **/user.avsc
[INFO] Exclude: **/test/resources/**/*.txt
[INFO] Exclude: **/test/**/.placeholder
[INFO] Exclude: .repository/**/*
[INFO] Exclude: **/.checkstyle
[INFO] Exclude: **/.classpath
[INFO] Exclude: **/.factorypath
[INFO] Exclude: **/.project
[INFO] Exclude: **/.settings/**/*
[INFO] 4 resources included (use -debug for more details)
[INFO] Rat check: Summary of files. Unapproved: 0 unknown: 0 generated: 0 approved: 4 licence.
[INFO] 
[INFO] --- maven-install-plugin:2.5.2:install (default-install) @ beam-sdks-java-build-tools
---
[INFO] Installing <https://builds.apache.org/job/beam_PostCommit_MavenVerify/ws/sdks/java/build-tools/target/beam-sdks-java-build-tools-0.4.0-incubating-SNAPSHOT.jar>
to <https://builds.apache.org/job/beam_PostCommit_MavenVerify/ws/.repository/org/apache/beam/beam-sdks-java-build-tools/0.4.0-incubating-SNAPSHOT/beam-sdks-java-build-tools-0.4.0-incubating-SNAPSHOT.jar>
[INFO] Installing <https://builds.apache.org/job/beam_PostCommit_MavenVerify/ws/sdks/java/build-tools/pom.xml>
to <https://builds.apache.org/job/beam_PostCommit_MavenVerify/ws/.repository/org/apache/beam/beam-sdks-java-build-tools/0.4.0-incubating-SNAPSHOT/beam-sdks-java-build-tools-0.4.0-incubating-SNAPSHOT.pom>
[INFO] Installing <https://builds.apache.org/job/beam_PostCommit_MavenVerify/ws/sdks/java/build-tools/target/beam-sdks-java-build-tools-0.4.0-incubating-SNAPSHOT-tests.jar>
to <https://builds.apache.org/job/beam_PostCommit_MavenVerify/ws/.repository/org/apache/beam/beam-sdks-java-build-tools/0.4.0-incubating-SNAPSHOT/beam-sdks-java-build-tools-0.4.0-incubating-SNAPSHOT-tests.jar>
[INFO]                                                                         
[INFO] ------------------------------------------------------------------------
[INFO] Building Apache Beam :: SDKs :: Java :: Core 0.4.0-incubating-SNAPSHOT
[INFO] ------------------------------------------------------------------------
[INFO] Downloading: https://repo.maven.apache.org/maven2/io/netty/netty-codec-http2/maven-metadata.xml
[INFO] Downloading: http://repository.apache.org/snapshots/io/netty/netty-codec-http2/maven-metadata.xml
[INFO] Downloaded: https://repo.maven.apache.org/maven2/io/netty/netty-codec-http2/maven-metadata.xml
(2 KB at 3.1 KB/sec)
[INFO] 
[INFO] --- maven-clean-plugin:2.5:clean (default-clean) @ beam-sdks-java-core ---
[INFO] Deleting <https://builds.apache.org/job/beam_PostCommit_MavenVerify/ws/sdks/java/core/target>
[INFO] 
[INFO] --- maven-enforcer-plugin:1.3.1:enforce (enforce) @ beam-sdks-java-core ---
[INFO] 
[INFO] --- jacoco-maven-plugin:0.7.5.201505241946:prepare-agent (default) @ beam-sdks-java-core
---
[INFO] argLine set to -javaagent:<https://builds.apache.org/job/beam_PostCommit_MavenVerify/ws/.repository/org/jacoco/org.jacoco.agent/0.7.5.201505241946/org.jacoco.agent-0.7.5.201505241946-runtime.jar=destfile=/home/jenkins/jenkins-slave/workspace/beam_PostCommit_MavenVerify/sdks/java/core/target/jacoco.exec,excludes=**/AutoValue_*.class,dumponexit=true,output=file>
[INFO] 
[INFO] --- avro-maven-plugin:1.8.1:schema (schemas) @ beam-sdks-java-core ---
[INFO] 
[INFO] --- maven-remote-resources-plugin:1.5:process (default) @ beam-sdks-java-core ---
[INFO] artifact io.netty:netty-codec-http2: checking for updates from central
[INFO] 
[INFO] --- maven-resources-plugin:2.7:resources (default-resources) @ beam-sdks-java-core
---
[INFO] Using 'UTF-8' encoding to copy filtered resources.
[INFO] Copying 1 resource
[INFO] Copying 3 resources
[INFO] 
[INFO] --- maven-compiler-plugin:3.5.1:compile (default-compile) @ beam-sdks-java-core ---
[INFO] Changes detected - recompiling the module!
[INFO] Compiling 383 source files to <https://builds.apache.org/job/beam_PostCommit_MavenVerify/ws/sdks/java/core/target/classes>
[INFO] <https://builds.apache.org/job/beam_PostCommit_MavenVerify/ws/sdks/java/core/src/main/java/org/apache/beam/sdk/util/state/StateTable.java>:
Some input files use or override a deprecated API.
[INFO] <https://builds.apache.org/job/beam_PostCommit_MavenVerify/ws/sdks/java/core/src/main/java/org/apache/beam/sdk/util/state/StateTable.java>:
Recompile with -Xlint:deprecation for details.
[INFO] <https://builds.apache.org/job/beam_PostCommit_MavenVerify/ws/sdks/java/core/src/main/java/org/apache/beam/sdk/options/ValueProvider.java>:
Some input files use unchecked or unsafe operations.
[INFO] <https://builds.apache.org/job/beam_PostCommit_MavenVerify/ws/sdks/java/core/src/main/java/org/apache/beam/sdk/options/ValueProvider.java>:
Recompile with -Xlint:unchecked for details.
[INFO] 
[INFO] --- maven-compiler-plugin:3.5.1:compile (compile-package-info) @ beam-sdks-java-core
---
[INFO] Changes detected - recompiling the module!
[INFO] Compiling 21 source files to <https://builds.apache.org/job/beam_PostCommit_MavenVerify/ws/sdks/java/core/target/classes>
[WARNING] bootstrap class path not set in conjunction with -source 1.7
[INFO] 
[INFO] --- maven-resources-plugin:2.7:resources (resources) @ beam-sdks-java-core ---
[INFO] Using 'UTF-8' encoding to copy filtered resources.
[INFO] Copying 1 resource
[INFO] Copying 3 resources
[INFO] 
[INFO] --- build-helper-maven-plugin:1.10:add-test-source (add-test-source) @ beam-sdks-java-core
---
[INFO] Test Source directory: <https://builds.apache.org/job/beam_PostCommit_MavenVerify/ws/sdks/java/core/target/generated-test-sources/java>
added.
[INFO] 
[INFO] --- maven-resources-plugin:2.7:testResources (default-testResources) @ beam-sdks-java-core
---
[INFO] Using 'UTF-8' encoding to copy filtered resources.
[INFO] skip non existing resourceDirectory <https://builds.apache.org/job/beam_PostCommit_MavenVerify/ws/sdks/java/core/src/test/resources>
[INFO] Copying 3 resources
[INFO] 
[INFO] --- maven-compiler-plugin:3.5.1:testCompile (default-testCompile) @ beam-sdks-java-core
---
[INFO] Changes detected - recompiling the module!
[INFO] Compiling 250 source files to <https://builds.apache.org/job/beam_PostCommit_MavenVerify/ws/sdks/java/core/target/test-classes>
[INFO] <https://builds.apache.org/job/beam_PostCommit_MavenVerify/ws/sdks/java/core/src/test/java/org/apache/beam/sdk/transforms/reflect/DoFnInvokersTest.java>:
Some input files use or override a deprecated API.
[INFO] <https://builds.apache.org/job/beam_PostCommit_MavenVerify/ws/sdks/java/core/src/test/java/org/apache/beam/sdk/transforms/reflect/DoFnInvokersTest.java>:
Recompile with -Xlint:deprecation for details.
[INFO] <https://builds.apache.org/job/beam_PostCommit_MavenVerify/ws/sdks/java/core/src/test/java/org/apache/beam/sdk/transforms/LatestTest.java>:
Some input files use unchecked or unsafe operations.
[INFO] <https://builds.apache.org/job/beam_PostCommit_MavenVerify/ws/sdks/java/core/src/test/java/org/apache/beam/sdk/transforms/LatestTest.java>:
Recompile with -Xlint:unchecked for details.
[INFO] 
[INFO] --- maven-checkstyle-plugin:2.17:check (default) @ beam-sdks-java-core ---
[INFO] Starting audit...
[ERROR] <https://builds.apache.org/job/beam_PostCommit_MavenVerify/ws/sdks/java/core/src/main/java/org/apache/beam/sdk/options/ValueProvider.java>:100:3:
Redundant 'static' modifier. [RedundantModifier]
Audit done.
[INFO] There is 1 error reported by Checkstyle 6.19 with beam/checkstyle.xml ruleset.
[ERROR] src/main/java/org/apache/beam/sdk/options/ValueProvider.java:[100,3] (modifier) RedundantModifier:
Redundant 'static' modifier.
[INFO]                                                                         
[INFO] ------------------------------------------------------------------------
[INFO] Skipping Apache Beam :: Parent
[INFO] This project has been banned from the build due to previous failures.
[INFO] ------------------------------------------------------------------------
[INFO] ------------------------------------------------------------------------
[INFO] Reactor Summary:
[INFO] 
[INFO] Apache Beam :: Parent .............................. SUCCESS [ 17.156 s]
[INFO] Apache Beam :: SDKs ................................ SUCCESS [  1.277 s]
[INFO] Apache Beam :: SDKs :: Java ........................ SUCCESS [  1.302 s]
[INFO] Apache Beam :: SDKs :: Java :: Build Tools ......... SUCCESS [  3.327 s]
[INFO] Apache Beam :: SDKs :: Java :: Core ................ FAILURE [ 42.020 s]
[INFO] Apache Beam :: Runners ............................. SKIPPED
[INFO] Apache Beam :: Runners :: Core Java ................ SKIPPED
[INFO] Apache Beam :: Runners :: Direct Java .............. SKIPPED
[INFO] Apache Beam :: Runners :: Google Cloud Dataflow .... SKIPPED
[INFO] Apache Beam :: SDKs :: Java :: IO .................. SKIPPED
[INFO] Apache Beam :: SDKs :: Java :: IO :: Google Cloud Platform SKIPPED
[INFO] Apache Beam :: SDKs :: Java :: IO :: HDFS .......... SKIPPED
[INFO] Apache Beam :: SDKs :: Java :: IO :: JMS ........... SKIPPED
[INFO] Apache Beam :: SDKs :: Java :: IO :: Kafka ......... SKIPPED
[INFO] Apache Beam :: SDKs :: Java :: IO :: Kinesis ....... SKIPPED
[INFO] Apache Beam :: SDKs :: Java :: IO :: MongoDB ....... SKIPPED
[INFO] Apache Beam :: SDKs :: Java :: IO :: JDBC .......... SKIPPED
[INFO] Apache Beam :: SDKs :: Java :: Extensions .......... SKIPPED
[INFO] Apache Beam :: SDKs :: Java :: Extensions :: Join library SKIPPED
[INFO] Apache Beam :: SDKs :: Java :: Microbenchmarks ..... SKIPPED
[INFO] Apache Beam :: SDKs :: Java :: Java 8 Tests ........ SKIPPED
[INFO] Apache Beam :: Runners :: Flink .................... SKIPPED
[INFO] Apache Beam :: Runners :: Flink :: Core ............ SKIPPED
[INFO] Apache Beam :: Runners :: Flink :: Examples ........ SKIPPED
[INFO] Apache Beam :: Runners :: Spark .................... SKIPPED
[INFO] Apache Beam :: SDKs :: Java :: Maven Archetypes .... SKIPPED
[INFO] Apache Beam :: SDKs :: Java :: Maven Archetypes :: Starter SKIPPED
[INFO] Apache Beam :: SDKs :: Java :: Maven Archetypes :: Examples SKIPPED
[INFO] Apache Beam :: Examples ............................ SKIPPED
[INFO] Apache Beam :: Examples :: Java .................... SKIPPED
[INFO] Apache Beam :: Examples :: Java 8 .................. SKIPPED
[INFO] ------------------------------------------------------------------------
[INFO] BUILD FAILURE
[INFO] ------------------------------------------------------------------------
[INFO] Total time: 01:29 min
[INFO] Finished at: 2016-11-01T01:58:02+00:00
[INFO] Final Memory: 75M/891M
[INFO] ------------------------------------------------------------------------
[ERROR] Failed to execute goal org.apache.maven.plugins:maven-checkstyle-plugin:2.17:check
(default) on project beam-sdks-java-core: You have 1 Checkstyle violation. -> [Help 1]
org.apache.maven.lifecycle.LifecycleExecutionException: Failed to execute goal org.apache.maven.plugins:maven-checkstyle-plugin:2.17:check
(default) on project beam-sdks-java-core: You have 1 Checkstyle violation.
	at org.apache.maven.lifecycle.internal.MojoExecutor.execute(MojoExecutor.java:212)
	at org.apache.maven.lifecycle.internal.MojoExecutor.execute(MojoExecutor.java:153)
	at org.apache.maven.lifecycle.internal.MojoExecutor.execute(MojoExecutor.java:145)
	at org.apache.maven.lifecycle.internal.LifecycleModuleBuilder.buildProject(LifecycleModuleBuilder.java:116)
	at org.apache.maven.lifecycle.internal.LifecycleModuleBuilder.buildProject(LifecycleModuleBuilder.java:80)
	at org.apache.maven.lifecycle.internal.builder.singlethreaded.SingleThreadedBuilder.build(SingleThreadedBuilder.java:51)
	at org.apache.maven.lifecycle.internal.LifecycleStarter.execute(LifecycleStarter.java:128)
	at org.apache.maven.DefaultMaven.doExecute(DefaultMaven.java:307)
	at org.apache.maven.DefaultMaven.doExecute(DefaultMaven.java:193)
	at org.apache.maven.DefaultMaven.execute(DefaultMaven.java:106)
	at org.jvnet.hudson.maven3.launcher.Maven32Launcher.main(Maven32Launcher.java:132)
	at sun.reflect.NativeMethodAccessorImpl.invoke0(Native Method)
	at sun.reflect.NativeMethodAccessorImpl.invoke(NativeMethodAccessorImpl.java:62)
	at sun.reflect.DelegatingMethodAccessorImpl.invoke(DelegatingMethodAccessorImpl.java:43)
	at java.lang.reflect.Method.invoke(Method.java:498)
	at org.codehaus.plexus.classworlds.launcher.Launcher.launchStandard(Launcher.java:330)
	at org.codehaus.plexus.classworlds.launcher.Launcher.launch(Launcher.java:238)
	at jenkins.maven3.agent.Maven32Main.launch(Maven32Main.java:186)
	at sun.reflect.NativeMethodAccessorImpl.invoke0(Native Method)
	at sun.reflect.NativeMethodAccessorImpl.invoke(NativeMethodAccessorImpl.java:62)
	at sun.reflect.DelegatingMethodAccessorImpl.invoke(DelegatingMethodAccessorImpl.java:43)
	at java.lang.reflect.Method.invoke(Method.java:498)
	at hudson.maven.Maven3Builder.call(Maven3Builder.java:136)
	at hudson.maven.Maven3Builder.call(Maven3Builder.java:71)
	at hudson.remoting.UserRequest.perform(UserRequest.java:153)
	at hudson.remoting.UserRequest.perform(UserRequest.java:50)
	at hudson.remoting.Request$2.run(Request.java:332)
	at hudson.remoting.InterceptingExecutorService$1.call(InterceptingExecutorService.java:68)
	at java.util.concurrent.FutureTask.run(FutureTask.java:266)
	at java.util.concurrent.ThreadPoolExecutor.runWorker(ThreadPoolExecutor.java:1142)
	at java.util.concurrent.ThreadPoolExecutor$Worker.run(ThreadPoolExecutor.java:617)
	at java.lang.Thread.run(Thread.java:745)
Caused by: org.apache.maven.plugin.MojoFailureException: You have 1 Checkstyle violation.
	at org.apache.maven.plugin.checkstyle.CheckstyleViolationCheckMojo.execute(CheckstyleViolationCheckMojo.java:588)
	at org.apache.maven.plugin.DefaultBuildPluginManager.executeMojo(DefaultBuildPluginManager.java:134)
	at org.apache.maven.lifecycle.internal.MojoExecutor.execute(MojoExecutor.java:208)
	... 31 more
[ERROR] 
[ERROR] Re-run Maven using the -X switch to enable full debug logging.
[ERROR] 
[ERROR] For more information about the errors and possible solutions, please read the following
articles:
[ERROR] [Help 1] http://cwiki.apache.org/confluence/display/MAVEN/MojoFailureException
[ERROR] 
[ERROR] After correcting the problems, you can resume the build with the command
[ERROR]   mvn <goals> -rf :beam-sdks-java-core
[JENKINS] Archiving <https://builds.apache.org/job/beam_PostCommit_MavenVerify/ws/sdks/java/io/pom.xml>
to org.apache.beam/beam-sdks-java-io-parent/0.4.0-incubating-SNAPSHOT/beam-sdks-java-io-parent-0.4.0-incubating-SNAPSHOT.pom
[JENKINS] Archiving <https://builds.apache.org/job/beam_PostCommit_MavenVerify/ws/sdks/java/microbenchmarks/pom.xml>
to org.apache.beam/beam-sdks-java-microbenchmarks/0.4.0-incubating-SNAPSHOT/beam-sdks-java-microbenchmarks-0.4.0-incubating-SNAPSHOT.pom
[JENKINS] Archiving <https://builds.apache.org/job/beam_PostCommit_MavenVerify/ws/runners/direct-java/pom.xml>
to org.apache.beam/beam-runners-direct-java/0.4.0-incubating-SNAPSHOT/beam-runners-direct-java-0.4.0-incubating-SNAPSHOT.pom
[JENKINS] Archiving <https://builds.apache.org/job/beam_PostCommit_MavenVerify/ws/sdks/java/maven-archetypes/starter/pom.xml>
to org.apache.beam/beam-sdks-java-maven-archetypes-starter/0.4.0-incubating-SNAPSHOT/beam-sdks-java-maven-archetypes-starter-0.4.0-incubating-SNAPSHOT.pom
[JENKINS] Archiving <https://builds.apache.org/job/beam_PostCommit_MavenVerify/ws/examples/java/pom.xml>
to org.apache.beam/beam-examples-java/0.4.0-incubating-SNAPSHOT/beam-examples-java-0.4.0-incubating-SNAPSHOT.pom
[JENKINS] Archiving <https://builds.apache.org/job/beam_PostCommit_MavenVerify/ws/sdks/java/build-tools/pom.xml>
to org.apache.beam/beam-sdks-java-build-tools/0.4.0-incubating-SNAPSHOT/beam-sdks-java-build-tools-0.4.0-incubating-SNAPSHOT.pom
[JENKINS] Archiving <https://builds.apache.org/job/beam_PostCommit_MavenVerify/ws/sdks/java/build-tools/target/beam-sdks-java-build-tools-0.4.0-incubating-SNAPSHOT.jar>
to org.apache.beam/beam-sdks-java-build-tools/0.4.0-incubating-SNAPSHOT/beam-sdks-java-build-tools-0.4.0-incubating-SNAPSHOT.jar
[JENKINS] Archiving <https://builds.apache.org/job/beam_PostCommit_MavenVerify/ws/sdks/java/build-tools/target/beam-sdks-java-build-tools-0.4.0-incubating-SNAPSHOT-tests.jar>
to org.apache.beam/beam-sdks-java-build-tools/0.4.0-incubating-SNAPSHOT/beam-sdks-java-build-tools-0.4.0-incubating-SNAPSHOT-tests.jar
[JENKINS] Archiving <https://builds.apache.org/job/beam_PostCommit_MavenVerify/ws/sdks/java/core/pom.xml>
to org.apache.beam/beam-sdks-java-core/0.4.0-incubating-SNAPSHOT/beam-sdks-java-core-0.4.0-incubating-SNAPSHOT.pom
[JENKINS] Archiving <https://builds.apache.org/job/beam_PostCommit_MavenVerify/ws/runners/flink/examples/pom.xml>
to org.apache.beam/beam-runners-flink_2.10-examples/0.4.0-incubating-SNAPSHOT/beam-runners-flink_2.10-examples-0.4.0-incubating-SNAPSHOT.pom
[JENKINS] Archiving <https://builds.apache.org/job/beam_PostCommit_MavenVerify/ws/runners/core-java/pom.xml>
to org.apache.beam/beam-runners-core-java/0.4.0-incubating-SNAPSHOT/beam-runners-core-java-0.4.0-incubating-SNAPSHOT.pom
[JENKINS] Archiving <https://builds.apache.org/job/beam_PostCommit_MavenVerify/ws/sdks/java/io/kinesis/pom.xml>
to org.apache.beam/beam-sdks-java-io-kinesis/0.4.0-incubating-SNAPSHOT/beam-sdks-java-io-kinesis-0.4.0-incubating-SNAPSHOT.pom
[JENKINS] Archiving <https://builds.apache.org/job/beam_PostCommit_MavenVerify/ws/sdks/java/io/kafka/pom.xml>
to org.apache.beam/beam-sdks-java-io-kafka/0.4.0-incubating-SNAPSHOT/beam-sdks-java-io-kafka-0.4.0-incubating-SNAPSHOT.pom
[JENKINS] Archiving <https://builds.apache.org/job/beam_PostCommit_MavenVerify/ws/runners/flink/runner/pom.xml>
to org.apache.beam/beam-runners-flink_2.10/0.4.0-incubating-SNAPSHOT/beam-runners-flink_2.10-0.4.0-incubating-SNAPSHOT.pom
[JENKINS] Archiving <https://builds.apache.org/job/beam_PostCommit_MavenVerify/ws/sdks/java/io/google-cloud-platform/pom.xml>
to org.apache.beam/beam-sdks-java-io-google-cloud-platform/0.4.0-incubating-SNAPSHOT/beam-sdks-java-io-google-cloud-platform-0.4.0-incubating-SNAPSHOT.pom
[JENKINS] Archiving <https://builds.apache.org/job/beam_PostCommit_MavenVerify/ws/sdks/java/pom.xml>
to org.apache.beam/beam-sdks-java-parent/0.4.0-incubating-SNAPSHOT/beam-sdks-java-parent-0.4.0-incubating-SNAPSHOT.pom
[JENKINS] Archiving <https://builds.apache.org/job/beam_PostCommit_MavenVerify/ws/pom.xml>
to org.apache.beam/beam-parent/0.4.0-incubating-SNAPSHOT/beam-parent-0.4.0-incubating-SNAPSHOT.pom
Compressed 41.08 KB of artifacts by 77.9% relative to #1685
[JENKINS] Archiving <https://builds.apache.org/job/beam_PostCommit_MavenVerify/ws/sdks/java/maven-archetypes/examples/pom.xml>
to org.apache.beam/beam-sdks-java-maven-archetypes-examples/0.4.0-incubating-SNAPSHOT/beam-sdks-java-maven-archetypes-examples-0.4.0-incubating-SNAPSHOT.pom
[JENKINS] Archiving <https://builds.apache.org/job/beam_PostCommit_MavenVerify/ws/runners/spark/pom.xml>
to org.apache.beam/beam-runners-spark/0.4.0-incubating-SNAPSHOT/beam-runners-spark-0.4.0-incubating-SNAPSHOT.pom
[JENKINS] Archiving <https://builds.apache.org/job/beam_PostCommit_MavenVerify/ws/sdks/java/io/hdfs/pom.xml>
to org.apache.beam/beam-sdks-java-io-hdfs/0.4.0-incubating-SNAPSHOT/beam-sdks-java-io-hdfs-0.4.0-incubating-SNAPSHOT.pom
[JENKINS] Archiving <https://builds.apache.org/job/beam_PostCommit_MavenVerify/ws/runners/google-cloud-dataflow-java/pom.xml>
to org.apache.beam/beam-runners-google-cloud-dataflow-java/0.4.0-incubating-SNAPSHOT/beam-runners-google-cloud-dataflow-java-0.4.0-incubating-SNAPSHOT.pom
[JENKINS] Archiving <https://builds.apache.org/job/beam_PostCommit_MavenVerify/ws/sdks/java/maven-archetypes/pom.xml>
to org.apache.beam/beam-sdks-java-maven-archetypes-parent/0.4.0-incubating-SNAPSHOT/beam-sdks-java-maven-archetypes-parent-0.4.0-incubating-SNAPSHOT.pom
[JENKINS] Archiving <https://builds.apache.org/job/beam_PostCommit_MavenVerify/ws/sdks/java/io/jms/pom.xml>
to org.apache.beam/beam-sdks-java-io-jms/0.4.0-incubating-SNAPSHOT/beam-sdks-java-io-jms-0.4.0-incubating-SNAPSHOT.pom
[JENKINS] Archiving <https://builds.apache.org/job/beam_PostCommit_MavenVerify/ws/runners/flink/pom.xml>
to org.apache.beam/beam-runners-flink-parent/0.4.0-incubating-SNAPSHOT/beam-runners-flink-parent-0.4.0-incubating-SNAPSHOT.pom
[JENKINS] Archiving <https://builds.apache.org/job/beam_PostCommit_MavenVerify/ws/sdks/java/io/mongodb/pom.xml>
to org.apache.beam/beam-sdks-java-io-mongodb/0.4.0-incubating-SNAPSHOT/beam-sdks-java-io-mongodb-0.4.0-incubating-SNAPSHOT.pom
[JENKINS] Archiving <https://builds.apache.org/job/beam_PostCommit_MavenVerify/ws/sdks/pom.xml>
to org.apache.beam/beam-sdks-parent/0.4.0-incubating-SNAPSHOT/beam-sdks-parent-0.4.0-incubating-SNAPSHOT.pom
[JENKINS] Archiving <https://builds.apache.org/job/beam_PostCommit_MavenVerify/ws/sdks/java/extensions/join-library/pom.xml>
to org.apache.beam/beam-sdks-java-extensions-join-library/0.4.0-incubating-SNAPSHOT/beam-sdks-java-extensions-join-library-0.4.0-incubating-SNAPSHOT.pom
[JENKINS] Archiving <https://builds.apache.org/job/beam_PostCommit_MavenVerify/ws/runners/pom.xml>
to org.apache.beam/beam-runners-parent/0.4.0-incubating-SNAPSHOT/beam-runners-parent-0.4.0-incubating-SNAPSHOT.pom
[JENKINS] Archiving <https://builds.apache.org/job/beam_PostCommit_MavenVerify/ws/sdks/java/io/jdbc/pom.xml>
to org.apache.beam/beam-sdks-java-io-jdbc/0.4.0-incubating-SNAPSHOT/beam-sdks-java-io-jdbc-0.4.0-incubating-SNAPSHOT.pom
[JENKINS] Archiving <https://builds.apache.org/job/beam_PostCommit_MavenVerify/ws/sdks/java/extensions/pom.xml>
to org.apache.beam/beam-sdks-java-extensions-parent/0.4.0-incubating-SNAPSHOT/beam-sdks-java-extensions-parent-0.4.0-incubating-SNAPSHOT.pom
[JENKINS] Archiving <https://builds.apache.org/job/beam_PostCommit_MavenVerify/ws/examples/pom.xml>
to org.apache.beam/beam-examples-parent/0.4.0-incubating-SNAPSHOT/beam-examples-parent-0.4.0-incubating-SNAPSHOT.pom
Sending e-mails to: commits@beam.incubator.apache.org
channel stopped

Mime
View raw message