beam-commits mailing list archives

Site index · List index
Message view « Date » · « Thread »
Top « Date » · « Thread »
From Apache Jenkins Server <jenk...@builds.apache.org>
Subject Build failed in Jenkins: beam_PostCommit_MavenVerify #1828
Date Tue, 15 Nov 2016 21:45:35 GMT
See <https://builds.apache.org/job/beam_PostCommit_MavenVerify/1828/changes>

Changes:

[klk] Rename DoFn.ExtraContextFactory to DoFn.ArgumentProvider

------------------------------------------
[EnvInject] - Mask passwords passed as build parameters.
Started by an SCM change
[EnvInject] - Loading node environment variables.
Building remotely on beam1 (beam) in workspace <https://builds.apache.org/job/beam_PostCommit_MavenVerify/ws/>
 > git rev-parse --is-inside-work-tree # timeout=10
Fetching changes from the remote Git repository
 > git config remote.origin.url https://github.com/apache/incubator-beam.git # timeout=10
Fetching upstream changes from https://github.com/apache/incubator-beam.git
 > git --version # timeout=10
 > git -c core.askpass=true fetch --tags --progress https://github.com/apache/incubator-beam.git
+refs/heads/*:refs/remotes/origin/*
 > git rev-parse refs/remotes/origin/master^{commit} # timeout=10
 > git rev-parse refs/remotes/origin/origin/master^{commit} # timeout=10
Checking out Revision 20111022256e641ad288c28d6953c15314eb6a0d (refs/remotes/origin/master)
 > git config core.sparsecheckout # timeout=10
 > git checkout -f 20111022256e641ad288c28d6953c15314eb6a0d
 > git rev-list 503f26f448ea9f46fcfcdd46e60cba80e4844e28 # timeout=10
[EnvInject] - Executing scripts and injecting environment variables after the SCM step.
[EnvInject] - Injecting as environment variables the properties content 
SPARK_LOCAL_IP=127.0.0.1

[EnvInject] - Variables injected successfully.
Parsing POMs
Modules changed, recalculating dependency graph
Established TCP socket on 47315
maven32-agent.jar already up to date
maven32-interceptor.jar already up to date
maven3-interceptor-commons.jar already up to date
[beam_PostCommit_MavenVerify] $ /home/jenkins/tools/java/latest1.8/bin/java -Xmx2g -Xms256m
-XX:MaxPermSize=512m -cp /home/jenkins/jenkins-slave/maven32-agent.jar:/home/jenkins/tools/maven/apache-maven-3.3.3/boot/plexus-classworlds-2.5.2.jar:/home/jenkins/tools/maven/apache-maven-3.3.3/conf/logging
jenkins.maven3.agent.Maven32Main /home/jenkins/tools/maven/apache-maven-3.3.3 /home/jenkins/jenkins-slave/slave.jar
/home/jenkins/jenkins-slave/maven32-interceptor.jar /home/jenkins/jenkins-slave/maven3-interceptor-commons.jar
47315
Java HotSpot(TM) 64-Bit Server VM warning: ignoring option MaxPermSize=512m; support was removed
in 8.0
<===[JENKINS REMOTING CAPACITY]===>   channel started
Executing Maven:  -B -f <https://builds.apache.org/job/beam_PostCommit_MavenVerify/ws/pom.xml>
-Dmaven.repo.local=<https://builds.apache.org/job/beam_PostCommit_MavenVerify/ws/.repository>
-B -e -P release,dataflow-runner -DrepoToken=**** clean install coveralls:report -DskipITs=false
-DintegrationTestPipelineOptions=[ "--project=apache-beam-testing", "--tempRoot=gs://temp-storage-for-end-to-end-tests",
"--runner=org.apache.beam.runners.dataflow.testing.TestDataflowRunner" ]
[INFO] Error stacktraces are turned on.
[INFO] Scanning for projects...
[INFO] ------------------------------------------------------------------------
[INFO] Reactor Build Order:
[INFO] 
[INFO] Apache Beam :: Parent
[INFO] Apache Beam :: SDKs :: Java :: Build Tools
[INFO] Apache Beam :: SDKs
[INFO] Apache Beam :: SDKs :: Java
[INFO] Apache Beam :: SDKs :: Java :: Core
[INFO] Apache Beam :: Runners
[INFO] Apache Beam :: Runners :: Core Java
[INFO] Apache Beam :: Runners :: Direct Java
[INFO] Apache Beam :: Runners :: Google Cloud Dataflow
[INFO] Apache Beam :: SDKs :: Java :: IO
[INFO] Apache Beam :: SDKs :: Java :: IO :: Google Cloud Platform
[INFO] Apache Beam :: SDKs :: Java :: IO :: HDFS
[INFO] Apache Beam :: SDKs :: Java :: IO :: JMS
[INFO] Apache Beam :: SDKs :: Java :: IO :: Kafka
[INFO] Apache Beam :: SDKs :: Java :: IO :: Kinesis
[INFO] Apache Beam :: SDKs :: Java :: IO :: MongoDB
[INFO] Apache Beam :: SDKs :: Java :: IO :: JDBC
[INFO] Apache Beam :: SDKs :: Java :: Maven Archetypes
[INFO] Apache Beam :: SDKs :: Java :: Maven Archetypes :: Starter
[INFO] Apache Beam :: SDKs :: Java :: Maven Archetypes :: Examples
[INFO] Apache Beam :: SDKs :: Java :: Extensions
[INFO] Apache Beam :: SDKs :: Java :: Extensions :: Join library
[INFO] Apache Beam :: SDKs :: Java :: Extensions :: Sorter
[INFO] Apache Beam :: SDKs :: Java :: Microbenchmarks
[INFO] Apache Beam :: SDKs :: Java :: Java 8 Tests
[INFO] Apache Beam :: Runners :: Flink
[INFO] Apache Beam :: Runners :: Flink :: Core
[INFO] Apache Beam :: Runners :: Flink :: Examples
[INFO] Apache Beam :: Runners :: Spark
[INFO] Apache Beam :: Runners :: Apex
[INFO] Apache Beam :: Examples
[INFO] Apache Beam :: Examples :: Java
[INFO] Apache Beam :: Examples :: Java 8
[WARNING] The POM for org.eclipse.m2e:lifecycle-mapping:jar:1.0.0 is missing, no dependency
information available
[WARNING] Failed to retrieve plugin descriptor for org.eclipse.m2e:lifecycle-mapping:1.0.0:
Plugin org.eclipse.m2e:lifecycle-mapping:1.0.0 or one of its dependencies could not be resolved:
Failure to find org.eclipse.m2e:lifecycle-mapping:jar:1.0.0 in https://repo.maven.apache.org/maven2
was cached in the local repository, resolution will not be reattempted until the update interval
of central has elapsed or updates are forced
[INFO]                                                                         
[INFO] ------------------------------------------------------------------------
[INFO] Building Apache Beam :: Parent 0.4.0-incubating-SNAPSHOT
[INFO] ------------------------------------------------------------------------
[INFO] 
[INFO] --- maven-clean-plugin:3.0.0:clean (default-clean) @ beam-parent ---
[INFO] Deleting <https://builds.apache.org/job/beam_PostCommit_MavenVerify/ws/target>
[INFO] 
[INFO] --- maven-enforcer-plugin:1.3.1:enforce (enforce) @ beam-parent ---
[INFO] 
[INFO] --- maven-remote-resources-plugin:1.5:process (process-resource-bundles) @ beam-parent
---
[INFO] 
[INFO] --- maven-site-plugin:3.5.1:attach-descriptor (attach-descriptor) @ beam-parent ---
[INFO] 
[INFO] --- maven-javadoc-plugin:2.10.3:jar (javadoc) @ beam-parent ---
[INFO] Not executing Javadoc as the project is not a Java classpath-capable package
[INFO] 
[INFO] --- maven-source-plugin:2.4:jar-no-fork (attach-sources) @ beam-parent ---
[INFO] 
[INFO] --- maven-source-plugin:2.4:test-jar-no-fork (attach-test-sources) @ beam-parent ---
[INFO] 
[INFO] --- maven-dependency-plugin:2.10:analyze-only (default) @ beam-parent ---
[INFO] Skipping pom project
[INFO] 
[INFO] --- apache-rat-plugin:0.12:check (default) @ beam-parent ---
[INFO] Enabled default license matchers.
[INFO] Will parse SCM ignores for exclusions...
[INFO] Parsing exclusions from <https://builds.apache.org/job/beam_PostCommit_MavenVerify/ws/.gitignore>
[INFO] Finished adding exclusions from SCM ignore files.
[INFO] 74 implicit excludes (use -debug for more details).
[INFO] Exclude: **/target/**/*
[INFO] Exclude: **/dependency-reduced-pom.xml
[INFO] Exclude: **/hs_err_pid*.log
[INFO] Exclude: .github/**/*
[INFO] Exclude: **/*.iml
[INFO] Exclude: **/.idea/**/*
[INFO] Exclude: **/package-list
[INFO] Exclude: **/user.avsc
[INFO] Exclude: **/test/resources/**/*.txt
[INFO] Exclude: **/test/**/.placeholder
[INFO] Exclude: .repository/**/*
[INFO] Exclude: **/.checkstyle
[INFO] Exclude: **/.classpath
[INFO] Exclude: **/.factorypath
[INFO] Exclude: **/.project
[INFO] Exclude: **/.settings/**/*
[INFO] 1393 resources included (use -debug for more details)
[INFO] Rat check: Summary over all files. Unapproved: 1, unknown: 1, generated: 0, approved:
1388 licenses.
[INFO]                                                                         
[INFO] ------------------------------------------------------------------------
[INFO] Skipping Apache Beam :: Parent
[INFO] This project has been banned from the build due to previous failures.
[INFO] ------------------------------------------------------------------------
[INFO] ------------------------------------------------------------------------
[INFO] Reactor Summary:
[INFO] 
[INFO] Apache Beam :: Parent .............................. FAILURE [ 32.057 s]
[INFO] Apache Beam :: SDKs :: Java :: Build Tools ......... SKIPPED
[INFO] Apache Beam :: SDKs ................................ SKIPPED
[INFO] Apache Beam :: SDKs :: Java ........................ SKIPPED
[INFO] Apache Beam :: SDKs :: Java :: Core ................ SKIPPED
[INFO] Apache Beam :: Runners ............................. SKIPPED
[INFO] Apache Beam :: Runners :: Core Java ................ SKIPPED
[INFO] Apache Beam :: Runners :: Direct Java .............. SKIPPED
[INFO] Apache Beam :: Runners :: Google Cloud Dataflow .... SKIPPED
[INFO] Apache Beam :: SDKs :: Java :: IO .................. SKIPPED
[INFO] Apache Beam :: SDKs :: Java :: IO :: Google Cloud Platform SKIPPED
[INFO] Apache Beam :: SDKs :: Java :: IO :: HDFS .......... SKIPPED
[INFO] Apache Beam :: SDKs :: Java :: IO :: JMS ........... SKIPPED
[INFO] Apache Beam :: SDKs :: Java :: IO :: Kafka ......... SKIPPED
[INFO] Apache Beam :: SDKs :: Java :: IO :: Kinesis ....... SKIPPED
[INFO] Apache Beam :: SDKs :: Java :: IO :: MongoDB ....... SKIPPED
[INFO] Apache Beam :: SDKs :: Java :: IO :: JDBC .......... SKIPPED
[INFO] Apache Beam :: SDKs :: Java :: Maven Archetypes .... SKIPPED
[INFO] Apache Beam :: SDKs :: Java :: Maven Archetypes :: Starter SKIPPED
[INFO] Apache Beam :: SDKs :: Java :: Maven Archetypes :: Examples SKIPPED
[INFO] Apache Beam :: SDKs :: Java :: Extensions .......... SKIPPED
[INFO] Apache Beam :: SDKs :: Java :: Extensions :: Join library SKIPPED
[INFO] Apache Beam :: SDKs :: Java :: Extensions :: Sorter  SKIPPED
[INFO] Apache Beam :: SDKs :: Java :: Microbenchmarks ..... SKIPPED
[INFO] Apache Beam :: SDKs :: Java :: Java 8 Tests ........ SKIPPED
[INFO] Apache Beam :: Runners :: Flink .................... SKIPPED
[INFO] Apache Beam :: Runners :: Flink :: Core ............ SKIPPED
[INFO] Apache Beam :: Runners :: Flink :: Examples ........ SKIPPED
[INFO] Apache Beam :: Runners :: Spark .................... SKIPPED
[INFO] Apache Beam :: Runners :: Apex ..................... SKIPPED
[INFO] Apache Beam :: Examples ............................ SKIPPED
[INFO] Apache Beam :: Examples :: Java .................... SKIPPED
[INFO] Apache Beam :: Examples :: Java 8 .................. SKIPPED
[INFO] ------------------------------------------------------------------------
[INFO] BUILD FAILURE
[INFO] ------------------------------------------------------------------------
[INFO] Total time: 01:07 min
[INFO] Finished at: 2016-11-15T21:42:35+00:00
[INFO] Final Memory: 45M/620M
[INFO] ------------------------------------------------------------------------
Waiting for Jenkins to finish collecting data
[ERROR] Failed to execute goal org.apache.rat:apache-rat-plugin:0.12:check (default) on project
beam-parent: Too many files with unapproved license: 1 See RAT report in: <https://builds.apache.org/job/beam_PostCommit_MavenVerify/ws/target/beam-parent-0.4.0-incubating-SNAPSHOT.rat>
-> [Help 1]
org.apache.maven.lifecycle.LifecycleExecutionException: Failed to execute goal org.apache.rat:apache-rat-plugin:0.12:check
(default) on project beam-parent: Too many files with unapproved license: 1 See RAT report
in: <https://builds.apache.org/job/beam_PostCommit_MavenVerify/ws/target/beam-parent-0.4.0-incubating-SNAPSHOT.rat>
	at org.apache.maven.lifecycle.internal.MojoExecutor.execute(MojoExecutor.java:212)
	at org.apache.maven.lifecycle.internal.MojoExecutor.execute(MojoExecutor.java:153)
	at org.apache.maven.lifecycle.internal.MojoExecutor.execute(MojoExecutor.java:145)
	at org.apache.maven.lifecycle.internal.LifecycleModuleBuilder.buildProject(LifecycleModuleBuilder.java:116)
	at org.apache.maven.lifecycle.internal.LifecycleModuleBuilder.buildProject(LifecycleModuleBuilder.java:80)
	at org.apache.maven.lifecycle.internal.builder.singlethreaded.SingleThreadedBuilder.build(SingleThreadedBuilder.java:51)
	at org.apache.maven.lifecycle.internal.LifecycleStarter.execute(LifecycleStarter.java:128)
	at org.apache.maven.DefaultMaven.doExecute(DefaultMaven.java:307)
	at org.apache.maven.DefaultMaven.doExecute(DefaultMaven.java:193)
	at org.apache.maven.DefaultMaven.execute(DefaultMaven.java:106)
	at org.jvnet.hudson.maven3.launcher.Maven32Launcher.main(Maven32Launcher.java:132)
	at sun.reflect.NativeMethodAccessorImpl.invoke0(Native Method)
	at sun.reflect.NativeMethodAccessorImpl.invoke(NativeMethodAccessorImpl.java:62)
	at sun.reflect.DelegatingMethodAccessorImpl.invoke(DelegatingMethodAccessorImpl.java:43)
	at java.lang.reflect.Method.invoke(Method.java:498)
	at org.codehaus.plexus.classworlds.launcher.Launcher.launchStandard(Launcher.java:330)
	at org.codehaus.plexus.classworlds.launcher.Launcher.launch(Launcher.java:238)
	at jenkins.maven3.agent.Maven32Main.launch(Maven32Main.java:186)
	at sun.reflect.NativeMethodAccessorImpl.invoke0(Native Method)
	at sun.reflect.NativeMethodAccessorImpl.invoke(NativeMethodAccessorImpl.java:62)
	at sun.reflect.DelegatingMethodAccessorImpl.invoke(DelegatingMethodAccessorImpl.java:43)
	at java.lang.reflect.Method.invoke(Method.java:498)
	at hudson.maven.Maven3Builder.call(Maven3Builder.java:136)
	at hudson.maven.Maven3Builder.call(Maven3Builder.java:71)
	at hudson.remoting.UserRequest.perform(UserRequest.java:153)
	at hudson.remoting.UserRequest.perform(UserRequest.java:50)
	at hudson.remoting.Request$2.run(Request.java:332)
	at hudson.remoting.InterceptingExecutorService$1.call(InterceptingExecutorService.java:68)
	at java.util.concurrent.FutureTask.run(FutureTask.java:266)
	at java.util.concurrent.ThreadPoolExecutor.runWorker(ThreadPoolExecutor.java:1142)
	at java.util.concurrent.ThreadPoolExecutor$Worker.run(ThreadPoolExecutor.java:617)
	at java.lang.Thread.run(Thread.java:745)
Caused by: org.apache.rat.mp.RatCheckException: Too many files with unapproved license: 1
See RAT report in: <https://builds.apache.org/job/beam_PostCommit_MavenVerify/ws/target/beam-parent-0.4.0-incubating-SNAPSHOT.rat>
	at org.apache.rat.mp.RatCheckMojo.check(RatCheckMojo.java:183)
	at org.apache.rat.mp.RatCheckMojo.execute(RatCheckMojo.java:156)
	at org.apache.maven.plugin.DefaultBuildPluginManager.executeMojo(DefaultBuildPluginManager.java:134)
	at org.apache.maven.lifecycle.internal.MojoExecutor.execute(MojoExecutor.java:208)
	... 31 more
[ERROR] 
[ERROR] Re-run Maven using the -X switch to enable full debug logging.
[ERROR] 
[ERROR] For more information about the errors and possible solutions, please read the following
articles:
[ERROR] [Help 1] http://cwiki.apache.org/confluence/display/MAVEN/MojoFailureException
[JENKINS] Archiving <https://builds.apache.org/job/beam_PostCommit_MavenVerify/ws/sdks/java/io/pom.xml>
to org.apache.beam/beam-sdks-java-io-parent/0.4.0-incubating-SNAPSHOT/beam-sdks-java-io-parent-0.4.0-incubating-SNAPSHOT.pom
[JENKINS] Archiving <https://builds.apache.org/job/beam_PostCommit_MavenVerify/ws/sdks/java/maven-archetypes/starter/pom.xml>
to org.apache.beam/beam-sdks-java-maven-archetypes-starter/0.4.0-incubating-SNAPSHOT/beam-sdks-java-maven-archetypes-starter-0.4.0-incubating-SNAPSHOT.pom
[JENKINS] Archiving <https://builds.apache.org/job/beam_PostCommit_MavenVerify/ws/sdks/java/microbenchmarks/pom.xml>
to org.apache.beam/beam-sdks-java-microbenchmarks/0.4.0-incubating-SNAPSHOT/beam-sdks-java-microbenchmarks-0.4.0-incubating-SNAPSHOT.pom
[JENKINS] Archiving <https://builds.apache.org/job/beam_PostCommit_MavenVerify/ws/runners/direct-java/pom.xml>
to org.apache.beam/beam-runners-direct-java/0.4.0-incubating-SNAPSHOT/beam-runners-direct-java-0.4.0-incubating-SNAPSHOT.pom
[JENKINS] Archiving <https://builds.apache.org/job/beam_PostCommit_MavenVerify/ws/examples/java/pom.xml>
to org.apache.beam/beam-examples-java/0.4.0-incubating-SNAPSHOT/beam-examples-java-0.4.0-incubating-SNAPSHOT.pom
[JENKINS] Archiving <https://builds.apache.org/job/beam_PostCommit_MavenVerify/ws/sdks/java/build-tools/pom.xml>
to org.apache.beam/beam-sdks-java-build-tools/0.4.0-incubating-SNAPSHOT/beam-sdks-java-build-tools-0.4.0-incubating-SNAPSHOT.pom
[JENKINS] Archiving <https://builds.apache.org/job/beam_PostCommit_MavenVerify/ws/sdks/java/core/pom.xml>
to org.apache.beam/beam-sdks-java-core/0.4.0-incubating-SNAPSHOT/beam-sdks-java-core-0.4.0-incubating-SNAPSHOT.pom
[JENKINS] Archiving <https://builds.apache.org/job/beam_PostCommit_MavenVerify/ws/runners/flink/examples/pom.xml>
to org.apache.beam/beam-runners-flink_2.10-examples/0.4.0-incubating-SNAPSHOT/beam-runners-flink_2.10-examples-0.4.0-incubating-SNAPSHOT.pom
[JENKINS] Archiving <https://builds.apache.org/job/beam_PostCommit_MavenVerify/ws/runners/core-java/pom.xml>
to org.apache.beam/beam-runners-core-java/0.4.0-incubating-SNAPSHOT/beam-runners-core-java-0.4.0-incubating-SNAPSHOT.pom
[JENKINS] Archiving <https://builds.apache.org/job/beam_PostCommit_MavenVerify/ws/sdks/java/io/kinesis/pom.xml>
to org.apache.beam/beam-sdks-java-io-kinesis/0.4.0-incubating-SNAPSHOT/beam-sdks-java-io-kinesis-0.4.0-incubating-SNAPSHOT.pom
[JENKINS] Archiving <https://builds.apache.org/job/beam_PostCommit_MavenVerify/ws/sdks/java/io/kafka/pom.xml>
to org.apache.beam/beam-sdks-java-io-kafka/0.4.0-incubating-SNAPSHOT/beam-sdks-java-io-kafka-0.4.0-incubating-SNAPSHOT.pom
[JENKINS] Archiving <https://builds.apache.org/job/beam_PostCommit_MavenVerify/ws/runners/flink/runner/pom.xml>
to org.apache.beam/beam-runners-flink_2.10/0.4.0-incubating-SNAPSHOT/beam-runners-flink_2.10-0.4.0-incubating-SNAPSHOT.pom
[JENKINS] Archiving <https://builds.apache.org/job/beam_PostCommit_MavenVerify/ws/sdks/java/io/google-cloud-platform/pom.xml>
to org.apache.beam/beam-sdks-java-io-google-cloud-platform/0.4.0-incubating-SNAPSHOT/beam-sdks-java-io-google-cloud-platform-0.4.0-incubating-SNAPSHOT.pom
[JENKINS] Archiving <https://builds.apache.org/job/beam_PostCommit_MavenVerify/ws/sdks/java/pom.xml>
to org.apache.beam/beam-sdks-java-parent/0.4.0-incubating-SNAPSHOT/beam-sdks-java-parent-0.4.0-incubating-SNAPSHOT.pom
[JENKINS] Archiving <https://builds.apache.org/job/beam_PostCommit_MavenVerify/ws/pom.xml>
to org.apache.beam/beam-parent/0.4.0-incubating-SNAPSHOT/beam-parent-0.4.0-incubating-SNAPSHOT.pom
Compressed 43.56 KB of artifacts by 73.5% relative to #1826
[JENKINS] Archiving <https://builds.apache.org/job/beam_PostCommit_MavenVerify/ws/sdks/java/maven-archetypes/examples/pom.xml>
to org.apache.beam/beam-sdks-java-maven-archetypes-examples/0.4.0-incubating-SNAPSHOT/beam-sdks-java-maven-archetypes-examples-0.4.0-incubating-SNAPSHOT.pom
[JENKINS] Archiving <https://builds.apache.org/job/beam_PostCommit_MavenVerify/ws/runners/spark/pom.xml>
to org.apache.beam/beam-runners-spark/0.4.0-incubating-SNAPSHOT/beam-runners-spark-0.4.0-incubating-SNAPSHOT.pom
[JENKINS] Archiving <https://builds.apache.org/job/beam_PostCommit_MavenVerify/ws/sdks/java/io/hdfs/pom.xml>
to org.apache.beam/beam-sdks-java-io-hdfs/0.4.0-incubating-SNAPSHOT/beam-sdks-java-io-hdfs-0.4.0-incubating-SNAPSHOT.pom
[JENKINS] Archiving <https://builds.apache.org/job/beam_PostCommit_MavenVerify/ws/sdks/java/maven-archetypes/pom.xml>
to org.apache.beam/beam-sdks-java-maven-archetypes-parent/0.4.0-incubating-SNAPSHOT/beam-sdks-java-maven-archetypes-parent-0.4.0-incubating-SNAPSHOT.pom
[JENKINS] Archiving <https://builds.apache.org/job/beam_PostCommit_MavenVerify/ws/runners/google-cloud-dataflow-java/pom.xml>
to org.apache.beam/beam-runners-google-cloud-dataflow-java/0.4.0-incubating-SNAPSHOT/beam-runners-google-cloud-dataflow-java-0.4.0-incubating-SNAPSHOT.pom
[JENKINS] Archiving <https://builds.apache.org/job/beam_PostCommit_MavenVerify/ws/runners/apex/pom.xml>
to org.apache.beam/beam-runners-apex/0.4.0-incubating-SNAPSHOT/beam-runners-apex-0.4.0-incubating-SNAPSHOT.pom
[JENKINS] Archiving <https://builds.apache.org/job/beam_PostCommit_MavenVerify/ws/sdks/java/io/jms/pom.xml>
to org.apache.beam/beam-sdks-java-io-jms/0.4.0-incubating-SNAPSHOT/beam-sdks-java-io-jms-0.4.0-incubating-SNAPSHOT.pom
[JENKINS] Archiving <https://builds.apache.org/job/beam_PostCommit_MavenVerify/ws/runners/flink/pom.xml>
to org.apache.beam/beam-runners-flink-parent/0.4.0-incubating-SNAPSHOT/beam-runners-flink-parent-0.4.0-incubating-SNAPSHOT.pom
[JENKINS] Archiving <https://builds.apache.org/job/beam_PostCommit_MavenVerify/ws/sdks/java/io/mongodb/pom.xml>
to org.apache.beam/beam-sdks-java-io-mongodb/0.4.0-incubating-SNAPSHOT/beam-sdks-java-io-mongodb-0.4.0-incubating-SNAPSHOT.pom
[JENKINS] Archiving <https://builds.apache.org/job/beam_PostCommit_MavenVerify/ws/sdks/java/extensions/sorter/pom.xml>
to org.apache.beam/beam-sdks-java-extensions-sorter/0.4.0-incubating-SNAPSHOT/beam-sdks-java-extensions-sorter-0.4.0-incubating-SNAPSHOT.pom
[JENKINS] Archiving <https://builds.apache.org/job/beam_PostCommit_MavenVerify/ws/sdks/pom.xml>
to org.apache.beam/beam-sdks-parent/0.4.0-incubating-SNAPSHOT/beam-sdks-parent-0.4.0-incubating-SNAPSHOT.pom
[JENKINS] Archiving <https://builds.apache.org/job/beam_PostCommit_MavenVerify/ws/sdks/java/extensions/join-library/pom.xml>
to org.apache.beam/beam-sdks-java-extensions-join-library/0.4.0-incubating-SNAPSHOT/beam-sdks-java-extensions-join-library-0.4.0-incubating-SNAPSHOT.pom
[JENKINS] Archiving <https://builds.apache.org/job/beam_PostCommit_MavenVerify/ws/runners/pom.xml>
to org.apache.beam/beam-runners-parent/0.4.0-incubating-SNAPSHOT/beam-runners-parent-0.4.0-incubating-SNAPSHOT.pom
[JENKINS] Archiving <https://builds.apache.org/job/beam_PostCommit_MavenVerify/ws/sdks/java/io/jdbc/pom.xml>
to org.apache.beam/beam-sdks-java-io-jdbc/0.4.0-incubating-SNAPSHOT/beam-sdks-java-io-jdbc-0.4.0-incubating-SNAPSHOT.pom
[JENKINS] Archiving <https://builds.apache.org/job/beam_PostCommit_MavenVerify/ws/sdks/java/extensions/pom.xml>
to org.apache.beam/beam-sdks-java-extensions-parent/0.4.0-incubating-SNAPSHOT/beam-sdks-java-extensions-parent-0.4.0-incubating-SNAPSHOT.pom
[JENKINS] Archiving <https://builds.apache.org/job/beam_PostCommit_MavenVerify/ws/examples/pom.xml>
to org.apache.beam/beam-examples-parent/0.4.0-incubating-SNAPSHOT/beam-examples-parent-0.4.0-incubating-SNAPSHOT.pom
channel stopped

Mime
View raw message