beam-commits mailing list archives

Site index · List index
Message view « Date » · « Thread »
Top « Date » · « Thread »
From Apache Jenkins Server <jenk...@builds.apache.org>
Subject Build failed in Jenkins: beam_PostCommit_RunnableOnService_SparkLocal #33
Date Wed, 02 Nov 2016 16:22:16 GMT
See <https://builds.apache.org/job/beam_PostCommit_RunnableOnService_SparkLocal/33/>

------------------------------------------
[...truncated 2629 lines...]
[JENKINS] Recording test results
[INFO] 
[INFO] --- maven-jar-plugin:2.5:jar (default-jar) @ beam-runners-spark ---
[INFO] Building jar: <https://builds.apache.org/job/beam_PostCommit_RunnableOnService_SparkLocal/ws/runners/spark/target/beam-runners-spark-0.4.0-incubating-SNAPSHOT.jar>
[INFO] 
[INFO] --- maven-site-plugin:3.5.1:attach-descriptor (attach-descriptor) @ beam-runners-spark
---
[INFO] 
[INFO] --- maven-jar-plugin:2.5:test-jar (default-test-jar) @ beam-runners-spark ---
[INFO] Building jar: <https://builds.apache.org/job/beam_PostCommit_RunnableOnService_SparkLocal/ws/runners/spark/target/beam-runners-spark-0.4.0-incubating-SNAPSHOT-tests.jar>
[INFO] 
[INFO] --- maven-shade-plugin:2.4.3:shade (default) @ beam-runners-spark ---
[INFO] Including org.xerial.snappy:snappy-java:jar:1.1.2.1 in the shaded jar.
[INFO] Including net.jpountz.lz4:lz4:jar:1.3.0 in the shaded jar.
[INFO] Including commons-codec:commons-codec:jar:1.4 in the shaded jar.
[INFO] Including org.mortbay.jetty:jetty:jar:6.1.26 in the shaded jar.
[INFO] Including org.mortbay.jetty:jetty-util:jar:6.1.26 in the shaded jar.
[INFO] Including commons-logging:commons-logging:jar:1.1.1 in the shaded jar.
[INFO] Including commons-lang:commons-lang:jar:2.5 in the shaded jar.
[INFO] Including commons-collections:commons-collections:jar:3.2.1 in the shaded jar.
[INFO] Including org.codehaus.jackson:jackson-core-asl:jar:1.8.8 in the shaded jar.
[INFO] Including org.codehaus.jackson:jackson-mapper-asl:jar:1.8.8 in the shaded jar.
[INFO] Including com.google.protobuf:protobuf-java:jar:3.0.0 in the shaded jar.
[INFO] Including io.netty:netty:jar:3.6.2.Final in the shaded jar.
[INFO] Including de.javakaffee:kryo-serializers:jar:0.39 in the shaded jar.
[INFO] Including com.google.code.findbugs:jsr305:jar:1.3.9 in the shaded jar.
[INFO] Including com.google.guava:guava:jar:19.0 in the shaded jar.
[INFO] Including com.google.auto.service:auto-service:jar:1.0-rc2 in the shaded jar.
[INFO] Including com.google.auto:auto-common:jar:0.3 in the shaded jar.
[INFO] Including com.fasterxml.jackson.core:jackson-core:jar:2.7.2 in the shaded jar.
[INFO] Including com.fasterxml.jackson.core:jackson-annotations:jar:2.7.2 in the shaded jar.
[INFO] Including com.fasterxml.jackson.core:jackson-databind:jar:2.7.2 in the shaded jar.
[INFO] Including org.apache.avro:avro:jar:1.8.1 in the shaded jar.
[INFO] Including com.thoughtworks.paranamer:paranamer:jar:2.7 in the shaded jar.
[INFO] Including org.tukaani:xz:jar:1.5 in the shaded jar.
[INFO] Including org.slf4j:slf4j-api:jar:1.7.14 in the shaded jar.
[INFO] Including joda-time:joda-time:jar:2.4 in the shaded jar.
[INFO] Including com.google.http-client:google-http-client:jar:1.22.0 in the shaded jar.
[INFO] Including org.apache.httpcomponents:httpclient:jar:4.0.1 in the shaded jar.
[INFO] Including org.apache.httpcomponents:httpcore:jar:4.0.1 in the shaded jar.
[INFO] Including org.apache.beam:beam-sdks-java-core:jar:0.4.0-incubating-SNAPSHOT in the
shaded jar.
[INFO] Including io.grpc:grpc-auth:jar:1.0.1 in the shaded jar.
[INFO] Including com.google.auth:google-auth-library-credentials:jar:0.4.0 in the shaded jar.
[INFO] Including io.grpc:grpc-core:jar:1.0.1 in the shaded jar.
[INFO] Including io.grpc:grpc-context:jar:1.0.1 in the shaded jar.
[INFO] Including io.grpc:grpc-netty:jar:1.0.1 in the shaded jar.
[INFO] Including io.netty:netty-codec-http2:jar:4.1.3.Final in the shaded jar.
[INFO] Including io.netty:netty-codec-http:jar:4.1.3.Final in the shaded jar.
[INFO] Including io.grpc:grpc-stub:jar:1.0.1 in the shaded jar.
[INFO] Including io.grpc:grpc-all:jar:1.0.1 in the shaded jar.
[INFO] Including io.grpc:grpc-protobuf:jar:1.0.1 in the shaded jar.
[INFO] Including com.google.protobuf:protobuf-java-util:jar:3.0.0 in the shaded jar.
[INFO] Including com.google.code.gson:gson:jar:2.3 in the shaded jar.
[INFO] Including io.grpc:grpc-protobuf-nano:jar:1.0.1 in the shaded jar.
[INFO] Including com.google.protobuf.nano:protobuf-javanano:jar:3.0.0-alpha-5 in the shaded
jar.
[INFO] Including io.grpc:grpc-okhttp:jar:1.0.1 in the shaded jar.
[INFO] Including com.squareup.okio:okio:jar:1.6.0 in the shaded jar.
[INFO] Including com.squareup.okhttp:okhttp:jar:2.5.0 in the shaded jar.
[INFO] Including io.grpc:grpc-protobuf-lite:jar:1.0.1 in the shaded jar.
[INFO] Including com.google.protobuf:protobuf-lite:jar:3.0.1 in the shaded jar.
[INFO] Including com.google.auth:google-auth-library-oauth2-http:jar:0.4.0 in the shaded jar.
[INFO] Including io.netty:netty-handler:jar:4.1.3.Final in the shaded jar.
[INFO] Including io.netty:netty-buffer:jar:4.1.3.Final in the shaded jar.
[INFO] Including io.netty:netty-common:jar:4.1.3.Final in the shaded jar.
[INFO] Including io.netty:netty-transport:jar:4.1.3.Final in the shaded jar.
[INFO] Including io.netty:netty-resolver:jar:4.1.3.Final in the shaded jar.
[INFO] Including io.netty:netty-codec:jar:4.1.3.Final in the shaded jar.
[INFO] Including com.google.api.grpc:grpc-google-pubsub-v1:jar:0.1.0 in the shaded jar.
[INFO] Including com.google.api.grpc:grpc-google-common-protos:jar:0.1.0 in the shaded jar.
[INFO] Including com.google.api.grpc:grpc-google-iam-v1:jar:0.1.0 in the shaded jar.
[INFO] Including com.google.api-client:google-api-client:jar:1.22.0 in the shaded jar.
[INFO] Including com.google.apis:google-api-services-bigquery:jar:v2-rev295-1.22.0 in the
shaded jar.
[INFO] Including com.google.apis:google-api-services-cloudresourcemanager:jar:v1-rev6-1.22.0
in the shaded jar.
[INFO] Including com.google.apis:google-api-services-pubsub:jar:v1-rev10-1.22.0 in the shaded
jar.
[INFO] Including com.google.apis:google-api-services-storage:jar:v1-rev71-1.22.0 in the shaded
jar.
[INFO] Including com.google.http-client:google-http-client-jackson:jar:1.22.0 in the shaded
jar.
[INFO] Including com.google.http-client:google-http-client-jackson2:jar:1.22.0 in the shaded
jar.
[INFO] Including com.google.http-client:google-http-client-protobuf:jar:1.22.0 in the shaded
jar.
[INFO] Including com.google.oauth-client:google-oauth-client-java6:jar:1.22.0 in the shaded
jar.
[INFO] Including com.google.oauth-client:google-oauth-client:jar:1.22.0 in the shaded jar.
[INFO] Including com.google.cloud.bigdataoss:gcsio:jar:1.4.5 in the shaded jar.
[INFO] Including com.google.api-client:google-api-client-java6:jar:1.22.0 in the shaded jar.
[INFO] Including com.google.api-client:google-api-client-jackson2:jar:1.22.0 in the shaded
jar.
[INFO] Including com.google.cloud.bigdataoss:util:jar:1.4.5 in the shaded jar.
[INFO] Including com.google.code.findbugs:annotations:jar:3.0.1 in the shaded jar.
[INFO] Including net.jcip:jcip-annotations:jar:1.0 in the shaded jar.
[INFO] Including net.bytebuddy:byte-buddy:jar:1.4.3 in the shaded jar.
[INFO] Including org.apache.beam:beam-runners-core-java:jar:0.4.0-incubating-SNAPSHOT in the
shaded jar.
[INFO] Including org.apache.avro:avro-mapred:jar:hadoop2:1.8.1 in the shaded jar.
[INFO] Including org.apache.avro:avro-ipc:jar:1.8.1 in the shaded jar.
[INFO] Including org.apache.velocity:velocity:jar:1.7 in the shaded jar.
[INFO] Including io.dropwizard.metrics:metrics-core:jar:3.1.2 in the shaded jar.
[INFO] Including org.apache.beam:beam-sdks-java-io-kafka:jar:0.4.0-incubating-SNAPSHOT in
the shaded jar.
[INFO] Including org.apache.kafka:kafka-clients:jar:0.9.0.1 in the shaded jar.
[WARNING] annotations-3.0.1.jar, jcip-annotations-1.0.jar define 4 overlapping classes: 
[WARNING]   - net.jcip.annotations.GuardedBy
[WARNING]   - net.jcip.annotations.NotThreadSafe
[WARNING]   - net.jcip.annotations.ThreadSafe
[WARNING]   - net.jcip.annotations.Immutable
[WARNING] beam-runners-core-java-0.4.0-incubating-SNAPSHOT.jar, beam-sdks-java-core-0.4.0-incubating-SNAPSHOT.jar
define 1717 overlapping classes: 
[WARNING]   - org.apache.beam.sdk.repackaged.com.google.common.collect.TreeRangeSet$ComplementRangesByLowerBound$2
[WARNING]   - org.apache.beam.sdk.repackaged.com.google.common.collect.WellBehavedMap$EntrySet$1$1
[WARNING]   - org.apache.beam.sdk.repackaged.com.google.common.util.concurrent.CycleDetectingLockFactory$Policies$1
[WARNING]   - org.apache.beam.sdk.repackaged.com.google.common.collect.Maps$6
[WARNING]   - org.apache.beam.sdk.repackaged.com.google.common.primitives.UnsignedBytes$LexicographicalComparatorHolder$UnsafeComparator$1
[WARNING]   - org.apache.beam.sdk.repackaged.com.google.common.collect.Range$1
[WARNING]   - org.apache.beam.sdk.repackaged.com.google.common.collect.Collections2$OrderedPermutationCollection
[WARNING]   - org.apache.beam.sdk.repackaged.com.google.common.base.Splitter$2
[WARNING]   - org.apache.beam.sdk.repackaged.com.google.common.base.Equivalence$Identity
[WARNING]   - org.apache.beam.sdk.repackaged.com.google.common.collect.Lists$1
[WARNING]   - 1707 more...
[WARNING] annotations-3.0.1.jar, jsr305-1.3.9.jar define 35 overlapping classes: 
[WARNING]   - javax.annotation.RegEx
[WARNING]   - javax.annotation.concurrent.Immutable
[WARNING]   - javax.annotation.meta.TypeQualifierDefault
[WARNING]   - javax.annotation.meta.TypeQualifier
[WARNING]   - javax.annotation.Syntax
[WARNING]   - javax.annotation.Nonnull
[WARNING]   - javax.annotation.CheckReturnValue
[WARNING]   - javax.annotation.CheckForNull
[WARNING]   - javax.annotation.meta.TypeQualifierNickname
[WARNING]   - javax.annotation.MatchesPattern
[WARNING]   - 25 more...
[WARNING] protobuf-java-3.0.0.jar, protobuf-lite-3.0.1.jar define 144 overlapping classes:

[WARNING]   - com.google.protobuf.CodedOutputStream$AbstractBufferedEncoder
[WARNING]   - com.google.protobuf.MessageLiteOrBuilder
[WARNING]   - com.google.protobuf.LazyField$LazyEntry
[WARNING]   - com.google.protobuf.AbstractMessageLite
[WARNING]   - com.google.protobuf.UnsafeUtil
[WARNING]   - com.google.protobuf.Utf8
[WARNING]   - com.google.protobuf.LazyStringArrayList$ByteArrayListView
[WARNING]   - com.google.protobuf.GeneratedMessageLite$ExtensionDescriptor
[WARNING]   - com.google.protobuf.SmallSortedMap$EntrySet
[WARNING]   - com.google.protobuf.CodedOutputStream$1
[WARNING]   - 134 more...
[WARNING] maven-shade-plugin has detected that some class files are
[WARNING] present in two or more JARs. When this happens, only one
[WARNING] single version of the class is copied to the uber jar.
[WARNING] Usually this is not harmful and you can skip these warnings,
[WARNING] otherwise try to manually exclude artifacts based on
[WARNING] mvn dependency:tree -Ddetail=true and the above output.
[WARNING] See http://maven.apache.org/plugins/maven-shade-plugin/
[INFO] Attaching shaded artifact.
[INFO] 
[INFO] --- maven-surefire-plugin:2.19.1:test (runnable-on-service-tests) @ beam-runners-spark
---
[INFO] Surefire report directory: <https://builds.apache.org/job/beam_PostCommit_RunnableOnService_SparkLocal/ws/runners/spark/target/surefire-reports>
[INFO] Using configured provider org.apache.maven.surefire.junitcore.JUnitCoreProvider
[JENKINS] Recording test results
[INFO] ------------------------------------------------------------------------
[INFO] Reactor Summary:
[INFO] 
[INFO] Apache Beam :: Parent .............................. SUCCESS [  4.846 s]
[INFO] Apache Beam :: SDKs ................................ SUCCESS [  0.489 s]
[INFO] Apache Beam :: SDKs :: Java ........................ SUCCESS [  0.492 s]
[INFO] Apache Beam :: SDKs :: Java :: Build Tools ......... SUCCESS [  2.344 s]
[INFO] Apache Beam :: SDKs :: Java :: Core ................ SUCCESS [03:21 min]
[INFO] Apache Beam :: Runners ............................. SUCCESS [  0.518 s]
[INFO] Apache Beam :: Runners :: Core Java ................ SUCCESS [ 59.276 s]
[INFO] Apache Beam :: Runners :: Direct Java .............. SUCCESS [02:45 min]
[INFO] Apache Beam :: SDKs :: Java :: IO .................. SUCCESS [  0.434 s]
[INFO] Apache Beam :: SDKs :: Java :: IO :: Kafka ......... SUCCESS [ 19.729 s]
[INFO] Apache Beam :: Runners :: Spark .................... FAILURE [01:38 min]
[INFO] ------------------------------------------------------------------------
[INFO] BUILD FAILURE
[INFO] ------------------------------------------------------------------------
[INFO] Total time: 09:53 min
[INFO] Finished at: 2016-11-02T16:21:42+00:00
[INFO] Final Memory: 122M/935M
[INFO] ------------------------------------------------------------------------
Waiting for Jenkins to finish collecting data
[ERROR] Failed to execute goal org.apache.maven.plugins:maven-surefire-plugin:2.19.1:test
(runnable-on-service-tests) on project beam-runners-spark: Illegal parallel='4' -> [Help
1]
org.apache.maven.lifecycle.LifecycleExecutionException: Failed to execute goal org.apache.maven.plugins:maven-surefire-plugin:2.19.1:test
(runnable-on-service-tests) on project beam-runners-spark: Illegal parallel='4'
	at org.apache.maven.lifecycle.internal.MojoExecutor.execute(MojoExecutor.java:216)
	at org.apache.maven.lifecycle.internal.MojoExecutor.execute(MojoExecutor.java:153)
	at org.apache.maven.lifecycle.internal.MojoExecutor.execute(MojoExecutor.java:145)
	at org.apache.maven.lifecycle.internal.LifecycleModuleBuilder.buildProject(LifecycleModuleBuilder.java:116)
	at org.apache.maven.lifecycle.internal.LifecycleModuleBuilder.buildProject(LifecycleModuleBuilder.java:80)
	at org.apache.maven.lifecycle.internal.builder.singlethreaded.SingleThreadedBuilder.build(SingleThreadedBuilder.java:51)
	at org.apache.maven.lifecycle.internal.LifecycleStarter.execute(LifecycleStarter.java:128)
	at org.apache.maven.DefaultMaven.doExecute(DefaultMaven.java:307)
	at org.apache.maven.DefaultMaven.doExecute(DefaultMaven.java:193)
	at org.apache.maven.DefaultMaven.execute(DefaultMaven.java:106)
	at org.jvnet.hudson.maven3.launcher.Maven32Launcher.main(Maven32Launcher.java:132)
	at sun.reflect.NativeMethodAccessorImpl.invoke0(Native Method)
	at sun.reflect.NativeMethodAccessorImpl.invoke(NativeMethodAccessorImpl.java:62)
	at sun.reflect.DelegatingMethodAccessorImpl.invoke(DelegatingMethodAccessorImpl.java:43)
	at java.lang.reflect.Method.invoke(Method.java:498)
	at org.codehaus.plexus.classworlds.launcher.Launcher.launchStandard(Launcher.java:330)
	at org.codehaus.plexus.classworlds.launcher.Launcher.launch(Launcher.java:238)
	at jenkins.maven3.agent.Maven32Main.launch(Maven32Main.java:186)
	at sun.reflect.NativeMethodAccessorImpl.invoke0(Native Method)
	at sun.reflect.NativeMethodAccessorImpl.invoke(NativeMethodAccessorImpl.java:62)
	at sun.reflect.DelegatingMethodAccessorImpl.invoke(DelegatingMethodAccessorImpl.java:43)
	at java.lang.reflect.Method.invoke(Method.java:498)
	at hudson.maven.Maven3Builder.call(Maven3Builder.java:136)
	at hudson.maven.Maven3Builder.call(Maven3Builder.java:71)
	at hudson.remoting.UserRequest.perform(UserRequest.java:153)
	at hudson.remoting.UserRequest.perform(UserRequest.java:50)
	at hudson.remoting.Request$2.run(Request.java:332)
	at hudson.remoting.InterceptingExecutorService$1.call(InterceptingExecutorService.java:68)
	at java.util.concurrent.FutureTask.run(FutureTask.java:266)
	at java.util.concurrent.ThreadPoolExecutor.runWorker(ThreadPoolExecutor.java:1142)
	at java.util.concurrent.ThreadPoolExecutor$Worker.run(ThreadPoolExecutor.java:617)
	at java.lang.Thread.run(Thread.java:745)
Caused by: org.apache.maven.plugin.MojoExecutionException: Illegal parallel='4'
	at org.apache.maven.plugin.surefire.AbstractSurefireMojo.checkNonForkedThreads(AbstractSurefireMojo.java:1367)
	at org.apache.maven.plugin.surefire.AbstractSurefireMojo.convertJunitCoreParameters(AbstractSurefireMojo.java:1221)
	at org.apache.maven.plugin.surefire.AbstractSurefireMojo.access$500(AbstractSurefireMojo.java:106)
	at org.apache.maven.plugin.surefire.AbstractSurefireMojo$JUnitCoreProviderInfo.addProviderProperties(AbstractSurefireMojo.java:2593)
	at org.apache.maven.plugin.surefire.AbstractSurefireMojo.executeProvider(AbstractSurefireMojo.java:1000)
	at org.apache.maven.plugin.surefire.AbstractSurefireMojo.executeAfterPreconditionsChecked(AbstractSurefireMojo.java:862)
	at org.apache.maven.plugin.surefire.AbstractSurefireMojo.execute(AbstractSurefireMojo.java:755)
	at org.apache.maven.plugin.DefaultBuildPluginManager.executeMojo(DefaultBuildPluginManager.java:134)
	at org.apache.maven.lifecycle.internal.MojoExecutor.execute(MojoExecutor.java:208)
	... 31 more
[ERROR] 
[ERROR] Re-run Maven using the -X switch to enable full debug logging.
[ERROR] 
[ERROR] For more information about the errors and possible solutions, please read the following
articles:
[ERROR] [Help 1] http://cwiki.apache.org/confluence/display/MAVEN/MojoExecutionException
[ERROR] 
[ERROR] After correcting the problems, you can resume the build with the command
[ERROR]   mvn <goals> -rf :beam-runners-spark
[JENKINS] Archiving <https://builds.apache.org/job/beam_PostCommit_RunnableOnService_SparkLocal/ws/sdks/java/io/pom.xml>
to org.apache.beam/beam-sdks-java-io-parent/0.4.0-incubating-SNAPSHOT/beam-sdks-java-io-parent-0.4.0-incubating-SNAPSHOT.pom
[JENKINS] Archiving <https://builds.apache.org/job/beam_PostCommit_RunnableOnService_SparkLocal/ws/runners/direct-java/dependency-reduced-pom.xml>
to org.apache.beam/beam-runners-direct-java/0.4.0-incubating-SNAPSHOT/beam-runners-direct-java-0.4.0-incubating-SNAPSHOT.pom
[JENKINS] Archiving <https://builds.apache.org/job/beam_PostCommit_RunnableOnService_SparkLocal/ws/runners/direct-java/target/beam-runners-direct-java-0.4.0-incubating-SNAPSHOT.jar>
to org.apache.beam/beam-runners-direct-java/0.4.0-incubating-SNAPSHOT/beam-runners-direct-java-0.4.0-incubating-SNAPSHOT.jar
[JENKINS] Archiving <https://builds.apache.org/job/beam_PostCommit_RunnableOnService_SparkLocal/ws/runners/direct-java/target/beam-runners-direct-java-0.4.0-incubating-SNAPSHOT-tests.jar>
to org.apache.beam/beam-runners-direct-java/0.4.0-incubating-SNAPSHOT/beam-runners-direct-java-0.4.0-incubating-SNAPSHOT-tests.jar
[JENKINS] Archiving <https://builds.apache.org/job/beam_PostCommit_RunnableOnService_SparkLocal/ws/sdks/java/build-tools/pom.xml>
to org.apache.beam/beam-sdks-java-build-tools/0.4.0-incubating-SNAPSHOT/beam-sdks-java-build-tools-0.4.0-incubating-SNAPSHOT.pom
[JENKINS] Archiving <https://builds.apache.org/job/beam_PostCommit_RunnableOnService_SparkLocal/ws/sdks/java/build-tools/target/beam-sdks-java-build-tools-0.4.0-incubating-SNAPSHOT.jar>
to org.apache.beam/beam-sdks-java-build-tools/0.4.0-incubating-SNAPSHOT/beam-sdks-java-build-tools-0.4.0-incubating-SNAPSHOT.jar
[JENKINS] Archiving <https://builds.apache.org/job/beam_PostCommit_RunnableOnService_SparkLocal/ws/sdks/java/build-tools/target/beam-sdks-java-build-tools-0.4.0-incubating-SNAPSHOT-tests.jar>
to org.apache.beam/beam-sdks-java-build-tools/0.4.0-incubating-SNAPSHOT/beam-sdks-java-build-tools-0.4.0-incubating-SNAPSHOT-tests.jar
[JENKINS] Archiving <https://builds.apache.org/job/beam_PostCommit_RunnableOnService_SparkLocal/ws/sdks/java/core/dependency-reduced-pom.xml>
to org.apache.beam/beam-sdks-java-core/0.4.0-incubating-SNAPSHOT/beam-sdks-java-core-0.4.0-incubating-SNAPSHOT.pom
[JENKINS] Archiving <https://builds.apache.org/job/beam_PostCommit_RunnableOnService_SparkLocal/ws/sdks/java/core/target/beam-sdks-java-core-0.4.0-incubating-SNAPSHOT.jar>
to org.apache.beam/beam-sdks-java-core/0.4.0-incubating-SNAPSHOT/beam-sdks-java-core-0.4.0-incubating-SNAPSHOT.jar
[JENKINS] Archiving <https://builds.apache.org/job/beam_PostCommit_RunnableOnService_SparkLocal/ws/sdks/java/core/target/beam-sdks-java-core-0.4.0-incubating-SNAPSHOT-tests.jar>
to org.apache.beam/beam-sdks-java-core/0.4.0-incubating-SNAPSHOT/beam-sdks-java-core-0.4.0-incubating-SNAPSHOT-tests.jar
[JENKINS] Archiving <https://builds.apache.org/job/beam_PostCommit_RunnableOnService_SparkLocal/ws/runners/core-java/dependency-reduced-pom.xml>
to org.apache.beam/beam-runners-core-java/0.4.0-incubating-SNAPSHOT/beam-runners-core-java-0.4.0-incubating-SNAPSHOT.pom
[JENKINS] Archiving <https://builds.apache.org/job/beam_PostCommit_RunnableOnService_SparkLocal/ws/runners/core-java/target/beam-runners-core-java-0.4.0-incubating-SNAPSHOT.jar>
to org.apache.beam/beam-runners-core-java/0.4.0-incubating-SNAPSHOT/beam-runners-core-java-0.4.0-incubating-SNAPSHOT.jar
[JENKINS] Archiving <https://builds.apache.org/job/beam_PostCommit_RunnableOnService_SparkLocal/ws/runners/core-java/target/beam-runners-core-java-0.4.0-incubating-SNAPSHOT-tests.jar>
to org.apache.beam/beam-runners-core-java/0.4.0-incubating-SNAPSHOT/beam-runners-core-java-0.4.0-incubating-SNAPSHOT-tests.jar
[JENKINS] Archiving <https://builds.apache.org/job/beam_PostCommit_RunnableOnService_SparkLocal/ws/runners/core-java/target/beam-runners-core-java-0.4.0-incubating-SNAPSHOT-javadoc.jar>
to org.apache.beam/beam-runners-core-java/0.4.0-incubating-SNAPSHOT/beam-runners-core-java-0.4.0-incubating-SNAPSHOT-javadoc.jar
[JENKINS] Archiving <https://builds.apache.org/job/beam_PostCommit_RunnableOnService_SparkLocal/ws/sdks/java/io/kafka/pom.xml>
to org.apache.beam/beam-sdks-java-io-kafka/0.4.0-incubating-SNAPSHOT/beam-sdks-java-io-kafka-0.4.0-incubating-SNAPSHOT.pom
[JENKINS] Archiving <https://builds.apache.org/job/beam_PostCommit_RunnableOnService_SparkLocal/ws/sdks/java/io/kafka/target/beam-sdks-java-io-kafka-0.4.0-incubating-SNAPSHOT.jar>
to org.apache.beam/beam-sdks-java-io-kafka/0.4.0-incubating-SNAPSHOT/beam-sdks-java-io-kafka-0.4.0-incubating-SNAPSHOT.jar
[JENKINS] Archiving <https://builds.apache.org/job/beam_PostCommit_RunnableOnService_SparkLocal/ws/sdks/java/io/kafka/target/beam-sdks-java-io-kafka-0.4.0-incubating-SNAPSHOT-tests.jar>
to org.apache.beam/beam-sdks-java-io-kafka/0.4.0-incubating-SNAPSHOT/beam-sdks-java-io-kafka-0.4.0-incubating-SNAPSHOT-tests.jar
[JENKINS] Archiving <https://builds.apache.org/job/beam_PostCommit_RunnableOnService_SparkLocal/ws/sdks/java/pom.xml>
to org.apache.beam/beam-sdks-java-parent/0.4.0-incubating-SNAPSHOT/beam-sdks-java-parent-0.4.0-incubating-SNAPSHOT.pom
[JENKINS] Archiving <https://builds.apache.org/job/beam_PostCommit_RunnableOnService_SparkLocal/ws/pom.xml>
to org.apache.beam/beam-parent/0.4.0-incubating-SNAPSHOT/beam-parent-0.4.0-incubating-SNAPSHOT.pom
Compressed 41.01 KB of artifacts by 78.0% relative to #32
[JENKINS] Archiving <https://builds.apache.org/job/beam_PostCommit_RunnableOnService_SparkLocal/ws/runners/spark/pom.xml>
to org.apache.beam/beam-runners-spark/0.4.0-incubating-SNAPSHOT/beam-runners-spark-0.4.0-incubating-SNAPSHOT.pom
[JENKINS] Archiving <https://builds.apache.org/job/beam_PostCommit_RunnableOnService_SparkLocal/ws/runners/spark/target/beam-runners-spark-0.4.0-incubating-SNAPSHOT.jar>
to org.apache.beam/beam-runners-spark/0.4.0-incubating-SNAPSHOT/beam-runners-spark-0.4.0-incubating-SNAPSHOT.jar
[JENKINS] Archiving <https://builds.apache.org/job/beam_PostCommit_RunnableOnService_SparkLocal/ws/runners/spark/target/beam-runners-spark-0.4.0-incubating-SNAPSHOT-tests.jar>
to org.apache.beam/beam-runners-spark/0.4.0-incubating-SNAPSHOT/beam-runners-spark-0.4.0-incubating-SNAPSHOT-tests.jar
[JENKINS] Archiving <https://builds.apache.org/job/beam_PostCommit_RunnableOnService_SparkLocal/ws/runners/spark/target/beam-runners-spark-0.4.0-incubating-SNAPSHOT-spark-app.jar>
to org.apache.beam/beam-runners-spark/0.4.0-incubating-SNAPSHOT/beam-runners-spark-0.4.0-incubating-SNAPSHOT-spark-app.jar
[JENKINS] Archiving <https://builds.apache.org/job/beam_PostCommit_RunnableOnService_SparkLocal/ws/sdks/pom.xml>
to org.apache.beam/beam-sdks-parent/0.4.0-incubating-SNAPSHOT/beam-sdks-parent-0.4.0-incubating-SNAPSHOT.pom
[JENKINS] Archiving <https://builds.apache.org/job/beam_PostCommit_RunnableOnService_SparkLocal/ws/runners/pom.xml>
to org.apache.beam/beam-runners-parent/0.4.0-incubating-SNAPSHOT/beam-runners-parent-0.4.0-incubating-SNAPSHOT.pom
channel stopped

Mime
View raw message