beam-commits mailing list archives

Site index · List index
Message view « Date » · « Thread »
Top « Date » · « Thread »
From Apache Jenkins Server <jenk...@builds.apache.org>
Subject Build failed in Jenkins: beam_PostCommit_RunnableOnService_FlinkLocal #541
Date Wed, 12 Oct 2016 16:44:04 GMT
See <https://builds.apache.org/job/beam_PostCommit_RunnableOnService_FlinkLocal/541/changes>

Changes:

[dhalperi] Add compression codec for AvroIO.Write

------------------------------------------
[...truncated 1403 lines...]
[WARNING]   - 134 more...
[WARNING] jcip-annotations-1.0.jar, annotations-3.0.1.jar define 4 overlapping classes: 
[WARNING]   - net.jcip.annotations.GuardedBy
[WARNING]   - net.jcip.annotations.NotThreadSafe
[WARNING]   - net.jcip.annotations.ThreadSafe
[WARNING]   - net.jcip.annotations.Immutable
[WARNING] beam-runners-core-java-0.3.0-incubating-SNAPSHOT.jar, beam-sdks-java-core-0.3.0-incubating-SNAPSHOT.jar
define 1717 overlapping classes: 
[WARNING]   - org.apache.beam.sdk.repackaged.com.google.common.collect.TreeRangeSet$ComplementRangesByLowerBound$2
[WARNING]   - org.apache.beam.sdk.repackaged.com.google.common.collect.WellBehavedMap$EntrySet$1$1
[WARNING]   - org.apache.beam.sdk.repackaged.com.google.common.util.concurrent.CycleDetectingLockFactory$Policies$1
[WARNING]   - org.apache.beam.sdk.repackaged.com.google.common.collect.Maps$6
[WARNING]   - org.apache.beam.sdk.repackaged.com.google.common.primitives.UnsignedBytes$LexicographicalComparatorHolder$UnsafeComparator$1
[WARNING]   - org.apache.beam.sdk.repackaged.com.google.common.collect.Range$1
[WARNING]   - org.apache.beam.sdk.repackaged.com.google.common.collect.Collections2$OrderedPermutationCollection
[WARNING]   - org.apache.beam.sdk.repackaged.com.google.common.base.Splitter$2
[WARNING]   - org.apache.beam.sdk.repackaged.com.google.common.base.Equivalence$Identity
[WARNING]   - org.apache.beam.sdk.repackaged.com.google.common.collect.Lists$1
[WARNING]   - 1707 more...
[WARNING] maven-shade-plugin has detected that some class files are
[WARNING] present in two or more JARs. When this happens, only one
[WARNING] single version of the class is copied to the uber jar.
[WARNING] Usually this is not harmful and you can skip these warnings,
[WARNING] otherwise try to manually exclude artifacts based on
[WARNING] mvn dependency:tree -Ddetail=true and the above output.
[WARNING] See http://docs.codehaus.org/display/MAVENUSER/Shade+Plugin
[INFO] Replacing <https://builds.apache.org/job/beam_PostCommit_RunnableOnService_FlinkLocal/ws/runners/core-java/target/beam-runners-core-java-bundled-0.3.0-incubating-SNAPSHOT.jar>
with <https://builds.apache.org/job/beam_PostCommit_RunnableOnService_FlinkLocal/ws/runners/core-java/target/beam-runners-core-java-0.3.0-incubating-SNAPSHOT-shaded.jar>
[INFO] 
[INFO] --- maven-dependency-plugin:2.10:analyze-only (default) @ beam-runners-core-java ---
[INFO] No dependency problems found
[INFO]                                                                         
[INFO] ------------------------------------------------------------------------
[INFO] Building Apache Beam :: Runners :: Flink 0.3.0-incubating-SNAPSHOT
[INFO] ------------------------------------------------------------------------
[INFO] 
[INFO] --- maven-clean-plugin:2.5:clean (default-clean) @ beam-runners-flink-parent ---
[INFO] Deleting <https://builds.apache.org/job/beam_PostCommit_RunnableOnService_FlinkLocal/ws/runners/flink/target>
[INFO] 
[INFO] --- maven-enforcer-plugin:1.3.1:enforce (enforce) @ beam-runners-flink-parent ---
[INFO] 
[INFO] --- maven-remote-resources-plugin:1.5:process (default) @ beam-runners-flink-parent
---
[INFO] 
[INFO] --- maven-site-plugin:3.4:attach-descriptor (attach-descriptor) @ beam-runners-flink-parent
---
[INFO] 
[INFO] --- maven-dependency-plugin:2.10:analyze-only (default) @ beam-runners-flink-parent
---
[INFO] Skipping pom project
[INFO]                                                                         
[INFO] ------------------------------------------------------------------------
[INFO] Building Apache Beam :: Runners :: Flink :: Core 0.3.0-incubating-SNAPSHOT
[INFO] ------------------------------------------------------------------------
[INFO] 
[INFO] --- maven-clean-plugin:2.5:clean (default-clean) @ beam-runners-flink_2.10 ---
[INFO] Deleting <https://builds.apache.org/job/beam_PostCommit_RunnableOnService_FlinkLocal/ws/runners/flink/runner/target>
[INFO] 
[INFO] --- maven-enforcer-plugin:1.3.1:enforce (enforce) @ beam-runners-flink_2.10 ---
[INFO] 
[INFO] --- maven-remote-resources-plugin:1.5:process (default) @ beam-runners-flink_2.10 ---
[INFO] 
[INFO] --- maven-resources-plugin:2.7:resources (default-resources) @ beam-runners-flink_2.10
---
[INFO] Using 'UTF-8' encoding to copy filtered resources.
[INFO] Copying 1 resource
[INFO] Copying 3 resources
[INFO] 
[INFO] --- maven-compiler-plugin:3.5.1:compile (default-compile) @ beam-runners-flink_2.10
---
[INFO] Changes detected - recompiling the module!
[INFO] Compiling 63 source files to <https://builds.apache.org/job/beam_PostCommit_RunnableOnService_FlinkLocal/ws/runners/flink/runner/target/classes>
[INFO] <https://builds.apache.org/job/beam_PostCommit_RunnableOnService_FlinkLocal/ws/runners/flink/runner/src/main/java/org/apache/beam/runners/flink/translation/functions/FlinkPartialReduceFunction.java>:
Some input files use or override a deprecated API.
[INFO] <https://builds.apache.org/job/beam_PostCommit_RunnableOnService_FlinkLocal/ws/runners/flink/runner/src/main/java/org/apache/beam/runners/flink/translation/functions/FlinkPartialReduceFunction.java>:
Recompile with -Xlint:deprecation for details.
[INFO] <https://builds.apache.org/job/beam_PostCommit_RunnableOnService_FlinkLocal/ws/runners/flink/runner/src/main/java/org/apache/beam/runners/flink/translation/functions/FlinkProcessContext.java>:
Some input files use unchecked or unsafe operations.
[INFO] <https://builds.apache.org/job/beam_PostCommit_RunnableOnService_FlinkLocal/ws/runners/flink/runner/src/main/java/org/apache/beam/runners/flink/translation/functions/FlinkProcessContext.java>:
Recompile with -Xlint:unchecked for details.
[INFO] 
[INFO] --- maven-resources-plugin:2.7:testResources (default-testResources) @ beam-runners-flink_2.10
---
[INFO] Using 'UTF-8' encoding to copy filtered resources.
[INFO] Copying 1 resource
[INFO] Copying 3 resources
[INFO] 
[INFO] --- maven-compiler-plugin:3.5.1:testCompile (default-testCompile) @ beam-runners-flink_2.10
---
[INFO] Changes detected - recompiling the module!
[INFO] Compiling 14 source files to <https://builds.apache.org/job/beam_PostCommit_RunnableOnService_FlinkLocal/ws/runners/flink/runner/target/test-classes>
[INFO] <https://builds.apache.org/job/beam_PostCommit_RunnableOnService_FlinkLocal/ws/runners/flink/runner/src/test/java/org/apache/beam/runners/flink/PipelineOptionsTest.java>:
Some input files use or override a deprecated API.
[INFO] <https://builds.apache.org/job/beam_PostCommit_RunnableOnService_FlinkLocal/ws/runners/flink/runner/src/test/java/org/apache/beam/runners/flink/PipelineOptionsTest.java>:
Recompile with -Xlint:deprecation for details.
[INFO] 
[INFO] --- maven-checkstyle-plugin:2.17:check (default) @ beam-runners-flink_2.10 ---
[INFO] Starting audit...
Audit done.
[INFO] 
[INFO] --- maven-surefire-plugin:2.19.1:test (default-test) @ beam-runners-flink_2.10 ---
[INFO] Surefire report directory: <https://builds.apache.org/job/beam_PostCommit_RunnableOnService_FlinkLocal/ws/runners/flink/runner/target/surefire-reports>
[INFO] Using configured provider org.apache.maven.surefire.junitcore.JUnitCoreProvider
[INFO] parallel='none', perCoreThreadCount=true, threadCount=0, useUnlimitedThreads=false,
threadCountSuites=0, threadCountClasses=0, threadCountMethods=0, parallelOptimized=true

-------------------------------------------------------
 T E S T S
-------------------------------------------------------
Running org.apache.beam.runners.flink.PipelineOptionsTest
Tests run: 5, Failures: 0, Errors: 0, Skipped: 0, Time elapsed: 0.451 sec - in org.apache.beam.runners.flink.PipelineOptionsTest
Running org.apache.beam.runners.flink.streaming.UnboundedSourceWrapperTest
Tests run: 18, Failures: 0, Errors: 0, Skipped: 0, Time elapsed: 0.26 sec - in org.apache.beam.runners.flink.streaming.UnboundedSourceWrapperTest
Running org.apache.beam.runners.flink.streaming.DoFnOperatorTest
Tests run: 3, Failures: 0, Errors: 0, Skipped: 1, Time elapsed: 0.627 sec - in org.apache.beam.runners.flink.streaming.DoFnOperatorTest
Running org.apache.beam.runners.flink.streaming.FlinkStateInternalsTest
Tests run: 15, Failures: 0, Errors: 0, Skipped: 0, Time elapsed: 0.059 sec - in org.apache.beam.runners.flink.streaming.FlinkStateInternalsTest
Running org.apache.beam.runners.flink.streaming.GroupByNullKeyTest
Tests run: 1, Failures: 0, Errors: 0, Skipped: 0, Time elapsed: 2.477 sec - in org.apache.beam.runners.flink.streaming.GroupByNullKeyTest
Running org.apache.beam.runners.flink.FlinkRunnerRegistrarTest
Tests run: 2, Failures: 0, Errors: 0, Skipped: 0, Time elapsed: 0.003 sec - in org.apache.beam.runners.flink.FlinkRunnerRegistrarTest
Running org.apache.beam.runners.flink.EncodedValueComparatorTest
Tests run: 11, Failures: 0, Errors: 0, Skipped: 0, Time elapsed: 0.02 sec - in org.apache.beam.runners.flink.EncodedValueComparatorTest

Results :

Tests run: 55, Failures: 0, Errors: 0, Skipped: 1

[JENKINS] Recording test results
[INFO] 
[INFO] --- maven-jar-plugin:2.5:jar (default-jar) @ beam-runners-flink_2.10 ---
[INFO] Building jar: <https://builds.apache.org/job/beam_PostCommit_RunnableOnService_FlinkLocal/ws/runners/flink/runner/target/beam-runners-flink_2.10-0.3.0-incubating-SNAPSHOT.jar>
[INFO] 
[INFO] --- maven-site-plugin:3.4:attach-descriptor (attach-descriptor) @ beam-runners-flink_2.10
---
[INFO] 
[INFO] --- maven-jar-plugin:2.5:test-jar (default-test-jar) @ beam-runners-flink_2.10 ---
[INFO] Building jar: <https://builds.apache.org/job/beam_PostCommit_RunnableOnService_FlinkLocal/ws/runners/flink/runner/target/beam-runners-flink_2.10-0.3.0-incubating-SNAPSHOT-tests.jar>
[INFO] 
[INFO] --- maven-failsafe-plugin:2.19.1:integration-test (default) @ beam-runners-flink_2.10
---
[INFO] Tests are skipped.
[JENKINS] Recording test results
[INFO] 
[INFO] --- maven-surefire-plugin:2.19.1:test (runnable-on-service-tests) @ beam-runners-flink_2.10
---
[INFO] Surefire report directory: <https://builds.apache.org/job/beam_PostCommit_RunnableOnService_FlinkLocal/ws/runners/flink/runner/target/surefire-reports>
[INFO] Using configured provider org.apache.maven.surefire.junitcore.JUnitCoreProvider
[INFO] parallel='none', perCoreThreadCount=true, threadCount=0, useUnlimitedThreads=false,
threadCountSuites=0, threadCountClasses=0, threadCountMethods=0, parallelOptimized=true

-------------------------------------------------------
 T E S T S
-------------------------------------------------------
Running org.apache.beam.sdk.values.PCollectionTupleTest
Java HotSpot(TM) 64-Bit Server VM warning: INFO: os::commit_memory(0x00000006f9c80000, 316669952,
0) failed; error='Cannot allocate memory' (errno=12)
#
# There is insufficient memory for the Java Runtime Environment to continue.
# Native memory allocation (mmap) failed to map 316669952 bytes for committing reserved memory.
# An error report file with more information is saved as:
# <https://builds.apache.org/job/beam_PostCommit_RunnableOnService_FlinkLocal/ws/runners/flink/runner/hs_err_pid20976.log>

Results :

Tests run: 0, Failures: 0, Errors: 0, Skipped: 0

[JENKINS] Recording test results
[INFO] ------------------------------------------------------------------------
[INFO] Reactor Summary:
[INFO] 
[INFO] Apache Beam :: Parent .............................. SUCCESS [  6.944 s]
[INFO] Apache Beam :: SDKs ................................ SUCCESS [  0.505 s]
[INFO] Apache Beam :: SDKs :: Java ........................ SUCCESS [  0.560 s]
[INFO] Apache Beam :: SDKs :: Java :: Build Tools ......... SUCCESS [  2.459 s]
[INFO] Apache Beam :: SDKs :: Java :: Core ................ SUCCESS [03:13 min]
[INFO] Apache Beam :: Runners ............................. SUCCESS [  0.620 s]
[INFO] Apache Beam :: Runners :: Core Java ................ SUCCESS [ 46.517 s]
[INFO] Apache Beam :: Runners :: Flink .................... SUCCESS [  0.569 s]
[INFO] Apache Beam :: Runners :: Flink :: Core ............ FAILURE [ 25.254 s]
[INFO] ------------------------------------------------------------------------
[INFO] BUILD FAILURE
[INFO] ------------------------------------------------------------------------
[INFO] Total time: 05:02 min
[INFO] Finished at: 2016-10-12T16:43:53+00:00
[INFO] Final Memory: 102M/800M
[INFO] ------------------------------------------------------------------------
[WARNING] The requested profile "runna" could not be activated because it does not exist.
Waiting for Jenkins to finish collecting data
[ERROR] Failed to execute goal org.apache.maven.plugins:maven-surefire-plugin:2.19.1:test
(runnable-on-service-tests) on project beam-runners-flink_2.10: Execution runnable-on-service-tests
of goal org.apache.maven.plugins:maven-surefire-plugin:2.19.1:test failed: The forked VM terminated
without properly saying goodbye. VM crash or System.exit called?
[ERROR] Command was /bin/sh -c cd <https://builds.apache.org/job/beam_PostCommit_RunnableOnService_FlinkLocal/ws/runners/flink/runner>
&& /usr/local/asfpackages/java/jdk1.8.0_102/jre/bin/java -Dlog4j.configuration=log4j-test.properties
-XX:-UseGCOverheadLimit org.apache.maven.surefire.booter.ForkedBooter <https://builds.apache.org/job/beam_PostCommit_RunnableOnService_FlinkLocal/ws/runners/flink/runner/target/surefire/surefire915614497079401154tmp>
<https://builds.apache.org/job/beam_PostCommit_RunnableOnService_FlinkLocal/ws/runners/flink/runner/target/surefire/surefire_38262743134511231064tmp>
[ERROR] -> [Help 1]
org.apache.maven.lifecycle.LifecycleExecutionException: Failed to execute goal org.apache.maven.plugins:maven-surefire-plugin:2.19.1:test
(runnable-on-service-tests) on project beam-runners-flink_2.10: Execution runnable-on-service-tests
of goal org.apache.maven.plugins:maven-surefire-plugin:2.19.1:test failed: The forked VM terminated
without properly saying goodbye. VM crash or System.exit called?
Command was /bin/sh -c cd <https://builds.apache.org/job/beam_PostCommit_RunnableOnService_FlinkLocal/ws/runners/flink/runner>
&& /usr/local/asfpackages/java/jdk1.8.0_102/jre/bin/java -Dlog4j.configuration=log4j-test.properties
-XX:-UseGCOverheadLimit org.apache.maven.surefire.booter.ForkedBooter <https://builds.apache.org/job/beam_PostCommit_RunnableOnService_FlinkLocal/ws/runners/flink/runner/target/surefire/surefire915614497079401154tmp>
<https://builds.apache.org/job/beam_PostCommit_RunnableOnService_FlinkLocal/ws/runners/flink/runner/target/surefire/surefire_38262743134511231064tmp>
	at org.apache.maven.lifecycle.internal.MojoExecutor.execute(MojoExecutor.java:224)
	at org.apache.maven.lifecycle.internal.MojoExecutor.execute(MojoExecutor.java:153)
	at org.apache.maven.lifecycle.internal.MojoExecutor.execute(MojoExecutor.java:145)
	at org.apache.maven.lifecycle.internal.LifecycleModuleBuilder.buildProject(LifecycleModuleBuilder.java:116)
	at org.apache.maven.lifecycle.internal.LifecycleModuleBuilder.buildProject(LifecycleModuleBuilder.java:80)
	at org.apache.maven.lifecycle.internal.builder.singlethreaded.SingleThreadedBuilder.build(SingleThreadedBuilder.java:51)
	at org.apache.maven.lifecycle.internal.LifecycleStarter.execute(LifecycleStarter.java:128)
	at org.apache.maven.DefaultMaven.doExecute(DefaultMaven.java:307)
	at org.apache.maven.DefaultMaven.doExecute(DefaultMaven.java:193)
	at org.apache.maven.DefaultMaven.execute(DefaultMaven.java:106)
	at org.jvnet.hudson.maven3.launcher.Maven32Launcher.main(Maven32Launcher.java:132)
	at sun.reflect.NativeMethodAccessorImpl.invoke0(Native Method)
	at sun.reflect.NativeMethodAccessorImpl.invoke(NativeMethodAccessorImpl.java:62)
	at sun.reflect.DelegatingMethodAccessorImpl.invoke(DelegatingMethodAccessorImpl.java:43)
	at java.lang.reflect.Method.invoke(Method.java:498)
	at org.codehaus.plexus.classworlds.launcher.Launcher.launchStandard(Launcher.java:330)
	at org.codehaus.plexus.classworlds.launcher.Launcher.launch(Launcher.java:238)
	at jenkins.maven3.agent.Maven32Main.launch(Maven32Main.java:186)
	at sun.reflect.NativeMethodAccessorImpl.invoke0(Native Method)
	at sun.reflect.NativeMethodAccessorImpl.invoke(NativeMethodAccessorImpl.java:62)
	at sun.reflect.DelegatingMethodAccessorImpl.invoke(DelegatingMethodAccessorImpl.java:43)
	at java.lang.reflect.Method.invoke(Method.java:498)
	at hudson.maven.Maven3Builder.call(Maven3Builder.java:136)
	at hudson.maven.Maven3Builder.call(Maven3Builder.java:71)
	at hudson.remoting.UserRequest.perform(UserRequest.java:153)
	at hudson.remoting.UserRequest.perform(UserRequest.java:50)
	at hudson.remoting.Request$2.run(Request.java:332)
	at hudson.remoting.InterceptingExecutorService$1.call(InterceptingExecutorService.java:68)
	at java.util.concurrent.FutureTask.run(FutureTask.java:266)
	at java.util.concurrent.ThreadPoolExecutor.runWorker(ThreadPoolExecutor.java:1142)
	at java.util.concurrent.ThreadPoolExecutor$Worker.run(ThreadPoolExecutor.java:617)
	at java.lang.Thread.run(Thread.java:745)
Caused by: org.apache.maven.plugin.PluginExecutionException: Execution runnable-on-service-tests
of goal org.apache.maven.plugins:maven-surefire-plugin:2.19.1:test failed: The forked VM terminated
without properly saying goodbye. VM crash or System.exit called?
Command was /bin/sh -c cd <https://builds.apache.org/job/beam_PostCommit_RunnableOnService_FlinkLocal/ws/runners/flink/runner>
&& /usr/local/asfpackages/java/jdk1.8.0_102/jre/bin/java -Dlog4j.configuration=log4j-test.properties
-XX:-UseGCOverheadLimit org.apache.maven.surefire.booter.ForkedBooter <https://builds.apache.org/job/beam_PostCommit_RunnableOnService_FlinkLocal/ws/runners/flink/runner/target/surefire/surefire915614497079401154tmp>
<https://builds.apache.org/job/beam_PostCommit_RunnableOnService_FlinkLocal/ws/runners/flink/runner/target/surefire/surefire_38262743134511231064tmp>
	at org.apache.maven.plugin.DefaultBuildPluginManager.executeMojo(DefaultBuildPluginManager.java:145)
	at org.apache.maven.lifecycle.internal.MojoExecutor.execute(MojoExecutor.java:208)
	... 31 more
Caused by: java.lang.RuntimeException: The forked VM terminated without properly saying goodbye.
VM crash or System.exit called?
Command was /bin/sh -c cd <https://builds.apache.org/job/beam_PostCommit_RunnableOnService_FlinkLocal/ws/runners/flink/runner>
&& /usr/local/asfpackages/java/jdk1.8.0_102/jre/bin/java -Dlog4j.configuration=log4j-test.properties
-XX:-UseGCOverheadLimit org.apache.maven.surefire.booter.ForkedBooter <https://builds.apache.org/job/beam_PostCommit_RunnableOnService_FlinkLocal/ws/runners/flink/runner/target/surefire/surefire915614497079401154tmp>
<https://builds.apache.org/job/beam_PostCommit_RunnableOnService_FlinkLocal/ws/runners/flink/runner/target/surefire/surefire_38262743134511231064tmp>
	at org.apache.maven.plugin.surefire.booterclient.ForkStarter.fork(ForkStarter.java:590)
	at org.apache.maven.plugin.surefire.booterclient.ForkStarter.fork(ForkStarter.java:460)
	at org.apache.maven.plugin.surefire.booterclient.ForkStarter.run(ForkStarter.java:229)
	at org.apache.maven.plugin.surefire.booterclient.ForkStarter.run(ForkStarter.java:201)
	at org.apache.maven.plugin.surefire.AbstractSurefireMojo.executeProvider(AbstractSurefireMojo.java:1026)
	at org.apache.maven.plugin.surefire.AbstractSurefireMojo.executeAfterPreconditionsChecked(AbstractSurefireMojo.java:862)
	at org.apache.maven.plugin.surefire.AbstractSurefireMojo.execute(AbstractSurefireMojo.java:755)
	at org.apache.maven.plugin.DefaultBuildPluginManager.executeMojo(DefaultBuildPluginManager.java:134)
	... 32 more
[ERROR] 
[ERROR] Re-run Maven using the -X switch to enable full debug logging.
[ERROR] 
[ERROR] For more information about the errors and possible solutions, please read the following
articles:
[ERROR] [Help 1] http://cwiki.apache.org/confluence/display/MAVEN/PluginExecutionException
[ERROR] 
[ERROR] After correcting the problems, you can resume the build with the command
[ERROR]   mvn <goals> -rf :beam-runners-flink_2.10
[JENKINS] Archiving <https://builds.apache.org/job/beam_PostCommit_RunnableOnService_FlinkLocal/ws/sdks/java/build-tools/pom.xml>
to org.apache.beam/beam-sdks-java-build-tools/0.3.0-incubating-SNAPSHOT/beam-sdks-java-build-tools-0.3.0-incubating-SNAPSHOT.pom
[JENKINS] Archiving <https://builds.apache.org/job/beam_PostCommit_RunnableOnService_FlinkLocal/ws/sdks/java/build-tools/target/beam-sdks-java-build-tools-0.3.0-incubating-SNAPSHOT.jar>
to org.apache.beam/beam-sdks-java-build-tools/0.3.0-incubating-SNAPSHOT/beam-sdks-java-build-tools-0.3.0-incubating-SNAPSHOT.jar
[JENKINS] Archiving <https://builds.apache.org/job/beam_PostCommit_RunnableOnService_FlinkLocal/ws/sdks/java/build-tools/target/beam-sdks-java-build-tools-0.3.0-incubating-SNAPSHOT-tests.jar>
to org.apache.beam/beam-sdks-java-build-tools/0.3.0-incubating-SNAPSHOT/beam-sdks-java-build-tools-0.3.0-incubating-SNAPSHOT-tests.jar
[JENKINS] Archiving <https://builds.apache.org/job/beam_PostCommit_RunnableOnService_FlinkLocal/ws/sdks/java/core/dependency-reduced-pom.xml>
to org.apache.beam/beam-sdks-java-core/0.3.0-incubating-SNAPSHOT/beam-sdks-java-core-0.3.0-incubating-SNAPSHOT.pom
[JENKINS] Archiving <https://builds.apache.org/job/beam_PostCommit_RunnableOnService_FlinkLocal/ws/sdks/java/core/target/beam-sdks-java-core-0.3.0-incubating-SNAPSHOT.jar>
to org.apache.beam/beam-sdks-java-core/0.3.0-incubating-SNAPSHOT/beam-sdks-java-core-0.3.0-incubating-SNAPSHOT.jar
[JENKINS] Archiving <https://builds.apache.org/job/beam_PostCommit_RunnableOnService_FlinkLocal/ws/sdks/java/core/target/beam-sdks-java-core-0.3.0-incubating-SNAPSHOT-tests.jar>
to org.apache.beam/beam-sdks-java-core/0.3.0-incubating-SNAPSHOT/beam-sdks-java-core-0.3.0-incubating-SNAPSHOT-tests.jar
[JENKINS] Archiving <https://builds.apache.org/job/beam_PostCommit_RunnableOnService_FlinkLocal/ws/runners/core-java/dependency-reduced-pom.xml>
to org.apache.beam/beam-runners-core-java/0.3.0-incubating-SNAPSHOT/beam-runners-core-java-0.3.0-incubating-SNAPSHOT.pom
[JENKINS] Archiving <https://builds.apache.org/job/beam_PostCommit_RunnableOnService_FlinkLocal/ws/runners/core-java/target/beam-runners-core-java-0.3.0-incubating-SNAPSHOT.jar>
to org.apache.beam/beam-runners-core-java/0.3.0-incubating-SNAPSHOT/beam-runners-core-java-0.3.0-incubating-SNAPSHOT.jar
[JENKINS] Archiving <https://builds.apache.org/job/beam_PostCommit_RunnableOnService_FlinkLocal/ws/runners/core-java/target/beam-runners-core-java-0.3.0-incubating-SNAPSHOT-tests.jar>
to org.apache.beam/beam-runners-core-java/0.3.0-incubating-SNAPSHOT/beam-runners-core-java-0.3.0-incubating-SNAPSHOT-tests.jar
[JENKINS] Archiving <https://builds.apache.org/job/beam_PostCommit_RunnableOnService_FlinkLocal/ws/runners/core-java/target/beam-runners-core-java-0.3.0-incubating-SNAPSHOT-javadoc.jar>
to org.apache.beam/beam-runners-core-java/0.3.0-incubating-SNAPSHOT/beam-runners-core-java-0.3.0-incubating-SNAPSHOT-javadoc.jar
[JENKINS] Archiving <https://builds.apache.org/job/beam_PostCommit_RunnableOnService_FlinkLocal/ws/runners/flink/runner/pom.xml>
to org.apache.beam/beam-runners-flink_2.10/0.3.0-incubating-SNAPSHOT/beam-runners-flink_2.10-0.3.0-incubating-SNAPSHOT.pom
[JENKINS] Archiving <https://builds.apache.org/job/beam_PostCommit_RunnableOnService_FlinkLocal/ws/runners/flink/runner/target/beam-runners-flink_2.10-0.3.0-incubating-SNAPSHOT.jar>
to org.apache.beam/beam-runners-flink_2.10/0.3.0-incubating-SNAPSHOT/beam-runners-flink_2.10-0.3.0-incubating-SNAPSHOT.jar
[JENKINS] Archiving <https://builds.apache.org/job/beam_PostCommit_RunnableOnService_FlinkLocal/ws/runners/flink/runner/target/beam-runners-flink_2.10-0.3.0-incubating-SNAPSHOT-tests.jar>
to org.apache.beam/beam-runners-flink_2.10/0.3.0-incubating-SNAPSHOT/beam-runners-flink_2.10-0.3.0-incubating-SNAPSHOT-tests.jar
[JENKINS] Archiving <https://builds.apache.org/job/beam_PostCommit_RunnableOnService_FlinkLocal/ws/sdks/java/pom.xml>
to org.apache.beam/beam-sdks-java-parent/0.3.0-incubating-SNAPSHOT/beam-sdks-java-parent-0.3.0-incubating-SNAPSHOT.pom
[JENKINS] Archiving <https://builds.apache.org/job/beam_PostCommit_RunnableOnService_FlinkLocal/ws/pom.xml>
to org.apache.beam/beam-parent/0.3.0-incubating-SNAPSHOT/beam-parent-0.3.0-incubating-SNAPSHOT.pom
Compressed 39.88 KB of artifacts by 80.3% relative to #540
[JENKINS] Archiving <https://builds.apache.org/job/beam_PostCommit_RunnableOnService_FlinkLocal/ws/runners/flink/pom.xml>
to org.apache.beam/beam-runners-flink-parent/0.3.0-incubating-SNAPSHOT/beam-runners-flink-parent-0.3.0-incubating-SNAPSHOT.pom
[JENKINS] Archiving <https://builds.apache.org/job/beam_PostCommit_RunnableOnService_FlinkLocal/ws/sdks/pom.xml>
to org.apache.beam/beam-sdks-parent/0.3.0-incubating-SNAPSHOT/beam-sdks-parent-0.3.0-incubating-SNAPSHOT.pom
[JENKINS] Archiving <https://builds.apache.org/job/beam_PostCommit_RunnableOnService_FlinkLocal/ws/runners/pom.xml>
to org.apache.beam/beam-runners-parent/0.3.0-incubating-SNAPSHOT/beam-runners-parent-0.3.0-incubating-SNAPSHOT.pom
channel stopped

Mime
View raw message