beam-commits mailing list archives

Site index · List index
Message view « Date » · « Thread »
Top « Date » · « Thread »
From Apache Jenkins Server <jenk...@builds.apache.org>
Subject Build failed in Jenkins: beam_PostCommit_RunnableOnService_GearpumpLocal #149
Date Wed, 14 Sep 2016 04:41:58 GMT
See <https://builds.apache.org/job/beam_PostCommit_RunnableOnService_GearpumpLocal/149/changes>

Changes:

[owenzhang1990] [BEAM-79] fix integration-test failure

------------------------------------------
[...truncated 11175 lines...]
	at org.apache.beam.runners.gearpump.GearpumpPipelineTranslator.translate(GearpumpPipelineTranslator.java:82)
	at org.apache.beam.runners.gearpump.GearpumpPipelineRunner.run(GearpumpPipelineRunner.java:111)
	at org.apache.beam.runners.gearpump.TestGearpumpRunner.run(TestGearpumpRunner.java:54)
	at org.apache.beam.runners.gearpump.TestGearpumpRunner.run(TestGearpumpRunner.java:34)
	at org.apache.beam.sdk.Pipeline.run(Pipeline.java:182)
	at org.apache.beam.sdk.testing.TestPipeline.run(TestPipeline.java:113)
	at org.apache.beam.sdk.transforms.ApproximateUniqueTest.testApproximateUniqueWithSmallInput(ApproximateUniqueTest.java:80)
	at sun.reflect.NativeMethodAccessorImpl.invoke0(Native Method)
	at sun.reflect.NativeMethodAccessorImpl.invoke(NativeMethodAccessorImpl.java:62)
	at sun.reflect.DelegatingMethodAccessorImpl.invoke(DelegatingMethodAccessorImpl.java:43)
	at java.lang.reflect.Method.invoke(Method.java:498)
	at org.junit.runners.model.FrameworkMethod$1.runReflectiveCall(FrameworkMethod.java:47)
	at org.junit.internal.runners.model.ReflectiveCallable.run(ReflectiveCallable.java:12)
	at org.junit.runners.model.FrameworkMethod.invokeExplosively(FrameworkMethod.java:44)
	at org.junit.internal.runners.statements.InvokeMethod.evaluate(InvokeMethod.java:17)
	at org.junit.runners.ParentRunner.runLeaf(ParentRunner.java:271)
	at org.junit.runners.BlockJUnit4ClassRunner.runChild(BlockJUnit4ClassRunner.java:70)
	at org.junit.runners.BlockJUnit4ClassRunner.runChild(BlockJUnit4ClassRunner.java:50)
	at org.junit.runners.ParentRunner$3.run(ParentRunner.java:238)
	at org.apache.maven.surefire.junitcore.pc.Scheduler$1.run(Scheduler.java:387)
	at java.util.concurrent.Executors$RunnableAdapter.call(Executors.java:511)
	at java.util.concurrent.FutureTask.run(FutureTask.java:266)
	at java.util.concurrent.ThreadPoolExecutor.runWorker(ThreadPoolExecutor.java:1142)
	at java.util.concurrent.ThreadPoolExecutor$Worker.run(ThreadPoolExecutor.java:617)
	at java.lang.Thread.run(Thread.java:745)

Running org.apache.beam.sdk.transforms.windowing.WindowingTest
Tests run: 4, Failures: 0, Errors: 1, Skipped: 0, Time elapsed: 10.584 sec <<< FAILURE!
- in org.apache.beam.sdk.transforms.windowing.WindowingTest
testMergingWindowing(org.apache.beam.sdk.transforms.windowing.WindowingTest)  Time elapsed:
0.637 sec  <<< ERROR!
java.lang.UnsupportedOperationException: merging window is not supported in Gearpump pipeline
	at org.apache.beam.runners.gearpump.GearpumpPipelineRunner$AssignWindowsAndSetStrategy.apply(GearpumpPipelineRunner.java:167)
	at org.apache.beam.runners.gearpump.GearpumpPipelineRunner$AssignWindowsAndSetStrategy.apply(GearpumpPipelineRunner.java:149)
	at org.apache.beam.sdk.runners.PipelineRunner.apply(PipelineRunner.java:77)
	at org.apache.beam.runners.gearpump.GearpumpPipelineRunner.apply(GearpumpPipelineRunner.java:81)
	at org.apache.beam.runners.gearpump.TestGearpumpRunner.apply(TestGearpumpRunner.java:62)
	at org.apache.beam.sdk.Pipeline.applyInternal(Pipeline.java:400)
	at org.apache.beam.sdk.Pipeline.applyTransform(Pipeline.java:323)
	at org.apache.beam.sdk.values.PCollection.apply(PCollection.java:167)
	at org.apache.beam.sdk.transforms.windowing.WindowingTest$WindowedCount.apply(WindowingTest.java:74)
	at org.apache.beam.sdk.transforms.windowing.WindowingTest$WindowedCount.apply(WindowingTest.java:56)
	at org.apache.beam.sdk.runners.PipelineRunner.apply(PipelineRunner.java:77)
	at org.apache.beam.runners.gearpump.GearpumpPipelineRunner.apply(GearpumpPipelineRunner.java:93)
	at org.apache.beam.runners.gearpump.TestGearpumpRunner.apply(TestGearpumpRunner.java:62)
	at org.apache.beam.sdk.Pipeline.applyInternal(Pipeline.java:400)
	at org.apache.beam.sdk.Pipeline.applyTransform(Pipeline.java:307)
	at org.apache.beam.sdk.values.PCollection.apply(PCollection.java:154)
	at org.apache.beam.sdk.transforms.windowing.WindowingTest.testMergingWindowing(WindowingTest.java:153)
	at sun.reflect.NativeMethodAccessorImpl.invoke0(Native Method)
	at sun.reflect.NativeMethodAccessorImpl.invoke(NativeMethodAccessorImpl.java:62)
	at sun.reflect.DelegatingMethodAccessorImpl.invoke(DelegatingMethodAccessorImpl.java:43)
	at java.lang.reflect.Method.invoke(Method.java:498)
	at org.junit.runners.model.FrameworkMethod$1.runReflectiveCall(FrameworkMethod.java:47)
	at org.junit.internal.runners.model.ReflectiveCallable.run(ReflectiveCallable.java:12)
	at org.junit.runners.model.FrameworkMethod.invokeExplosively(FrameworkMethod.java:44)
	at org.junit.internal.runners.statements.InvokeMethod.evaluate(InvokeMethod.java:17)
	at org.junit.rules.ExternalResource$1.evaluate(ExternalResource.java:48)
	at org.junit.rules.RunRules.evaluate(RunRules.java:20)
	at org.junit.runners.ParentRunner.runLeaf(ParentRunner.java:271)
	at org.junit.runners.BlockJUnit4ClassRunner.runChild(BlockJUnit4ClassRunner.java:70)
	at org.junit.runners.BlockJUnit4ClassRunner.runChild(BlockJUnit4ClassRunner.java:50)
	at org.junit.runners.ParentRunner$3.run(ParentRunner.java:238)
	at org.apache.maven.surefire.junitcore.pc.Scheduler$1.run(Scheduler.java:387)
	at java.util.concurrent.Executors$RunnableAdapter.call(Executors.java:511)
	at java.util.concurrent.FutureTask.run(FutureTask.java:266)
	at java.util.concurrent.ThreadPoolExecutor.runWorker(ThreadPoolExecutor.java:1142)
	at java.util.concurrent.ThreadPoolExecutor$Worker.run(ThreadPoolExecutor.java:617)
	at java.lang.Thread.run(Thread.java:745)


Results :

Failed tests: 
  PAssertTest.testContainsInAnyOrderFalse:371->runExpectingAssertionFailure:392 assertion
should have failed
Tests in error: 
  CountingInputTest.testBoundedInput:77 » IllegalState no translator registered ...
  CountingInputTest.testUnboundedInput:96 » IllegalState no translator registere...
  CountingInputTest.testUnboundedInputTimestamps:148 » IllegalState no translato...
  CountingSourceTest.testBoundedSource:90 » IllegalState no translator registere...
  CountingSourceTest.testBoundedSourceSplits:117 » IllegalState no translator re...
  CountingSourceTest.testUnboundedSource:157 » IllegalState no translator regist...
  CountingSourceTest.testUnboundedSourceSplits:244 » IllegalState no translator ...
  CountingSourceTest.testUnboundedSourceTimestamps:184 » IllegalState no transla...
  PAssertTest.testIsEqualTo:266 » IllegalState no translator registered for View...
  PAssertTest.testNotEqualTo:298 » IllegalState no translator registered for Vie...
  PAssertTest.testWindowedIsEqualTo:286 » IllegalState no translator registered ...
  ApproximateUniqueTest.testApproximateUniqueWithSmallInput:80 » IllegalState no...
  CombineFnsTest.testComposedCombine:175 » IllegalState no translator registered...
  CombineFnsTest.testComposedCombineWithContext:237 » IllegalState no translator...
  CombineTest.testAccumulatingCombine:491->runTestAccumulatingCombine:259 » IllegalState
  CombineTest.testAccumulatingCombineEmpty:498->runTestAccumulatingCombine:259 » IllegalState
  CombineTest.testBasicCombine:230->runTestBasicCombine:223 » IllegalState no tr...
  CombineTest.testBasicCombineEmpty:239->runTestBasicCombine:223 » IllegalState ...
  CombineTest.testCombineGloballyAsSingletonView:665 » IllegalState no translato...
  CombineTest.testFixedWindowsCombineWithContext:324 » IllegalState no translato...
  CombineTest.testGlobalCombineWithDefaultsAndTriggers:401 » IllegalState no tra...
  CombineTest.testSessionsCombine:413 » UnsupportedOperation merging window is n...
  CombineTest.testSessionsCombineWithContext:451 » UnsupportedOperation merging ...
  CombineTest.testSimpleCombine:177->runTestSimpleCombine:140 » IllegalState no ...
  CombineTest.testSimpleCombineEmpty:201->runTestSimpleCombine:140 » IllegalState
  CombineTest.testSimpleCombineWithContext:185->runTestSimpleCombineWithContext:170 »
IllegalState
  CombineTest.testSimpleCombineWithContextEmpty:194->runTestSimpleCombineWithContext:170
» IllegalState
  CombineTest.testSlidingWindowsCombineWithContext:367 » IllegalState no transla...
  CountTest.testCountGloballyBasic:97 » IllegalState no translator registered fo...
  CountTest.testCountGloballyEmpty:112 » IllegalState no translator registered f...
  FlattenTest.testEmptyFlattenAsSideInput:140 » IllegalState no translator regis...
  ParDoTest.testMultiOutputParDoWithSideInputs:710 » IllegalState no translator ...
  ParDoTest.testMultiOutputParDoWithSideInputsIsCumulative:748 » IllegalState no...
  ParDoTest.testParDoWithSideInputs:638 » IllegalState no translator registered ...
  ParDoTest.testParDoWithSideInputsIsCumulative:672 » IllegalState no translator...
  SampleTest.testPickAny:238->runPickAnyTest:232 » IllegalState no translator re...
  SampleTest.testPickAnyWhenEmpty:255->runPickAnyTest:232 » IllegalState no tran...
  SampleTest.testSample:117 » IllegalState no translator registered for View.Cre...
  SampleTest.testSampleEmpty:132 » IllegalState no translator registered for Vie...
  SampleTest.testSampleInsufficientElements:162 » IllegalState no translator reg...
  SampleTest.testSampleMultiplicity:187 » IllegalState no translator registered ...
  SampleTest.testSampleZero:147 » IllegalState no translator registered for View...
  ViewTest.testCombinedMapSideInput:1169 » IllegalState no translator registered...
  ViewTest.testEmptyIterableSideInput:424 » IllegalState no translator registere...
  ViewTest.testEmptyListSideInput:286 » IllegalState no translator registered fo...
  ViewTest.testEmptyMapSideInput:1030 » IllegalState no translator registered fo...
  ViewTest.testEmptyMapSideInputWithNonDeterministicKeyCoder:1059 » IllegalState
  ViewTest.testEmptyMultimapSideInput:717 » IllegalState no translator registere...
  ViewTest.testEmptyMultimapSideInputWithNonDeterministicKeyCoder:747 » IllegalState
  ViewTest.testIterableSideInput:358 » IllegalState no translator registered for...
  ViewTest.testIterableSideInputIsImmutable:456 » IllegalState no translator reg...
  ViewTest.testListSideInput:218 » IllegalState no translator registered for Vie...
  ViewTest.testListSideInputIsImmutable:332 » IllegalState no translator registe...
  ViewTest.testMapAsEntrySetSideInput:852 » IllegalState no translator registere...
  ViewTest.testMapSideInput:822 » IllegalState no translator registered for View...
  ViewTest.testMapSideInputIsImmutable:1142 » IllegalState no translator registe...
  ViewTest.testMapSideInputWithNonDeterministicKeyCoder:881 » IllegalState no tr...
  ViewTest.testMultimapAsEntrySetSideInput:516 » IllegalState no translator regi...
  ViewTest.testMultimapSideInput:484 » IllegalState no translator registered for...
  ViewTest.testMultimapSideInputIsImmutable:795 » IllegalState no translator reg...
  ViewTest.testMultimapSideInputWithNonDeterministicKeyCoder:566 » IllegalState ...
  ViewTest.testSideInputWithNestedIterables:1341 » IllegalState no translator re...
  ViewTest.testSideInputWithNullDefault:1296 » IllegalState no translator regist...
  ViewTest.testSingletonSideInput:109 » IllegalState no translator registered fo...
  ViewTest.testWindowedIterableSideInput:398 » IllegalState no translator regist...
  ViewTest.testWindowedListSideInput:259 » IllegalState no translator registered...
  ViewTest.testWindowedMapAsEntrySetSideInput:960 » IllegalState no translator r...
  ViewTest.testWindowedMapSideInput:919 » IllegalState no translator registered ...
  ViewTest.testWindowedMapSideInputWithNonDeterministicKeyCoder:1001 » IllegalState
  ViewTest.testWindowedMultimapAsEntrySetSideInput:648 » IllegalState no transla...
  ViewTest.testWindowedMultimapSideInput:605 » IllegalState no translator regist...
  ViewTest.testWindowedMultimapSideInputWithNonDeterministicKeyCoder:688 » IllegalState
  ViewTest.testWindowedSideInputFixedToFixed:1202 » IllegalState no translator r...
  ViewTest.testWindowedSideInputFixedToFixedWithDefault:1266 » IllegalState no t...
  ViewTest.testWindowedSideInputFixedToGlobal:1235 » IllegalState no translator ...
  ViewTest.testWindowedSingletonSideInput:140 » IllegalState no translator regis...
  CoGroupByKeyTest.testCoGroupByKey:309 » IllegalState no translator registered ...
  CoGroupByKeyTest.testCoGroupByKeyGetOnly:144 » IllegalState no translator regi...
  WindowingTest.testMergingWindowing:153 » UnsupportedOperation merging window i...
  ReshuffleTest.testReshuffleAfterSessionsAndGroupByKey:97 » UnsupportedOperation

Tests run: 181, Failures: 1, Errors: 80, Skipped: 3

[INFO] ------------------------------------------------------------------------
[INFO] Reactor Summary:
[INFO] 
[INFO] Apache Beam :: Parent .............................. SUCCESS [  7.227 s]
[INFO] Apache Beam :: SDKs ................................ SUCCESS [  0.485 s]
[INFO] Apache Beam :: SDKs :: Java ........................ SUCCESS [  0.528 s]
[INFO] Apache Beam :: SDKs :: Java :: Build Tools ......... SUCCESS [  2.312 s]
[INFO] Apache Beam :: SDKs :: Java :: Core ................ SUCCESS [02:54 min]
[INFO] Apache Beam :: Runners ............................. SUCCESS [  0.709 s]
[INFO] Apache Beam :: Runners :: Core Java ................ SUCCESS [ 38.970 s]
[INFO] Apache Beam :: Runners :: Gearpump ................. FAILURE [02:26 min]
[INFO] ------------------------------------------------------------------------
[INFO] BUILD FAILURE
[INFO] ------------------------------------------------------------------------
[INFO] Total time: 06:30 min
[INFO] Finished at: 2016-09-14T04:41:52+00:00
[INFO] Final Memory: 270M/1220M
[INFO] ------------------------------------------------------------------------
Waiting for Jenkins to finish collecting data
[ERROR] Failed to execute goal org.apache.maven.plugins:maven-surefire-plugin:2.18.1:test
(runnable-on-service-tests) on project beam-runners-gearpump: There are test failures.
[ERROR] 
[ERROR] Please refer to <https://builds.apache.org/job/beam_PostCommit_RunnableOnService_GearpumpLocal/ws/runners/gearpump/target/surefire-reports>
for the individual test results.
[ERROR] -> [Help 1]
org.apache.maven.lifecycle.LifecycleExecutionException: Failed to execute goal org.apache.maven.plugins:maven-surefire-plugin:2.18.1:test
(runnable-on-service-tests) on project beam-runners-gearpump: There are test failures.

Please refer to <https://builds.apache.org/job/beam_PostCommit_RunnableOnService_GearpumpLocal/ws/runners/gearpump/target/surefire-reports>
for the individual test results.
	at org.apache.maven.lifecycle.internal.MojoExecutor.execute(MojoExecutor.java:212)
	at org.apache.maven.lifecycle.internal.MojoExecutor.execute(MojoExecutor.java:153)
	at org.apache.maven.lifecycle.internal.MojoExecutor.execute(MojoExecutor.java:145)
	at org.apache.maven.lifecycle.internal.LifecycleModuleBuilder.buildProject(LifecycleModuleBuilder.java:116)
	at org.apache.maven.lifecycle.internal.LifecycleModuleBuilder.buildProject(LifecycleModuleBuilder.java:80)
	at org.apache.maven.lifecycle.internal.builder.singlethreaded.SingleThreadedBuilder.build(SingleThreadedBuilder.java:51)
	at org.apache.maven.lifecycle.internal.LifecycleStarter.execute(LifecycleStarter.java:128)
	at org.apache.maven.DefaultMaven.doExecute(DefaultMaven.java:307)
	at org.apache.maven.DefaultMaven.doExecute(DefaultMaven.java:193)
	at org.apache.maven.DefaultMaven.execute(DefaultMaven.java:106)
	at org.jvnet.hudson.maven3.launcher.Maven32Launcher.main(Maven32Launcher.java:132)
	at sun.reflect.NativeMethodAccessorImpl.invoke0(Native Method)
	at sun.reflect.NativeMethodAccessorImpl.invoke(NativeMethodAccessorImpl.java:62)
	at sun.reflect.DelegatingMethodAccessorImpl.invoke(DelegatingMethodAccessorImpl.java:43)
	at java.lang.reflect.Method.invoke(Method.java:498)
	at org.codehaus.plexus.classworlds.launcher.Launcher.launchStandard(Launcher.java:330)
	at org.codehaus.plexus.classworlds.launcher.Launcher.launch(Launcher.java:238)
	at jenkins.maven3.agent.Maven32Main.launch(Maven32Main.java:186)
	at sun.reflect.NativeMethodAccessorImpl.invoke0(Native Method)
	at sun.reflect.NativeMethodAccessorImpl.invoke(NativeMethodAccessorImpl.java:62)
	at sun.reflect.DelegatingMethodAccessorImpl.invoke(DelegatingMethodAccessorImpl.java:43)
	at java.lang.reflect.Method.invoke(Method.java:498)
	at hudson.maven.Maven3Builder.call(Maven3Builder.java:136)
	at hudson.maven.Maven3Builder.call(Maven3Builder.java:71)
	at hudson.remoting.UserRequest.perform(UserRequest.java:153)
	at hudson.remoting.UserRequest.perform(UserRequest.java:50)
	at hudson.remoting.Request$2.run(Request.java:332)
	at hudson.remoting.InterceptingExecutorService$1.call(InterceptingExecutorService.java:68)
	at java.util.concurrent.FutureTask.run(FutureTask.java:266)
	at java.util.concurrent.ThreadPoolExecutor.runWorker(ThreadPoolExecutor.java:1142)
	at java.util.concurrent.ThreadPoolExecutor$Worker.run(ThreadPoolExecutor.java:617)
	at java.lang.Thread.run(Thread.java:745)
Caused by: org.apache.maven.plugin.MojoFailureException: There are test failures.

Please refer to <https://builds.apache.org/job/beam_PostCommit_RunnableOnService_GearpumpLocal/ws/runners/gearpump/target/surefire-reports>
for the individual test results.
	at org.apache.maven.plugin.surefire.SurefireHelper.reportExecution(SurefireHelper.java:82)
	at org.apache.maven.plugin.surefire.SurefirePlugin.handleSummary(SurefirePlugin.java:254)
	at org.apache.maven.plugin.surefire.AbstractSurefireMojo.executeAfterPreconditionsChecked(AbstractSurefireMojo.java:854)
	at org.apache.maven.plugin.surefire.AbstractSurefireMojo.execute(AbstractSurefireMojo.java:722)
	at org.apache.maven.plugin.DefaultBuildPluginManager.executeMojo(DefaultBuildPluginManager.java:134)
	at org.apache.maven.lifecycle.internal.MojoExecutor.execute(MojoExecutor.java:208)
	... 31 more
[ERROR] 
[ERROR] Re-run Maven using the -X switch to enable full debug logging.
[ERROR] 
[ERROR] For more information about the errors and possible solutions, please read the following
articles:
[ERROR] [Help 1] http://cwiki.apache.org/confluence/display/MAVEN/MojoFailureException
[ERROR] 
[ERROR] After correcting the problems, you can resume the build with the command
[ERROR]   mvn <goals> -rf :beam-runners-gearpump
[JENKINS] Archiving <https://builds.apache.org/job/beam_PostCommit_RunnableOnService_GearpumpLocal/ws/sdks/java/build-tools/pom.xml>
to org.apache.beam/beam-sdks-java-build-tools/0.3.0-incubating-SNAPSHOT/beam-sdks-java-build-tools-0.3.0-incubating-SNAPSHOT.pom
[JENKINS] Archiving <https://builds.apache.org/job/beam_PostCommit_RunnableOnService_GearpumpLocal/ws/sdks/java/build-tools/target/beam-sdks-java-build-tools-0.3.0-incubating-SNAPSHOT.jar>
to org.apache.beam/beam-sdks-java-build-tools/0.3.0-incubating-SNAPSHOT/beam-sdks-java-build-tools-0.3.0-incubating-SNAPSHOT.jar
[JENKINS] Archiving <https://builds.apache.org/job/beam_PostCommit_RunnableOnService_GearpumpLocal/ws/sdks/java/build-tools/target/beam-sdks-java-build-tools-0.3.0-incubating-SNAPSHOT-tests.jar>
to org.apache.beam/beam-sdks-java-build-tools/0.3.0-incubating-SNAPSHOT/beam-sdks-java-build-tools-0.3.0-incubating-SNAPSHOT-tests.jar
[JENKINS] Archiving <https://builds.apache.org/job/beam_PostCommit_RunnableOnService_GearpumpLocal/ws/sdks/java/core/dependency-reduced-pom.xml>
to org.apache.beam/beam-sdks-java-core/0.3.0-incubating-SNAPSHOT/beam-sdks-java-core-0.3.0-incubating-SNAPSHOT.pom
[JENKINS] Archiving <https://builds.apache.org/job/beam_PostCommit_RunnableOnService_GearpumpLocal/ws/sdks/java/core/target/beam-sdks-java-core-0.3.0-incubating-SNAPSHOT.jar>
to org.apache.beam/beam-sdks-java-core/0.3.0-incubating-SNAPSHOT/beam-sdks-java-core-0.3.0-incubating-SNAPSHOT.jar
[JENKINS] Archiving <https://builds.apache.org/job/beam_PostCommit_RunnableOnService_GearpumpLocal/ws/sdks/java/core/target/beam-sdks-java-core-0.3.0-incubating-SNAPSHOT-tests.jar>
to org.apache.beam/beam-sdks-java-core/0.3.0-incubating-SNAPSHOT/beam-sdks-java-core-0.3.0-incubating-SNAPSHOT-tests.jar
[JENKINS] Archiving <https://builds.apache.org/job/beam_PostCommit_RunnableOnService_GearpumpLocal/ws/runners/core-java/dependency-reduced-pom.xml>
to org.apache.beam/beam-runners-core-java/0.3.0-incubating-SNAPSHOT/beam-runners-core-java-0.3.0-incubating-SNAPSHOT.pom
[JENKINS] Archiving <https://builds.apache.org/job/beam_PostCommit_RunnableOnService_GearpumpLocal/ws/runners/core-java/target/beam-runners-core-java-0.3.0-incubating-SNAPSHOT.jar>
to org.apache.beam/beam-runners-core-java/0.3.0-incubating-SNAPSHOT/beam-runners-core-java-0.3.0-incubating-SNAPSHOT.jar
[JENKINS] Archiving <https://builds.apache.org/job/beam_PostCommit_RunnableOnService_GearpumpLocal/ws/runners/core-java/target/beam-runners-core-java-0.3.0-incubating-SNAPSHOT-tests.jar>
to org.apache.beam/beam-runners-core-java/0.3.0-incubating-SNAPSHOT/beam-runners-core-java-0.3.0-incubating-SNAPSHOT-tests.jar
[JENKINS] Archiving <https://builds.apache.org/job/beam_PostCommit_RunnableOnService_GearpumpLocal/ws/runners/core-java/target/beam-runners-core-java-0.3.0-incubating-SNAPSHOT-javadoc.jar>
to org.apache.beam/beam-runners-core-java/0.3.0-incubating-SNAPSHOT/beam-runners-core-java-0.3.0-incubating-SNAPSHOT-javadoc.jar
[JENKINS] Archiving <https://builds.apache.org/job/beam_PostCommit_RunnableOnService_GearpumpLocal/ws/sdks/java/pom.xml>
to org.apache.beam/beam-sdks-java-parent/0.3.0-incubating-SNAPSHOT/beam-sdks-java-parent-0.3.0-incubating-SNAPSHOT.pom
[JENKINS] Archiving <https://builds.apache.org/job/beam_PostCommit_RunnableOnService_GearpumpLocal/ws/pom.xml>
to org.apache.beam/beam-parent/0.3.0-incubating-SNAPSHOT/beam-parent-0.3.0-incubating-SNAPSHOT.pom
Compressed 36.73 KB of artifacts by 87.1% relative to #148
[JENKINS] Archiving <https://builds.apache.org/job/beam_PostCommit_RunnableOnService_GearpumpLocal/ws/sdks/pom.xml>
to org.apache.beam/beam-sdks-parent/0.3.0-incubating-SNAPSHOT/beam-sdks-parent-0.3.0-incubating-SNAPSHOT.pom
[JENKINS] Archiving <https://builds.apache.org/job/beam_PostCommit_RunnableOnService_GearpumpLocal/ws/runners/pom.xml>
to org.apache.beam/beam-runners-parent/0.3.0-incubating-SNAPSHOT/beam-runners-parent-0.3.0-incubating-SNAPSHOT.pom
channel stopped

Mime
View raw message